directory-commits mailing list archives

Site index · List index
Message view « Date » · « Thread »
Top « Date » · « Thread »
From oer...@apache.org
Subject svn commit: r543239 [35/37] - in /directory/sandbox/oersoy/das.testing/das.ldap.parent: ./ das.ldap.configuration.model.ecore.v100/ das.ldap.configuration.model.ecore.v100/.settings/ das.ldap.configuration.model.ecore.v100/model/ das.ldap.configuration...
Date Thu, 31 May 2007 19:58:38 GMT
Added: directory/sandbox/oersoy/das.testing/das.ldap.parent/das.ldap/target/surefire-reports/org.apache.tuscany.das.ldap.schema.create.test.MComplexMayAttributeTypeCreatorTest.txt
URL: http://svn.apache.org/viewvc/directory/sandbox/oersoy/das.testing/das.ldap.parent/das.ldap/target/surefire-reports/org.apache.tuscany.das.ldap.schema.create.test.MComplexMayAttributeTypeCreatorTest.txt?view=auto&rev=543239
==============================================================================
--- directory/sandbox/oersoy/das.testing/das.ldap.parent/das.ldap/target/surefire-reports/org.apache.tuscany.das.ldap.schema.create.test.MComplexMayAttributeTypeCreatorTest.txt (added)
+++ directory/sandbox/oersoy/das.testing/das.ldap.parent/das.ldap/target/surefire-reports/org.apache.tuscany.das.ldap.schema.create.test.MComplexMayAttributeTypeCreatorTest.txt Thu May 31 12:58:13 2007
@@ -0,0 +1,202 @@
+-------------------------------------------------------------------------------
+Test set: org.apache.tuscany.das.ldap.schema.create.test.MComplexMayAttributeTypeCreatorTest
+-------------------------------------------------------------------------------
+Tests run: 6, Failures: 0, Errors: 6, Skipped: 0, Time elapsed: 0.152 sec <<< FAILURE!
+testCreate(org.apache.tuscany.das.ldap.schema.create.test.MComplexMayAttributeTypeCreatorTest)  Time elapsed: 0.008 sec  <<< ERROR!
+javax.naming.NameAlreadyBoundException: [LDAP: error code 68 - failed to add entry cn=das,ou=schema: 2.5.4.3=das,2.5.4.11=schema already exists!]; remaining name 'cn=das'
+	at com.sun.jndi.ldap.LdapCtx.mapErrorCode(LdapCtx.java:3000)
+	at com.sun.jndi.ldap.LdapCtx.processReturnCode(LdapCtx.java:2951)
+	at com.sun.jndi.ldap.LdapCtx.processReturnCode(LdapCtx.java:2758)
+	at com.sun.jndi.ldap.LdapCtx.c_createSubcontext(LdapCtx.java:774)
+	at com.sun.jndi.toolkit.ctx.ComponentDirContext.p_createSubcontext(ComponentDirContext.java:319)
+	at com.sun.jndi.toolkit.ctx.PartialCompositeDirContext.createSubcontext(PartialCompositeDirContext.java:248)
+	at com.sun.jndi.toolkit.ctx.PartialCompositeDirContext.createSubcontext(PartialCompositeDirContext.java:236)
+	at javax.naming.directory.InitialDirContext.createSubcontext(InitialDirContext.java:178)
+	at org.apache.tuscany.das.ldap.schema.setup.test.DASContextsSetupTest.createDasContext(DASContextsSetupTest.java:105)
+	at org.apache.tuscany.das.ldap.schema.setup.test.DASContextsSetupTest.setUp(DASContextsSetupTest.java:49)
+	at junit.framework.TestCase.runBare(TestCase.java:125)
+	at junit.framework.TestResult$1.protect(TestResult.java:106)
+	at junit.framework.TestResult.runProtected(TestResult.java:124)
+	at junit.framework.TestResult.run(TestResult.java:109)
+	at junit.framework.TestCase.run(TestCase.java:118)
+	at junit.framework.TestSuite.runTest(TestSuite.java:208)
+	at junit.framework.TestSuite.run(TestSuite.java:203)
+	at sun.reflect.GeneratedMethodAccessor8.invoke(Unknown Source)
+	at sun.reflect.DelegatingMethodAccessorImpl.invoke(DelegatingMethodAccessorImpl.java:25)
+	at java.lang.reflect.Method.invoke(Method.java:597)
+	at org.apache.maven.surefire.junit.JUnitTestSet.execute(JUnitTestSet.java:210)
+	at org.apache.maven.surefire.suite.AbstractDirectoryTestSuite.executeTestSet(AbstractDirectoryTestSuite.java:135)
+	at org.apache.maven.surefire.suite.AbstractDirectoryTestSuite.execute(AbstractDirectoryTestSuite.java:122)
+	at org.apache.maven.surefire.Surefire.run(Surefire.java:129)
+	at sun.reflect.NativeMethodAccessorImpl.invoke0(Native Method)
+	at sun.reflect.NativeMethodAccessorImpl.invoke(NativeMethodAccessorImpl.java:39)
+	at sun.reflect.DelegatingMethodAccessorImpl.invoke(DelegatingMethodAccessorImpl.java:25)
+	at java.lang.reflect.Method.invoke(Method.java:597)
+	at org.apache.maven.surefire.booter.SurefireBooter.runSuitesInProcess(SurefireBooter.java:225)
+	at org.apache.maven.surefire.booter.SurefireBooter.main(SurefireBooter.java:747)
+
+testConnect(org.apache.tuscany.das.ldap.schema.create.test.MComplexMayAttributeTypeCreatorTest)  Time elapsed: 0.007 sec  <<< ERROR!
+javax.naming.NameAlreadyBoundException: [LDAP: error code 68 - failed to add entry cn=das,ou=schema: 2.5.4.3=das,2.5.4.11=schema already exists!]; remaining name 'cn=das'
+	at com.sun.jndi.ldap.LdapCtx.mapErrorCode(LdapCtx.java:3000)
+	at com.sun.jndi.ldap.LdapCtx.processReturnCode(LdapCtx.java:2951)
+	at com.sun.jndi.ldap.LdapCtx.processReturnCode(LdapCtx.java:2758)
+	at com.sun.jndi.ldap.LdapCtx.c_createSubcontext(LdapCtx.java:774)
+	at com.sun.jndi.toolkit.ctx.ComponentDirContext.p_createSubcontext(ComponentDirContext.java:319)
+	at com.sun.jndi.toolkit.ctx.PartialCompositeDirContext.createSubcontext(PartialCompositeDirContext.java:248)
+	at com.sun.jndi.toolkit.ctx.PartialCompositeDirContext.createSubcontext(PartialCompositeDirContext.java:236)
+	at javax.naming.directory.InitialDirContext.createSubcontext(InitialDirContext.java:178)
+	at org.apache.tuscany.das.ldap.schema.setup.test.DASContextsSetupTest.createDasContext(DASContextsSetupTest.java:105)
+	at org.apache.tuscany.das.ldap.schema.setup.test.DASContextsSetupTest.setUp(DASContextsSetupTest.java:49)
+	at junit.framework.TestCase.runBare(TestCase.java:125)
+	at junit.framework.TestResult$1.protect(TestResult.java:106)
+	at junit.framework.TestResult.runProtected(TestResult.java:124)
+	at junit.framework.TestResult.run(TestResult.java:109)
+	at junit.framework.TestCase.run(TestCase.java:118)
+	at junit.framework.TestSuite.runTest(TestSuite.java:208)
+	at junit.framework.TestSuite.run(TestSuite.java:203)
+	at sun.reflect.GeneratedMethodAccessor8.invoke(Unknown Source)
+	at sun.reflect.DelegatingMethodAccessorImpl.invoke(DelegatingMethodAccessorImpl.java:25)
+	at java.lang.reflect.Method.invoke(Method.java:597)
+	at org.apache.maven.surefire.junit.JUnitTestSet.execute(JUnitTestSet.java:210)
+	at org.apache.maven.surefire.suite.AbstractDirectoryTestSuite.executeTestSet(AbstractDirectoryTestSuite.java:135)
+	at org.apache.maven.surefire.suite.AbstractDirectoryTestSuite.execute(AbstractDirectoryTestSuite.java:122)
+	at org.apache.maven.surefire.Surefire.run(Surefire.java:129)
+	at sun.reflect.NativeMethodAccessorImpl.invoke0(Native Method)
+	at sun.reflect.NativeMethodAccessorImpl.invoke(NativeMethodAccessorImpl.java:39)
+	at sun.reflect.DelegatingMethodAccessorImpl.invoke(DelegatingMethodAccessorImpl.java:25)
+	at java.lang.reflect.Method.invoke(Method.java:597)
+	at org.apache.maven.surefire.booter.SurefireBooter.runSuitesInProcess(SurefireBooter.java:225)
+	at org.apache.maven.surefire.booter.SurefireBooter.main(SurefireBooter.java:747)
+
+testCreateEcoreContext(org.apache.tuscany.das.ldap.schema.create.test.MComplexMayAttributeTypeCreatorTest)  Time elapsed: 0.005 sec  <<< ERROR!
+javax.naming.NameAlreadyBoundException: [LDAP: error code 68 - failed to add entry cn=das,ou=schema: 2.5.4.3=das,2.5.4.11=schema already exists!]; remaining name 'cn=das'
+	at com.sun.jndi.ldap.LdapCtx.mapErrorCode(LdapCtx.java:3000)
+	at com.sun.jndi.ldap.LdapCtx.processReturnCode(LdapCtx.java:2951)
+	at com.sun.jndi.ldap.LdapCtx.processReturnCode(LdapCtx.java:2758)
+	at com.sun.jndi.ldap.LdapCtx.c_createSubcontext(LdapCtx.java:774)
+	at com.sun.jndi.toolkit.ctx.ComponentDirContext.p_createSubcontext(ComponentDirContext.java:319)
+	at com.sun.jndi.toolkit.ctx.PartialCompositeDirContext.createSubcontext(PartialCompositeDirContext.java:248)
+	at com.sun.jndi.toolkit.ctx.PartialCompositeDirContext.createSubcontext(PartialCompositeDirContext.java:236)
+	at javax.naming.directory.InitialDirContext.createSubcontext(InitialDirContext.java:178)
+	at org.apache.tuscany.das.ldap.schema.setup.test.DASContextsSetupTest.createDasContext(DASContextsSetupTest.java:105)
+	at org.apache.tuscany.das.ldap.schema.setup.test.DASContextsSetupTest.setUp(DASContextsSetupTest.java:49)
+	at junit.framework.TestCase.runBare(TestCase.java:125)
+	at junit.framework.TestResult$1.protect(TestResult.java:106)
+	at junit.framework.TestResult.runProtected(TestResult.java:124)
+	at junit.framework.TestResult.run(TestResult.java:109)
+	at junit.framework.TestCase.run(TestCase.java:118)
+	at junit.framework.TestSuite.runTest(TestSuite.java:208)
+	at junit.framework.TestSuite.run(TestSuite.java:203)
+	at sun.reflect.GeneratedMethodAccessor8.invoke(Unknown Source)
+	at sun.reflect.DelegatingMethodAccessorImpl.invoke(DelegatingMethodAccessorImpl.java:25)
+	at java.lang.reflect.Method.invoke(Method.java:597)
+	at org.apache.maven.surefire.junit.JUnitTestSet.execute(JUnitTestSet.java:210)
+	at org.apache.maven.surefire.suite.AbstractDirectoryTestSuite.executeTestSet(AbstractDirectoryTestSuite.java:135)
+	at org.apache.maven.surefire.suite.AbstractDirectoryTestSuite.execute(AbstractDirectoryTestSuite.java:122)
+	at org.apache.maven.surefire.Surefire.run(Surefire.java:129)
+	at sun.reflect.NativeMethodAccessorImpl.invoke0(Native Method)
+	at sun.reflect.NativeMethodAccessorImpl.invoke(NativeMethodAccessorImpl.java:39)
+	at sun.reflect.DelegatingMethodAccessorImpl.invoke(DelegatingMethodAccessorImpl.java:25)
+	at java.lang.reflect.Method.invoke(Method.java:597)
+	at org.apache.maven.surefire.booter.SurefireBooter.runSuitesInProcess(SurefireBooter.java:225)
+	at org.apache.maven.surefire.booter.SurefireBooter.main(SurefireBooter.java:747)
+
+testCreateEcoreAttributeTypesContext(org.apache.tuscany.das.ldap.schema.create.test.MComplexMayAttributeTypeCreatorTest)  Time elapsed: 0.006 sec  <<< ERROR!
+javax.naming.NameAlreadyBoundException: [LDAP: error code 68 - failed to add entry cn=das,ou=schema: 2.5.4.3=das,2.5.4.11=schema already exists!]; remaining name 'cn=das'
+	at com.sun.jndi.ldap.LdapCtx.mapErrorCode(LdapCtx.java:3000)
+	at com.sun.jndi.ldap.LdapCtx.processReturnCode(LdapCtx.java:2951)
+	at com.sun.jndi.ldap.LdapCtx.processReturnCode(LdapCtx.java:2758)
+	at com.sun.jndi.ldap.LdapCtx.c_createSubcontext(LdapCtx.java:774)
+	at com.sun.jndi.toolkit.ctx.ComponentDirContext.p_createSubcontext(ComponentDirContext.java:319)
+	at com.sun.jndi.toolkit.ctx.PartialCompositeDirContext.createSubcontext(PartialCompositeDirContext.java:248)
+	at com.sun.jndi.toolkit.ctx.PartialCompositeDirContext.createSubcontext(PartialCompositeDirContext.java:236)
+	at javax.naming.directory.InitialDirContext.createSubcontext(InitialDirContext.java:178)
+	at org.apache.tuscany.das.ldap.schema.setup.test.DASContextsSetupTest.createDasContext(DASContextsSetupTest.java:105)
+	at org.apache.tuscany.das.ldap.schema.setup.test.DASContextsSetupTest.setUp(DASContextsSetupTest.java:49)
+	at junit.framework.TestCase.runBare(TestCase.java:125)
+	at junit.framework.TestResult$1.protect(TestResult.java:106)
+	at junit.framework.TestResult.runProtected(TestResult.java:124)
+	at junit.framework.TestResult.run(TestResult.java:109)
+	at junit.framework.TestCase.run(TestCase.java:118)
+	at junit.framework.TestSuite.runTest(TestSuite.java:208)
+	at junit.framework.TestSuite.run(TestSuite.java:203)
+	at sun.reflect.GeneratedMethodAccessor8.invoke(Unknown Source)
+	at sun.reflect.DelegatingMethodAccessorImpl.invoke(DelegatingMethodAccessorImpl.java:25)
+	at java.lang.reflect.Method.invoke(Method.java:597)
+	at org.apache.maven.surefire.junit.JUnitTestSet.execute(JUnitTestSet.java:210)
+	at org.apache.maven.surefire.suite.AbstractDirectoryTestSuite.executeTestSet(AbstractDirectoryTestSuite.java:135)
+	at org.apache.maven.surefire.suite.AbstractDirectoryTestSuite.execute(AbstractDirectoryTestSuite.java:122)
+	at org.apache.maven.surefire.Surefire.run(Surefire.java:129)
+	at sun.reflect.NativeMethodAccessorImpl.invoke0(Native Method)
+	at sun.reflect.NativeMethodAccessorImpl.invoke(NativeMethodAccessorImpl.java:39)
+	at sun.reflect.DelegatingMethodAccessorImpl.invoke(DelegatingMethodAccessorImpl.java:25)
+	at java.lang.reflect.Method.invoke(Method.java:597)
+	at org.apache.maven.surefire.booter.SurefireBooter.runSuitesInProcess(SurefireBooter.java:225)
+	at org.apache.maven.surefire.booter.SurefireBooter.main(SurefireBooter.java:747)
+
+testCreateDasSyntaxesContext(org.apache.tuscany.das.ldap.schema.create.test.MComplexMayAttributeTypeCreatorTest)  Time elapsed: 0.006 sec  <<< ERROR!
+javax.naming.NameAlreadyBoundException: [LDAP: error code 68 - failed to add entry cn=das,ou=schema: 2.5.4.3=das,2.5.4.11=schema already exists!]; remaining name 'cn=das'
+	at com.sun.jndi.ldap.LdapCtx.mapErrorCode(LdapCtx.java:3000)
+	at com.sun.jndi.ldap.LdapCtx.processReturnCode(LdapCtx.java:2951)
+	at com.sun.jndi.ldap.LdapCtx.processReturnCode(LdapCtx.java:2758)
+	at com.sun.jndi.ldap.LdapCtx.c_createSubcontext(LdapCtx.java:774)
+	at com.sun.jndi.toolkit.ctx.ComponentDirContext.p_createSubcontext(ComponentDirContext.java:319)
+	at com.sun.jndi.toolkit.ctx.PartialCompositeDirContext.createSubcontext(PartialCompositeDirContext.java:248)
+	at com.sun.jndi.toolkit.ctx.PartialCompositeDirContext.createSubcontext(PartialCompositeDirContext.java:236)
+	at javax.naming.directory.InitialDirContext.createSubcontext(InitialDirContext.java:178)
+	at org.apache.tuscany.das.ldap.schema.setup.test.DASContextsSetupTest.createDasContext(DASContextsSetupTest.java:105)
+	at org.apache.tuscany.das.ldap.schema.setup.test.DASContextsSetupTest.setUp(DASContextsSetupTest.java:49)
+	at junit.framework.TestCase.runBare(TestCase.java:125)
+	at junit.framework.TestResult$1.protect(TestResult.java:106)
+	at junit.framework.TestResult.runProtected(TestResult.java:124)
+	at junit.framework.TestResult.run(TestResult.java:109)
+	at junit.framework.TestCase.run(TestCase.java:118)
+	at junit.framework.TestSuite.runTest(TestSuite.java:208)
+	at junit.framework.TestSuite.run(TestSuite.java:203)
+	at sun.reflect.GeneratedMethodAccessor8.invoke(Unknown Source)
+	at sun.reflect.DelegatingMethodAccessorImpl.invoke(DelegatingMethodAccessorImpl.java:25)
+	at java.lang.reflect.Method.invoke(Method.java:597)
+	at org.apache.maven.surefire.junit.JUnitTestSet.execute(JUnitTestSet.java:210)
+	at org.apache.maven.surefire.suite.AbstractDirectoryTestSuite.executeTestSet(AbstractDirectoryTestSuite.java:135)
+	at org.apache.maven.surefire.suite.AbstractDirectoryTestSuite.execute(AbstractDirectoryTestSuite.java:122)
+	at org.apache.maven.surefire.Surefire.run(Surefire.java:129)
+	at sun.reflect.NativeMethodAccessorImpl.invoke0(Native Method)
+	at sun.reflect.NativeMethodAccessorImpl.invoke(NativeMethodAccessorImpl.java:39)
+	at sun.reflect.DelegatingMethodAccessorImpl.invoke(DelegatingMethodAccessorImpl.java:25)
+	at java.lang.reflect.Method.invoke(Method.java:597)
+	at org.apache.maven.surefire.booter.SurefireBooter.runSuitesInProcess(SurefireBooter.java:225)
+	at org.apache.maven.surefire.booter.SurefireBooter.main(SurefireBooter.java:747)
+
+testCreateDasObjectClassesContext(org.apache.tuscany.das.ldap.schema.create.test.MComplexMayAttributeTypeCreatorTest)  Time elapsed: 0.006 sec  <<< ERROR!
+javax.naming.NameAlreadyBoundException: [LDAP: error code 68 - failed to add entry cn=das,ou=schema: 2.5.4.3=das,2.5.4.11=schema already exists!]; remaining name 'cn=das'
+	at com.sun.jndi.ldap.LdapCtx.mapErrorCode(LdapCtx.java:3000)
+	at com.sun.jndi.ldap.LdapCtx.processReturnCode(LdapCtx.java:2951)
+	at com.sun.jndi.ldap.LdapCtx.processReturnCode(LdapCtx.java:2758)
+	at com.sun.jndi.ldap.LdapCtx.c_createSubcontext(LdapCtx.java:774)
+	at com.sun.jndi.toolkit.ctx.ComponentDirContext.p_createSubcontext(ComponentDirContext.java:319)
+	at com.sun.jndi.toolkit.ctx.PartialCompositeDirContext.createSubcontext(PartialCompositeDirContext.java:248)
+	at com.sun.jndi.toolkit.ctx.PartialCompositeDirContext.createSubcontext(PartialCompositeDirContext.java:236)
+	at javax.naming.directory.InitialDirContext.createSubcontext(InitialDirContext.java:178)
+	at org.apache.tuscany.das.ldap.schema.setup.test.DASContextsSetupTest.createDasContext(DASContextsSetupTest.java:105)
+	at org.apache.tuscany.das.ldap.schema.setup.test.DASContextsSetupTest.setUp(DASContextsSetupTest.java:49)
+	at junit.framework.TestCase.runBare(TestCase.java:125)
+	at junit.framework.TestResult$1.protect(TestResult.java:106)
+	at junit.framework.TestResult.runProtected(TestResult.java:124)
+	at junit.framework.TestResult.run(TestResult.java:109)
+	at junit.framework.TestCase.run(TestCase.java:118)
+	at junit.framework.TestSuite.runTest(TestSuite.java:208)
+	at junit.framework.TestSuite.run(TestSuite.java:203)
+	at sun.reflect.GeneratedMethodAccessor8.invoke(Unknown Source)
+	at sun.reflect.DelegatingMethodAccessorImpl.invoke(DelegatingMethodAccessorImpl.java:25)
+	at java.lang.reflect.Method.invoke(Method.java:597)
+	at org.apache.maven.surefire.junit.JUnitTestSet.execute(JUnitTestSet.java:210)
+	at org.apache.maven.surefire.suite.AbstractDirectoryTestSuite.executeTestSet(AbstractDirectoryTestSuite.java:135)
+	at org.apache.maven.surefire.suite.AbstractDirectoryTestSuite.execute(AbstractDirectoryTestSuite.java:122)
+	at org.apache.maven.surefire.Surefire.run(Surefire.java:129)
+	at sun.reflect.NativeMethodAccessorImpl.invoke0(Native Method)
+	at sun.reflect.NativeMethodAccessorImpl.invoke(NativeMethodAccessorImpl.java:39)
+	at sun.reflect.DelegatingMethodAccessorImpl.invoke(DelegatingMethodAccessorImpl.java:25)
+	at java.lang.reflect.Method.invoke(Method.java:597)
+	at org.apache.maven.surefire.booter.SurefireBooter.runSuitesInProcess(SurefireBooter.java:225)
+	at org.apache.maven.surefire.booter.SurefireBooter.main(SurefireBooter.java:747)
+

Added: directory/sandbox/oersoy/das.testing/das.ldap.parent/das.ldap/target/surefire-reports/org.apache.tuscany.das.ldap.schema.create.test.MComplexMustAttributeTypeCreatorTest.txt
URL: http://svn.apache.org/viewvc/directory/sandbox/oersoy/das.testing/das.ldap.parent/das.ldap/target/surefire-reports/org.apache.tuscany.das.ldap.schema.create.test.MComplexMustAttributeTypeCreatorTest.txt?view=auto&rev=543239
==============================================================================
--- directory/sandbox/oersoy/das.testing/das.ldap.parent/das.ldap/target/surefire-reports/org.apache.tuscany.das.ldap.schema.create.test.MComplexMustAttributeTypeCreatorTest.txt (added)
+++ directory/sandbox/oersoy/das.testing/das.ldap.parent/das.ldap/target/surefire-reports/org.apache.tuscany.das.ldap.schema.create.test.MComplexMustAttributeTypeCreatorTest.txt Thu May 31 12:58:13 2007
@@ -0,0 +1,208 @@
+-------------------------------------------------------------------------------
+Test set: org.apache.tuscany.das.ldap.schema.create.test.MComplexMustAttributeTypeCreatorTest
+-------------------------------------------------------------------------------
+Tests run: 6, Failures: 0, Errors: 6, Skipped: 0, Time elapsed: 0.198 sec <<< FAILURE!
+testCreate(org.apache.tuscany.das.ldap.schema.create.test.MComplexMustAttributeTypeCreatorTest)  Time elapsed: 0.007 sec  <<< ERROR!
+javax.naming.NameAlreadyBoundException: [LDAP: error code 68 - failed to add entry cn=das,ou=schema: 2.5.4.3=das,2.5.4.11=schema already exists!]; remaining name 'cn=das'
+	at com.sun.jndi.ldap.LdapCtx.mapErrorCode(LdapCtx.java:3000)
+	at com.sun.jndi.ldap.LdapCtx.processReturnCode(LdapCtx.java:2951)
+	at com.sun.jndi.ldap.LdapCtx.processReturnCode(LdapCtx.java:2758)
+	at com.sun.jndi.ldap.LdapCtx.c_createSubcontext(LdapCtx.java:774)
+	at com.sun.jndi.toolkit.ctx.ComponentDirContext.p_createSubcontext(ComponentDirContext.java:319)
+	at com.sun.jndi.toolkit.ctx.PartialCompositeDirContext.createSubcontext(PartialCompositeDirContext.java:248)
+	at com.sun.jndi.toolkit.ctx.PartialCompositeDirContext.createSubcontext(PartialCompositeDirContext.java:236)
+	at javax.naming.directory.InitialDirContext.createSubcontext(InitialDirContext.java:178)
+	at org.apache.tuscany.das.ldap.schema.setup.test.DASContextsSetupTest.createDasContext(DASContextsSetupTest.java:105)
+	at org.apache.tuscany.das.ldap.schema.setup.test.DASContextsSetupTest.setUp(DASContextsSetupTest.java:49)
+	at junit.framework.TestCase.runBare(TestCase.java:125)
+	at junit.framework.TestResult$1.protect(TestResult.java:106)
+	at junit.framework.TestResult.runProtected(TestResult.java:124)
+	at junit.framework.TestResult.run(TestResult.java:109)
+	at junit.framework.TestCase.run(TestCase.java:118)
+	at junit.framework.TestSuite.runTest(TestSuite.java:208)
+	at junit.framework.TestSuite.run(TestSuite.java:203)
+	at sun.reflect.NativeMethodAccessorImpl.invoke0(Native Method)
+	at sun.reflect.NativeMethodAccessorImpl.invoke(NativeMethodAccessorImpl.java:39)
+	at sun.reflect.DelegatingMethodAccessorImpl.invoke(DelegatingMethodAccessorImpl.java:25)
+	at java.lang.reflect.Method.invoke(Method.java:597)
+	at org.apache.maven.surefire.junit.JUnitTestSet.execute(JUnitTestSet.java:210)
+	at org.apache.maven.surefire.suite.AbstractDirectoryTestSuite.executeTestSet(AbstractDirectoryTestSuite.java:135)
+	at org.apache.maven.surefire.suite.AbstractDirectoryTestSuite.execute(AbstractDirectoryTestSuite.java:122)
+	at org.apache.maven.surefire.Surefire.run(Surefire.java:129)
+	at sun.reflect.NativeMethodAccessorImpl.invoke0(Native Method)
+	at sun.reflect.NativeMethodAccessorImpl.invoke(NativeMethodAccessorImpl.java:39)
+	at sun.reflect.DelegatingMethodAccessorImpl.invoke(DelegatingMethodAccessorImpl.java:25)
+	at java.lang.reflect.Method.invoke(Method.java:597)
+	at org.apache.maven.surefire.booter.SurefireBooter.runSuitesInProcess(SurefireBooter.java:225)
+	at org.apache.maven.surefire.booter.SurefireBooter.main(SurefireBooter.java:747)
+
+testConnect(org.apache.tuscany.das.ldap.schema.create.test.MComplexMustAttributeTypeCreatorTest)  Time elapsed: 0.143 sec  <<< ERROR!
+javax.naming.NameAlreadyBoundException: [LDAP: error code 68 - failed to add entry cn=das,ou=schema: 2.5.4.3=das,2.5.4.11=schema already exists!]; remaining name 'cn=das'
+	at com.sun.jndi.ldap.LdapCtx.mapErrorCode(LdapCtx.java:3000)
+	at com.sun.jndi.ldap.LdapCtx.processReturnCode(LdapCtx.java:2951)
+	at com.sun.jndi.ldap.LdapCtx.processReturnCode(LdapCtx.java:2758)
+	at com.sun.jndi.ldap.LdapCtx.c_createSubcontext(LdapCtx.java:774)
+	at com.sun.jndi.toolkit.ctx.ComponentDirContext.p_createSubcontext(ComponentDirContext.java:319)
+	at com.sun.jndi.toolkit.ctx.PartialCompositeDirContext.createSubcontext(PartialCompositeDirContext.java:248)
+	at com.sun.jndi.toolkit.ctx.PartialCompositeDirContext.createSubcontext(PartialCompositeDirContext.java:236)
+	at javax.naming.directory.InitialDirContext.createSubcontext(InitialDirContext.java:178)
+	at org.apache.tuscany.das.ldap.schema.setup.test.DASContextsSetupTest.createDasContext(DASContextsSetupTest.java:105)
+	at org.apache.tuscany.das.ldap.schema.setup.test.DASContextsSetupTest.setUp(DASContextsSetupTest.java:49)
+	at junit.framework.TestCase.runBare(TestCase.java:125)
+	at junit.framework.TestResult$1.protect(TestResult.java:106)
+	at junit.framework.TestResult.runProtected(TestResult.java:124)
+	at junit.framework.TestResult.run(TestResult.java:109)
+	at junit.framework.TestCase.run(TestCase.java:118)
+	at junit.framework.TestSuite.runTest(TestSuite.java:208)
+	at junit.framework.TestSuite.run(TestSuite.java:203)
+	at sun.reflect.NativeMethodAccessorImpl.invoke0(Native Method)
+	at sun.reflect.NativeMethodAccessorImpl.invoke(NativeMethodAccessorImpl.java:39)
+	at sun.reflect.DelegatingMethodAccessorImpl.invoke(DelegatingMethodAccessorImpl.java:25)
+	at java.lang.reflect.Method.invoke(Method.java:597)
+	at org.apache.maven.surefire.junit.JUnitTestSet.execute(JUnitTestSet.java:210)
+	at org.apache.maven.surefire.suite.AbstractDirectoryTestSuite.executeTestSet(AbstractDirectoryTestSuite.java:135)
+	at org.apache.maven.surefire.suite.AbstractDirectoryTestSuite.execute(AbstractDirectoryTestSuite.java:122)
+	at org.apache.maven.surefire.Surefire.run(Surefire.java:129)
+	at sun.reflect.NativeMethodAccessorImpl.invoke0(Native Method)
+	at sun.reflect.NativeMethodAccessorImpl.invoke(NativeMethodAccessorImpl.java:39)
+	at sun.reflect.DelegatingMethodAccessorImpl.invoke(DelegatingMethodAccessorImpl.java:25)
+	at java.lang.reflect.Method.invoke(Method.java:597)
+	at org.apache.maven.surefire.booter.SurefireBooter.runSuitesInProcess(SurefireBooter.java:225)
+	at org.apache.maven.surefire.booter.SurefireBooter.main(SurefireBooter.java:747)
+
+testCreateEcoreContext(org.apache.tuscany.das.ldap.schema.create.test.MComplexMustAttributeTypeCreatorTest)  Time elapsed: 0.005 sec  <<< ERROR!
+javax.naming.NameAlreadyBoundException: [LDAP: error code 68 - failed to add entry cn=das,ou=schema: 2.5.4.3=das,2.5.4.11=schema already exists!]; remaining name 'cn=das'
+	at com.sun.jndi.ldap.LdapCtx.mapErrorCode(LdapCtx.java:3000)
+	at com.sun.jndi.ldap.LdapCtx.processReturnCode(LdapCtx.java:2951)
+	at com.sun.jndi.ldap.LdapCtx.processReturnCode(LdapCtx.java:2758)
+	at com.sun.jndi.ldap.LdapCtx.c_createSubcontext(LdapCtx.java:774)
+	at com.sun.jndi.toolkit.ctx.ComponentDirContext.p_createSubcontext(ComponentDirContext.java:319)
+	at com.sun.jndi.toolkit.ctx.PartialCompositeDirContext.createSubcontext(PartialCompositeDirContext.java:248)
+	at com.sun.jndi.toolkit.ctx.PartialCompositeDirContext.createSubcontext(PartialCompositeDirContext.java:236)
+	at javax.naming.directory.InitialDirContext.createSubcontext(InitialDirContext.java:178)
+	at org.apache.tuscany.das.ldap.schema.setup.test.DASContextsSetupTest.createDasContext(DASContextsSetupTest.java:105)
+	at org.apache.tuscany.das.ldap.schema.setup.test.DASContextsSetupTest.setUp(DASContextsSetupTest.java:49)
+	at junit.framework.TestCase.runBare(TestCase.java:125)
+	at junit.framework.TestResult$1.protect(TestResult.java:106)
+	at junit.framework.TestResult.runProtected(TestResult.java:124)
+	at junit.framework.TestResult.run(TestResult.java:109)
+	at junit.framework.TestCase.run(TestCase.java:118)
+	at junit.framework.TestSuite.runTest(TestSuite.java:208)
+	at junit.framework.TestSuite.run(TestSuite.java:203)
+	at sun.reflect.NativeMethodAccessorImpl.invoke0(Native Method)
+	at sun.reflect.NativeMethodAccessorImpl.invoke(NativeMethodAccessorImpl.java:39)
+	at sun.reflect.DelegatingMethodAccessorImpl.invoke(DelegatingMethodAccessorImpl.java:25)
+	at java.lang.reflect.Method.invoke(Method.java:597)
+	at org.apache.maven.surefire.junit.JUnitTestSet.execute(JUnitTestSet.java:210)
+	at org.apache.maven.surefire.suite.AbstractDirectoryTestSuite.executeTestSet(AbstractDirectoryTestSuite.java:135)
+	at org.apache.maven.surefire.suite.AbstractDirectoryTestSuite.execute(AbstractDirectoryTestSuite.java:122)
+	at org.apache.maven.surefire.Surefire.run(Surefire.java:129)
+	at sun.reflect.NativeMethodAccessorImpl.invoke0(Native Method)
+	at sun.reflect.NativeMethodAccessorImpl.invoke(NativeMethodAccessorImpl.java:39)
+	at sun.reflect.DelegatingMethodAccessorImpl.invoke(DelegatingMethodAccessorImpl.java:25)
+	at java.lang.reflect.Method.invoke(Method.java:597)
+	at org.apache.maven.surefire.booter.SurefireBooter.runSuitesInProcess(SurefireBooter.java:225)
+	at org.apache.maven.surefire.booter.SurefireBooter.main(SurefireBooter.java:747)
+
+testCreateEcoreAttributeTypesContext(org.apache.tuscany.das.ldap.schema.create.test.MComplexMustAttributeTypeCreatorTest)  Time elapsed: 0.006 sec  <<< ERROR!
+javax.naming.NameAlreadyBoundException: [LDAP: error code 68 - failed to add entry cn=das,ou=schema: 2.5.4.3=das,2.5.4.11=schema already exists!]; remaining name 'cn=das'
+	at com.sun.jndi.ldap.LdapCtx.mapErrorCode(LdapCtx.java:3000)
+	at com.sun.jndi.ldap.LdapCtx.processReturnCode(LdapCtx.java:2951)
+	at com.sun.jndi.ldap.LdapCtx.processReturnCode(LdapCtx.java:2758)
+	at com.sun.jndi.ldap.LdapCtx.c_createSubcontext(LdapCtx.java:774)
+	at com.sun.jndi.toolkit.ctx.ComponentDirContext.p_createSubcontext(ComponentDirContext.java:319)
+	at com.sun.jndi.toolkit.ctx.PartialCompositeDirContext.createSubcontext(PartialCompositeDirContext.java:248)
+	at com.sun.jndi.toolkit.ctx.PartialCompositeDirContext.createSubcontext(PartialCompositeDirContext.java:236)
+	at javax.naming.directory.InitialDirContext.createSubcontext(InitialDirContext.java:178)
+	at org.apache.tuscany.das.ldap.schema.setup.test.DASContextsSetupTest.createDasContext(DASContextsSetupTest.java:105)
+	at org.apache.tuscany.das.ldap.schema.setup.test.DASContextsSetupTest.setUp(DASContextsSetupTest.java:49)
+	at junit.framework.TestCase.runBare(TestCase.java:125)
+	at junit.framework.TestResult$1.protect(TestResult.java:106)
+	at junit.framework.TestResult.runProtected(TestResult.java:124)
+	at junit.framework.TestResult.run(TestResult.java:109)
+	at junit.framework.TestCase.run(TestCase.java:118)
+	at junit.framework.TestSuite.runTest(TestSuite.java:208)
+	at junit.framework.TestSuite.run(TestSuite.java:203)
+	at sun.reflect.NativeMethodAccessorImpl.invoke0(Native Method)
+	at sun.reflect.NativeMethodAccessorImpl.invoke(NativeMethodAccessorImpl.java:39)
+	at sun.reflect.DelegatingMethodAccessorImpl.invoke(DelegatingMethodAccessorImpl.java:25)
+	at java.lang.reflect.Method.invoke(Method.java:597)
+	at org.apache.maven.surefire.junit.JUnitTestSet.execute(JUnitTestSet.java:210)
+	at org.apache.maven.surefire.suite.AbstractDirectoryTestSuite.executeTestSet(AbstractDirectoryTestSuite.java:135)
+	at org.apache.maven.surefire.suite.AbstractDirectoryTestSuite.execute(AbstractDirectoryTestSuite.java:122)
+	at org.apache.maven.surefire.Surefire.run(Surefire.java:129)
+	at sun.reflect.NativeMethodAccessorImpl.invoke0(Native Method)
+	at sun.reflect.NativeMethodAccessorImpl.invoke(NativeMethodAccessorImpl.java:39)
+	at sun.reflect.DelegatingMethodAccessorImpl.invoke(DelegatingMethodAccessorImpl.java:25)
+	at java.lang.reflect.Method.invoke(Method.java:597)
+	at org.apache.maven.surefire.booter.SurefireBooter.runSuitesInProcess(SurefireBooter.java:225)
+	at org.apache.maven.surefire.booter.SurefireBooter.main(SurefireBooter.java:747)
+
+testCreateDasSyntaxesContext(org.apache.tuscany.das.ldap.schema.create.test.MComplexMustAttributeTypeCreatorTest)  Time elapsed: 0.005 sec  <<< ERROR!
+javax.naming.NameAlreadyBoundException: [LDAP: error code 68 - failed to add entry cn=das,ou=schema: 2.5.4.3=das,2.5.4.11=schema already exists!]; remaining name 'cn=das'
+	at com.sun.jndi.ldap.LdapCtx.mapErrorCode(LdapCtx.java:3000)
+	at com.sun.jndi.ldap.LdapCtx.processReturnCode(LdapCtx.java:2951)
+	at com.sun.jndi.ldap.LdapCtx.processReturnCode(LdapCtx.java:2758)
+	at com.sun.jndi.ldap.LdapCtx.c_createSubcontext(LdapCtx.java:774)
+	at com.sun.jndi.toolkit.ctx.ComponentDirContext.p_createSubcontext(ComponentDirContext.java:319)
+	at com.sun.jndi.toolkit.ctx.PartialCompositeDirContext.createSubcontext(PartialCompositeDirContext.java:248)
+	at com.sun.jndi.toolkit.ctx.PartialCompositeDirContext.createSubcontext(PartialCompositeDirContext.java:236)
+	at javax.naming.directory.InitialDirContext.createSubcontext(InitialDirContext.java:178)
+	at org.apache.tuscany.das.ldap.schema.setup.test.DASContextsSetupTest.createDasContext(DASContextsSetupTest.java:105)
+	at org.apache.tuscany.das.ldap.schema.setup.test.DASContextsSetupTest.setUp(DASContextsSetupTest.java:49)
+	at junit.framework.TestCase.runBare(TestCase.java:125)
+	at junit.framework.TestResult$1.protect(TestResult.java:106)
+	at junit.framework.TestResult.runProtected(TestResult.java:124)
+	at junit.framework.TestResult.run(TestResult.java:109)
+	at junit.framework.TestCase.run(TestCase.java:118)
+	at junit.framework.TestSuite.runTest(TestSuite.java:208)
+	at junit.framework.TestSuite.run(TestSuite.java:203)
+	at sun.reflect.NativeMethodAccessorImpl.invoke0(Native Method)
+	at sun.reflect.NativeMethodAccessorImpl.invoke(NativeMethodAccessorImpl.java:39)
+	at sun.reflect.DelegatingMethodAccessorImpl.invoke(DelegatingMethodAccessorImpl.java:25)
+	at java.lang.reflect.Method.invoke(Method.java:597)
+	at org.apache.maven.surefire.junit.JUnitTestSet.execute(JUnitTestSet.java:210)
+	at org.apache.maven.surefire.suite.AbstractDirectoryTestSuite.executeTestSet(AbstractDirectoryTestSuite.java:135)
+	at org.apache.maven.surefire.suite.AbstractDirectoryTestSuite.execute(AbstractDirectoryTestSuite.java:122)
+	at org.apache.maven.surefire.Surefire.run(Surefire.java:129)
+	at sun.reflect.NativeMethodAccessorImpl.invoke0(Native Method)
+	at sun.reflect.NativeMethodAccessorImpl.invoke(NativeMethodAccessorImpl.java:39)
+	at sun.reflect.DelegatingMethodAccessorImpl.invoke(DelegatingMethodAccessorImpl.java:25)
+	at java.lang.reflect.Method.invoke(Method.java:597)
+	at org.apache.maven.surefire.booter.SurefireBooter.runSuitesInProcess(SurefireBooter.java:225)
+	at org.apache.maven.surefire.booter.SurefireBooter.main(SurefireBooter.java:747)
+
+testCreateDasObjectClassesContext(org.apache.tuscany.das.ldap.schema.create.test.MComplexMustAttributeTypeCreatorTest)  Time elapsed: 0.007 sec  <<< ERROR!
+javax.naming.NameAlreadyBoundException: [LDAP: error code 68 - failed to add entry cn=das,ou=schema: 2.5.4.3=das,2.5.4.11=schema already exists!]; remaining name 'cn=das'
+	at com.sun.jndi.ldap.LdapCtx.mapErrorCode(LdapCtx.java:3000)
+	at com.sun.jndi.ldap.LdapCtx.processReturnCode(LdapCtx.java:2951)
+	at com.sun.jndi.ldap.LdapCtx.processReturnCode(LdapCtx.java:2758)
+	at com.sun.jndi.ldap.LdapCtx.c_createSubcontext(LdapCtx.java:774)
+	at com.sun.jndi.toolkit.ctx.ComponentDirContext.p_createSubcontext(ComponentDirContext.java:319)
+	at com.sun.jndi.toolkit.ctx.PartialCompositeDirContext.createSubcontext(PartialCompositeDirContext.java:248)
+	at com.sun.jndi.toolkit.ctx.PartialCompositeDirContext.createSubcontext(PartialCompositeDirContext.java:236)
+	at javax.naming.directory.InitialDirContext.createSubcontext(InitialDirContext.java:178)
+	at org.apache.tuscany.das.ldap.schema.setup.test.DASContextsSetupTest.createDasContext(DASContextsSetupTest.java:105)
+	at org.apache.tuscany.das.ldap.schema.setup.test.DASContextsSetupTest.setUp(DASContextsSetupTest.java:49)
+	at junit.framework.TestCase.runBare(TestCase.java:125)
+	at junit.framework.TestResult$1.protect(TestResult.java:106)
+	at junit.framework.TestResult.runProtected(TestResult.java:124)
+	at junit.framework.TestResult.run(TestResult.java:109)
+	at junit.framework.TestCase.run(TestCase.java:118)
+	at junit.framework.TestSuite.runTest(TestSuite.java:208)
+	at junit.framework.TestSuite.run(TestSuite.java:203)
+	at sun.reflect.NativeMethodAccessorImpl.invoke0(Native Method)
+	at sun.reflect.NativeMethodAccessorImpl.invoke(NativeMethodAccessorImpl.java:39)
+	at sun.reflect.DelegatingMethodAccessorImpl.invoke(DelegatingMethodAccessorImpl.java:25)
+	at java.lang.reflect.Method.invoke(Method.java:597)
+	at org.apache.maven.surefire.junit.JUnitTestSet.execute(JUnitTestSet.java:210)
+	at org.apache.maven.surefire.suite.AbstractDirectoryTestSuite.executeTestSet(AbstractDirectoryTestSuite.java:135)
+	at org.apache.maven.surefire.suite.AbstractDirectoryTestSuite.execute(AbstractDirectoryTestSuite.java:122)
+	at org.apache.maven.surefire.Surefire.run(Surefire.java:129)
+	at sun.reflect.NativeMethodAccessorImpl.invoke0(Native Method)
+	at sun.reflect.NativeMethodAccessorImpl.invoke(NativeMethodAccessorImpl.java:39)
+	at sun.reflect.DelegatingMethodAccessorImpl.invoke(DelegatingMethodAccessorImpl.java:25)
+	at java.lang.reflect.Method.invoke(Method.java:597)
+	at org.apache.maven.surefire.booter.SurefireBooter.runSuitesInProcess(SurefireBooter.java:225)
+	at org.apache.maven.surefire.booter.SurefireBooter.main(SurefireBooter.java:747)
+

Added: directory/sandbox/oersoy/das.testing/das.ldap.parent/das.ldap/target/surefire-reports/org.apache.tuscany.das.ldap.schema.create.test.MetaTopSDOObjectClassCreatorTest.txt
URL: http://svn.apache.org/viewvc/directory/sandbox/oersoy/das.testing/das.ldap.parent/das.ldap/target/surefire-reports/org.apache.tuscany.das.ldap.schema.create.test.MetaTopSDOObjectClassCreatorTest.txt?view=auto&rev=543239
==============================================================================
--- directory/sandbox/oersoy/das.testing/das.ldap.parent/das.ldap/target/surefire-reports/org.apache.tuscany.das.ldap.schema.create.test.MetaTopSDOObjectClassCreatorTest.txt (added)
+++ directory/sandbox/oersoy/das.testing/das.ldap.parent/das.ldap/target/surefire-reports/org.apache.tuscany.das.ldap.schema.create.test.MetaTopSDOObjectClassCreatorTest.txt Thu May 31 12:58:13 2007
@@ -0,0 +1,208 @@
+-------------------------------------------------------------------------------
+Test set: org.apache.tuscany.das.ldap.schema.create.test.MetaTopSDOObjectClassCreatorTest
+-------------------------------------------------------------------------------
+Tests run: 6, Failures: 0, Errors: 6, Skipped: 0, Time elapsed: 0.195 sec <<< FAILURE!
+testCreate(org.apache.tuscany.das.ldap.schema.create.test.MetaTopSDOObjectClassCreatorTest)  Time elapsed: 0.008 sec  <<< ERROR!
+javax.naming.NameAlreadyBoundException: [LDAP: error code 68 - failed to add entry cn=das,ou=schema: 2.5.4.3=das,2.5.4.11=schema already exists!]; remaining name 'cn=das'
+	at com.sun.jndi.ldap.LdapCtx.mapErrorCode(LdapCtx.java:3000)
+	at com.sun.jndi.ldap.LdapCtx.processReturnCode(LdapCtx.java:2951)
+	at com.sun.jndi.ldap.LdapCtx.processReturnCode(LdapCtx.java:2758)
+	at com.sun.jndi.ldap.LdapCtx.c_createSubcontext(LdapCtx.java:774)
+	at com.sun.jndi.toolkit.ctx.ComponentDirContext.p_createSubcontext(ComponentDirContext.java:319)
+	at com.sun.jndi.toolkit.ctx.PartialCompositeDirContext.createSubcontext(PartialCompositeDirContext.java:248)
+	at com.sun.jndi.toolkit.ctx.PartialCompositeDirContext.createSubcontext(PartialCompositeDirContext.java:236)
+	at javax.naming.directory.InitialDirContext.createSubcontext(InitialDirContext.java:178)
+	at org.apache.tuscany.das.ldap.schema.setup.test.DASContextsSetupTest.createDasContext(DASContextsSetupTest.java:105)
+	at org.apache.tuscany.das.ldap.schema.setup.test.DASContextsSetupTest.setUp(DASContextsSetupTest.java:49)
+	at junit.framework.TestCase.runBare(TestCase.java:125)
+	at junit.framework.TestResult$1.protect(TestResult.java:106)
+	at junit.framework.TestResult.runProtected(TestResult.java:124)
+	at junit.framework.TestResult.run(TestResult.java:109)
+	at junit.framework.TestCase.run(TestCase.java:118)
+	at junit.framework.TestSuite.runTest(TestSuite.java:208)
+	at junit.framework.TestSuite.run(TestSuite.java:203)
+	at sun.reflect.NativeMethodAccessorImpl.invoke0(Native Method)
+	at sun.reflect.NativeMethodAccessorImpl.invoke(NativeMethodAccessorImpl.java:39)
+	at sun.reflect.DelegatingMethodAccessorImpl.invoke(DelegatingMethodAccessorImpl.java:25)
+	at java.lang.reflect.Method.invoke(Method.java:597)
+	at org.apache.maven.surefire.junit.JUnitTestSet.execute(JUnitTestSet.java:210)
+	at org.apache.maven.surefire.suite.AbstractDirectoryTestSuite.executeTestSet(AbstractDirectoryTestSuite.java:135)
+	at org.apache.maven.surefire.suite.AbstractDirectoryTestSuite.execute(AbstractDirectoryTestSuite.java:122)
+	at org.apache.maven.surefire.Surefire.run(Surefire.java:129)
+	at sun.reflect.NativeMethodAccessorImpl.invoke0(Native Method)
+	at sun.reflect.NativeMethodAccessorImpl.invoke(NativeMethodAccessorImpl.java:39)
+	at sun.reflect.DelegatingMethodAccessorImpl.invoke(DelegatingMethodAccessorImpl.java:25)
+	at java.lang.reflect.Method.invoke(Method.java:597)
+	at org.apache.maven.surefire.booter.SurefireBooter.runSuitesInProcess(SurefireBooter.java:225)
+	at org.apache.maven.surefire.booter.SurefireBooter.main(SurefireBooter.java:747)
+
+testConnect(org.apache.tuscany.das.ldap.schema.create.test.MetaTopSDOObjectClassCreatorTest)  Time elapsed: 0.139 sec  <<< ERROR!
+javax.naming.NameAlreadyBoundException: [LDAP: error code 68 - failed to add entry cn=das,ou=schema: 2.5.4.3=das,2.5.4.11=schema already exists!]; remaining name 'cn=das'
+	at com.sun.jndi.ldap.LdapCtx.mapErrorCode(LdapCtx.java:3000)
+	at com.sun.jndi.ldap.LdapCtx.processReturnCode(LdapCtx.java:2951)
+	at com.sun.jndi.ldap.LdapCtx.processReturnCode(LdapCtx.java:2758)
+	at com.sun.jndi.ldap.LdapCtx.c_createSubcontext(LdapCtx.java:774)
+	at com.sun.jndi.toolkit.ctx.ComponentDirContext.p_createSubcontext(ComponentDirContext.java:319)
+	at com.sun.jndi.toolkit.ctx.PartialCompositeDirContext.createSubcontext(PartialCompositeDirContext.java:248)
+	at com.sun.jndi.toolkit.ctx.PartialCompositeDirContext.createSubcontext(PartialCompositeDirContext.java:236)
+	at javax.naming.directory.InitialDirContext.createSubcontext(InitialDirContext.java:178)
+	at org.apache.tuscany.das.ldap.schema.setup.test.DASContextsSetupTest.createDasContext(DASContextsSetupTest.java:105)
+	at org.apache.tuscany.das.ldap.schema.setup.test.DASContextsSetupTest.setUp(DASContextsSetupTest.java:49)
+	at junit.framework.TestCase.runBare(TestCase.java:125)
+	at junit.framework.TestResult$1.protect(TestResult.java:106)
+	at junit.framework.TestResult.runProtected(TestResult.java:124)
+	at junit.framework.TestResult.run(TestResult.java:109)
+	at junit.framework.TestCase.run(TestCase.java:118)
+	at junit.framework.TestSuite.runTest(TestSuite.java:208)
+	at junit.framework.TestSuite.run(TestSuite.java:203)
+	at sun.reflect.NativeMethodAccessorImpl.invoke0(Native Method)
+	at sun.reflect.NativeMethodAccessorImpl.invoke(NativeMethodAccessorImpl.java:39)
+	at sun.reflect.DelegatingMethodAccessorImpl.invoke(DelegatingMethodAccessorImpl.java:25)
+	at java.lang.reflect.Method.invoke(Method.java:597)
+	at org.apache.maven.surefire.junit.JUnitTestSet.execute(JUnitTestSet.java:210)
+	at org.apache.maven.surefire.suite.AbstractDirectoryTestSuite.executeTestSet(AbstractDirectoryTestSuite.java:135)
+	at org.apache.maven.surefire.suite.AbstractDirectoryTestSuite.execute(AbstractDirectoryTestSuite.java:122)
+	at org.apache.maven.surefire.Surefire.run(Surefire.java:129)
+	at sun.reflect.NativeMethodAccessorImpl.invoke0(Native Method)
+	at sun.reflect.NativeMethodAccessorImpl.invoke(NativeMethodAccessorImpl.java:39)
+	at sun.reflect.DelegatingMethodAccessorImpl.invoke(DelegatingMethodAccessorImpl.java:25)
+	at java.lang.reflect.Method.invoke(Method.java:597)
+	at org.apache.maven.surefire.booter.SurefireBooter.runSuitesInProcess(SurefireBooter.java:225)
+	at org.apache.maven.surefire.booter.SurefireBooter.main(SurefireBooter.java:747)
+
+testCreateEcoreContext(org.apache.tuscany.das.ldap.schema.create.test.MetaTopSDOObjectClassCreatorTest)  Time elapsed: 0.006 sec  <<< ERROR!
+javax.naming.NameAlreadyBoundException: [LDAP: error code 68 - failed to add entry cn=das,ou=schema: 2.5.4.3=das,2.5.4.11=schema already exists!]; remaining name 'cn=das'
+	at com.sun.jndi.ldap.LdapCtx.mapErrorCode(LdapCtx.java:3000)
+	at com.sun.jndi.ldap.LdapCtx.processReturnCode(LdapCtx.java:2951)
+	at com.sun.jndi.ldap.LdapCtx.processReturnCode(LdapCtx.java:2758)
+	at com.sun.jndi.ldap.LdapCtx.c_createSubcontext(LdapCtx.java:774)
+	at com.sun.jndi.toolkit.ctx.ComponentDirContext.p_createSubcontext(ComponentDirContext.java:319)
+	at com.sun.jndi.toolkit.ctx.PartialCompositeDirContext.createSubcontext(PartialCompositeDirContext.java:248)
+	at com.sun.jndi.toolkit.ctx.PartialCompositeDirContext.createSubcontext(PartialCompositeDirContext.java:236)
+	at javax.naming.directory.InitialDirContext.createSubcontext(InitialDirContext.java:178)
+	at org.apache.tuscany.das.ldap.schema.setup.test.DASContextsSetupTest.createDasContext(DASContextsSetupTest.java:105)
+	at org.apache.tuscany.das.ldap.schema.setup.test.DASContextsSetupTest.setUp(DASContextsSetupTest.java:49)
+	at junit.framework.TestCase.runBare(TestCase.java:125)
+	at junit.framework.TestResult$1.protect(TestResult.java:106)
+	at junit.framework.TestResult.runProtected(TestResult.java:124)
+	at junit.framework.TestResult.run(TestResult.java:109)
+	at junit.framework.TestCase.run(TestCase.java:118)
+	at junit.framework.TestSuite.runTest(TestSuite.java:208)
+	at junit.framework.TestSuite.run(TestSuite.java:203)
+	at sun.reflect.NativeMethodAccessorImpl.invoke0(Native Method)
+	at sun.reflect.NativeMethodAccessorImpl.invoke(NativeMethodAccessorImpl.java:39)
+	at sun.reflect.DelegatingMethodAccessorImpl.invoke(DelegatingMethodAccessorImpl.java:25)
+	at java.lang.reflect.Method.invoke(Method.java:597)
+	at org.apache.maven.surefire.junit.JUnitTestSet.execute(JUnitTestSet.java:210)
+	at org.apache.maven.surefire.suite.AbstractDirectoryTestSuite.executeTestSet(AbstractDirectoryTestSuite.java:135)
+	at org.apache.maven.surefire.suite.AbstractDirectoryTestSuite.execute(AbstractDirectoryTestSuite.java:122)
+	at org.apache.maven.surefire.Surefire.run(Surefire.java:129)
+	at sun.reflect.NativeMethodAccessorImpl.invoke0(Native Method)
+	at sun.reflect.NativeMethodAccessorImpl.invoke(NativeMethodAccessorImpl.java:39)
+	at sun.reflect.DelegatingMethodAccessorImpl.invoke(DelegatingMethodAccessorImpl.java:25)
+	at java.lang.reflect.Method.invoke(Method.java:597)
+	at org.apache.maven.surefire.booter.SurefireBooter.runSuitesInProcess(SurefireBooter.java:225)
+	at org.apache.maven.surefire.booter.SurefireBooter.main(SurefireBooter.java:747)
+
+testCreateEcoreAttributeTypesContext(org.apache.tuscany.das.ldap.schema.create.test.MetaTopSDOObjectClassCreatorTest)  Time elapsed: 0.008 sec  <<< ERROR!
+javax.naming.NameAlreadyBoundException: [LDAP: error code 68 - failed to add entry cn=das,ou=schema: 2.5.4.3=das,2.5.4.11=schema already exists!]; remaining name 'cn=das'
+	at com.sun.jndi.ldap.LdapCtx.mapErrorCode(LdapCtx.java:3000)
+	at com.sun.jndi.ldap.LdapCtx.processReturnCode(LdapCtx.java:2951)
+	at com.sun.jndi.ldap.LdapCtx.processReturnCode(LdapCtx.java:2758)
+	at com.sun.jndi.ldap.LdapCtx.c_createSubcontext(LdapCtx.java:774)
+	at com.sun.jndi.toolkit.ctx.ComponentDirContext.p_createSubcontext(ComponentDirContext.java:319)
+	at com.sun.jndi.toolkit.ctx.PartialCompositeDirContext.createSubcontext(PartialCompositeDirContext.java:248)
+	at com.sun.jndi.toolkit.ctx.PartialCompositeDirContext.createSubcontext(PartialCompositeDirContext.java:236)
+	at javax.naming.directory.InitialDirContext.createSubcontext(InitialDirContext.java:178)
+	at org.apache.tuscany.das.ldap.schema.setup.test.DASContextsSetupTest.createDasContext(DASContextsSetupTest.java:105)
+	at org.apache.tuscany.das.ldap.schema.setup.test.DASContextsSetupTest.setUp(DASContextsSetupTest.java:49)
+	at junit.framework.TestCase.runBare(TestCase.java:125)
+	at junit.framework.TestResult$1.protect(TestResult.java:106)
+	at junit.framework.TestResult.runProtected(TestResult.java:124)
+	at junit.framework.TestResult.run(TestResult.java:109)
+	at junit.framework.TestCase.run(TestCase.java:118)
+	at junit.framework.TestSuite.runTest(TestSuite.java:208)
+	at junit.framework.TestSuite.run(TestSuite.java:203)
+	at sun.reflect.NativeMethodAccessorImpl.invoke0(Native Method)
+	at sun.reflect.NativeMethodAccessorImpl.invoke(NativeMethodAccessorImpl.java:39)
+	at sun.reflect.DelegatingMethodAccessorImpl.invoke(DelegatingMethodAccessorImpl.java:25)
+	at java.lang.reflect.Method.invoke(Method.java:597)
+	at org.apache.maven.surefire.junit.JUnitTestSet.execute(JUnitTestSet.java:210)
+	at org.apache.maven.surefire.suite.AbstractDirectoryTestSuite.executeTestSet(AbstractDirectoryTestSuite.java:135)
+	at org.apache.maven.surefire.suite.AbstractDirectoryTestSuite.execute(AbstractDirectoryTestSuite.java:122)
+	at org.apache.maven.surefire.Surefire.run(Surefire.java:129)
+	at sun.reflect.NativeMethodAccessorImpl.invoke0(Native Method)
+	at sun.reflect.NativeMethodAccessorImpl.invoke(NativeMethodAccessorImpl.java:39)
+	at sun.reflect.DelegatingMethodAccessorImpl.invoke(DelegatingMethodAccessorImpl.java:25)
+	at java.lang.reflect.Method.invoke(Method.java:597)
+	at org.apache.maven.surefire.booter.SurefireBooter.runSuitesInProcess(SurefireBooter.java:225)
+	at org.apache.maven.surefire.booter.SurefireBooter.main(SurefireBooter.java:747)
+
+testCreateDasSyntaxesContext(org.apache.tuscany.das.ldap.schema.create.test.MetaTopSDOObjectClassCreatorTest)  Time elapsed: 0.006 sec  <<< ERROR!
+javax.naming.NameAlreadyBoundException: [LDAP: error code 68 - failed to add entry cn=das,ou=schema: 2.5.4.3=das,2.5.4.11=schema already exists!]; remaining name 'cn=das'
+	at com.sun.jndi.ldap.LdapCtx.mapErrorCode(LdapCtx.java:3000)
+	at com.sun.jndi.ldap.LdapCtx.processReturnCode(LdapCtx.java:2951)
+	at com.sun.jndi.ldap.LdapCtx.processReturnCode(LdapCtx.java:2758)
+	at com.sun.jndi.ldap.LdapCtx.c_createSubcontext(LdapCtx.java:774)
+	at com.sun.jndi.toolkit.ctx.ComponentDirContext.p_createSubcontext(ComponentDirContext.java:319)
+	at com.sun.jndi.toolkit.ctx.PartialCompositeDirContext.createSubcontext(PartialCompositeDirContext.java:248)
+	at com.sun.jndi.toolkit.ctx.PartialCompositeDirContext.createSubcontext(PartialCompositeDirContext.java:236)
+	at javax.naming.directory.InitialDirContext.createSubcontext(InitialDirContext.java:178)
+	at org.apache.tuscany.das.ldap.schema.setup.test.DASContextsSetupTest.createDasContext(DASContextsSetupTest.java:105)
+	at org.apache.tuscany.das.ldap.schema.setup.test.DASContextsSetupTest.setUp(DASContextsSetupTest.java:49)
+	at junit.framework.TestCase.runBare(TestCase.java:125)
+	at junit.framework.TestResult$1.protect(TestResult.java:106)
+	at junit.framework.TestResult.runProtected(TestResult.java:124)
+	at junit.framework.TestResult.run(TestResult.java:109)
+	at junit.framework.TestCase.run(TestCase.java:118)
+	at junit.framework.TestSuite.runTest(TestSuite.java:208)
+	at junit.framework.TestSuite.run(TestSuite.java:203)
+	at sun.reflect.NativeMethodAccessorImpl.invoke0(Native Method)
+	at sun.reflect.NativeMethodAccessorImpl.invoke(NativeMethodAccessorImpl.java:39)
+	at sun.reflect.DelegatingMethodAccessorImpl.invoke(DelegatingMethodAccessorImpl.java:25)
+	at java.lang.reflect.Method.invoke(Method.java:597)
+	at org.apache.maven.surefire.junit.JUnitTestSet.execute(JUnitTestSet.java:210)
+	at org.apache.maven.surefire.suite.AbstractDirectoryTestSuite.executeTestSet(AbstractDirectoryTestSuite.java:135)
+	at org.apache.maven.surefire.suite.AbstractDirectoryTestSuite.execute(AbstractDirectoryTestSuite.java:122)
+	at org.apache.maven.surefire.Surefire.run(Surefire.java:129)
+	at sun.reflect.NativeMethodAccessorImpl.invoke0(Native Method)
+	at sun.reflect.NativeMethodAccessorImpl.invoke(NativeMethodAccessorImpl.java:39)
+	at sun.reflect.DelegatingMethodAccessorImpl.invoke(DelegatingMethodAccessorImpl.java:25)
+	at java.lang.reflect.Method.invoke(Method.java:597)
+	at org.apache.maven.surefire.booter.SurefireBooter.runSuitesInProcess(SurefireBooter.java:225)
+	at org.apache.maven.surefire.booter.SurefireBooter.main(SurefireBooter.java:747)
+
+testCreateDasObjectClassesContext(org.apache.tuscany.das.ldap.schema.create.test.MetaTopSDOObjectClassCreatorTest)  Time elapsed: 0.006 sec  <<< ERROR!
+javax.naming.NameAlreadyBoundException: [LDAP: error code 68 - failed to add entry cn=das,ou=schema: 2.5.4.3=das,2.5.4.11=schema already exists!]; remaining name 'cn=das'
+	at com.sun.jndi.ldap.LdapCtx.mapErrorCode(LdapCtx.java:3000)
+	at com.sun.jndi.ldap.LdapCtx.processReturnCode(LdapCtx.java:2951)
+	at com.sun.jndi.ldap.LdapCtx.processReturnCode(LdapCtx.java:2758)
+	at com.sun.jndi.ldap.LdapCtx.c_createSubcontext(LdapCtx.java:774)
+	at com.sun.jndi.toolkit.ctx.ComponentDirContext.p_createSubcontext(ComponentDirContext.java:319)
+	at com.sun.jndi.toolkit.ctx.PartialCompositeDirContext.createSubcontext(PartialCompositeDirContext.java:248)
+	at com.sun.jndi.toolkit.ctx.PartialCompositeDirContext.createSubcontext(PartialCompositeDirContext.java:236)
+	at javax.naming.directory.InitialDirContext.createSubcontext(InitialDirContext.java:178)
+	at org.apache.tuscany.das.ldap.schema.setup.test.DASContextsSetupTest.createDasContext(DASContextsSetupTest.java:105)
+	at org.apache.tuscany.das.ldap.schema.setup.test.DASContextsSetupTest.setUp(DASContextsSetupTest.java:49)
+	at junit.framework.TestCase.runBare(TestCase.java:125)
+	at junit.framework.TestResult$1.protect(TestResult.java:106)
+	at junit.framework.TestResult.runProtected(TestResult.java:124)
+	at junit.framework.TestResult.run(TestResult.java:109)
+	at junit.framework.TestCase.run(TestCase.java:118)
+	at junit.framework.TestSuite.runTest(TestSuite.java:208)
+	at junit.framework.TestSuite.run(TestSuite.java:203)
+	at sun.reflect.NativeMethodAccessorImpl.invoke0(Native Method)
+	at sun.reflect.NativeMethodAccessorImpl.invoke(NativeMethodAccessorImpl.java:39)
+	at sun.reflect.DelegatingMethodAccessorImpl.invoke(DelegatingMethodAccessorImpl.java:25)
+	at java.lang.reflect.Method.invoke(Method.java:597)
+	at org.apache.maven.surefire.junit.JUnitTestSet.execute(JUnitTestSet.java:210)
+	at org.apache.maven.surefire.suite.AbstractDirectoryTestSuite.executeTestSet(AbstractDirectoryTestSuite.java:135)
+	at org.apache.maven.surefire.suite.AbstractDirectoryTestSuite.execute(AbstractDirectoryTestSuite.java:122)
+	at org.apache.maven.surefire.Surefire.run(Surefire.java:129)
+	at sun.reflect.NativeMethodAccessorImpl.invoke0(Native Method)
+	at sun.reflect.NativeMethodAccessorImpl.invoke(NativeMethodAccessorImpl.java:39)
+	at sun.reflect.DelegatingMethodAccessorImpl.invoke(DelegatingMethodAccessorImpl.java:25)
+	at java.lang.reflect.Method.invoke(Method.java:597)
+	at org.apache.maven.surefire.booter.SurefireBooter.runSuitesInProcess(SurefireBooter.java:225)
+	at org.apache.maven.surefire.booter.SurefireBooter.main(SurefireBooter.java:747)
+

Added: directory/sandbox/oersoy/das.testing/das.ldap.parent/das.ldap/target/surefire-reports/org.apache.tuscany.das.ldap.schema.emf.create.test.EAttributeTypeCreatorTest.txt
URL: http://svn.apache.org/viewvc/directory/sandbox/oersoy/das.testing/das.ldap.parent/das.ldap/target/surefire-reports/org.apache.tuscany.das.ldap.schema.emf.create.test.EAttributeTypeCreatorTest.txt?view=auto&rev=543239
==============================================================================
--- directory/sandbox/oersoy/das.testing/das.ldap.parent/das.ldap/target/surefire-reports/org.apache.tuscany.das.ldap.schema.emf.create.test.EAttributeTypeCreatorTest.txt (added)
+++ directory/sandbox/oersoy/das.testing/das.ldap.parent/das.ldap/target/surefire-reports/org.apache.tuscany.das.ldap.schema.emf.create.test.EAttributeTypeCreatorTest.txt Thu May 31 12:58:13 2007
@@ -0,0 +1,15 @@
+-------------------------------------------------------------------------------
+Test set: org.apache.tuscany.das.ldap.schema.emf.create.test.EAttributeTypeCreatorTest
+-------------------------------------------------------------------------------
+Tests run: 5, Failures: 0, Errors: 1, Skipped: 0, Time elapsed: 8.661 sec <<< FAILURE!
+testCreate(org.apache.tuscany.das.ldap.schema.emf.create.test.EAttributeTypeCreatorTest)  Time elapsed: 2.333 sec  <<< ERROR!
+javax.naming.NameNotFoundException: [LDAP: error code 32 - failed on search operation: Attempt to search under non-existant entry: 1.3.6.1.4.1.18060.0.4.0.2.1=1.3.6.1.4.1.18060.4.55575455.7514910.5651561.2519999.4525349.0256525.9810154.65210052.00,2.5.4.11=attributetypes,2.5.4.3=ecore,2.5.4.11=schema]; remaining name 'm-oid=1.3.6.1.4.1.18060.4.55575455.7514910.5651561.2519999.4525349.0256525.9810154.65210052.00'
+	at com.sun.jndi.ldap.LdapCtx.mapErrorCode(LdapCtx.java:3030)
+	at com.sun.jndi.ldap.LdapCtx.processReturnCode(LdapCtx.java:2951)
+	at com.sun.jndi.ldap.LdapCtx.processReturnCode(LdapCtx.java:2758)
+	at com.sun.jndi.ldap.LdapCtx.c_lookup(LdapCtx.java:997)
+	at com.sun.jndi.toolkit.ctx.ComponentContext.p_lookup(ComponentContext.java:526)
+	at com.sun.jndi.toolkit.ctx.PartialCompositeContext.lookup(PartialCompositeContext.java:159)
+	at com.sun.jndi.toolkit.ctx.PartialCompositeContext.lookup(PartialCompositeContext.java:148)
+	at org.apache.tuscany.das.ldap.schema.emf.create.test.EAttributeTypeCreatorTest.testCreate(EAttributeTypeCreatorTest.java:113)
+

Added: directory/sandbox/oersoy/das.testing/das.ldap.parent/das.ldap/target/surefire-reports/org.apache.tuscany.das.ldap.schema.emf.create.test.EcoreTypeSystemCreatorTest.txt
URL: http://svn.apache.org/viewvc/directory/sandbox/oersoy/das.testing/das.ldap.parent/das.ldap/target/surefire-reports/org.apache.tuscany.das.ldap.schema.emf.create.test.EcoreTypeSystemCreatorTest.txt?view=auto&rev=543239
==============================================================================
--- directory/sandbox/oersoy/das.testing/das.ldap.parent/das.ldap/target/surefire-reports/org.apache.tuscany.das.ldap.schema.emf.create.test.EcoreTypeSystemCreatorTest.txt (added)
+++ directory/sandbox/oersoy/das.testing/das.ldap.parent/das.ldap/target/surefire-reports/org.apache.tuscany.das.ldap.schema.emf.create.test.EcoreTypeSystemCreatorTest.txt Thu May 31 12:58:13 2007
@@ -0,0 +1,4 @@
+-------------------------------------------------------------------------------
+Test set: org.apache.tuscany.das.ldap.schema.emf.create.test.EcoreTypeSystemCreatorTest
+-------------------------------------------------------------------------------
+Tests run: 5, Failures: 0, Errors: 0, Skipped: 0, Time elapsed: 2.234 sec

Added: directory/sandbox/oersoy/das.testing/das.ldap.parent/das.ldap/target/surefire-reports/org.apache.tuscany.das.ldap.schema.emf.destroy.test.EcoreTypeSystemDestroyerTest.txt
URL: http://svn.apache.org/viewvc/directory/sandbox/oersoy/das.testing/das.ldap.parent/das.ldap/target/surefire-reports/org.apache.tuscany.das.ldap.schema.emf.destroy.test.EcoreTypeSystemDestroyerTest.txt?view=auto&rev=543239
==============================================================================
--- directory/sandbox/oersoy/das.testing/das.ldap.parent/das.ldap/target/surefire-reports/org.apache.tuscany.das.ldap.schema.emf.destroy.test.EcoreTypeSystemDestroyerTest.txt (added)
+++ directory/sandbox/oersoy/das.testing/das.ldap.parent/das.ldap/target/surefire-reports/org.apache.tuscany.das.ldap.schema.emf.destroy.test.EcoreTypeSystemDestroyerTest.txt Thu May 31 12:58:13 2007
@@ -0,0 +1,4 @@
+-------------------------------------------------------------------------------
+Test set: org.apache.tuscany.das.ldap.schema.emf.destroy.test.EcoreTypeSystemDestroyerTest
+-------------------------------------------------------------------------------
+Tests run: 5, Failures: 0, Errors: 0, Skipped: 0, Time elapsed: 1.884 sec

Added: directory/sandbox/oersoy/das.testing/das.ldap.parent/das.ldap/target/surefire-reports/org.apache.tuscany.das.ldap.schema.setup.test.DASContextsSetupTest.txt
URL: http://svn.apache.org/viewvc/directory/sandbox/oersoy/das.testing/das.ldap.parent/das.ldap/target/surefire-reports/org.apache.tuscany.das.ldap.schema.setup.test.DASContextsSetupTest.txt?view=auto&rev=543239
==============================================================================
--- directory/sandbox/oersoy/das.testing/das.ldap.parent/das.ldap/target/surefire-reports/org.apache.tuscany.das.ldap.schema.setup.test.DASContextsSetupTest.txt (added)
+++ directory/sandbox/oersoy/das.testing/das.ldap.parent/das.ldap/target/surefire-reports/org.apache.tuscany.das.ldap.schema.setup.test.DASContextsSetupTest.txt Thu May 31 12:58:13 2007
@@ -0,0 +1,169 @@
+-------------------------------------------------------------------------------
+Test set: org.apache.tuscany.das.ldap.schema.setup.test.DASContextsSetupTest
+-------------------------------------------------------------------------------
+Tests run: 5, Failures: 0, Errors: 5, Skipped: 0, Time elapsed: 0.134 sec <<< FAILURE!
+testConnect(org.apache.tuscany.das.ldap.schema.setup.test.DASContextsSetupTest)  Time elapsed: 0.007 sec  <<< ERROR!
+javax.naming.NameAlreadyBoundException: [LDAP: error code 68 - failed to add entry cn=das,ou=schema: 2.5.4.3=das,2.5.4.11=schema already exists!]; remaining name 'cn=das'
+	at com.sun.jndi.ldap.LdapCtx.mapErrorCode(LdapCtx.java:3000)
+	at com.sun.jndi.ldap.LdapCtx.processReturnCode(LdapCtx.java:2951)
+	at com.sun.jndi.ldap.LdapCtx.processReturnCode(LdapCtx.java:2758)
+	at com.sun.jndi.ldap.LdapCtx.c_createSubcontext(LdapCtx.java:774)
+	at com.sun.jndi.toolkit.ctx.ComponentDirContext.p_createSubcontext(ComponentDirContext.java:319)
+	at com.sun.jndi.toolkit.ctx.PartialCompositeDirContext.createSubcontext(PartialCompositeDirContext.java:248)
+	at com.sun.jndi.toolkit.ctx.PartialCompositeDirContext.createSubcontext(PartialCompositeDirContext.java:236)
+	at javax.naming.directory.InitialDirContext.createSubcontext(InitialDirContext.java:178)
+	at org.apache.tuscany.das.ldap.schema.setup.test.DASContextsSetupTest.createDasContext(DASContextsSetupTest.java:105)
+	at org.apache.tuscany.das.ldap.schema.setup.test.DASContextsSetupTest.setUp(DASContextsSetupTest.java:49)
+	at junit.framework.TestCase.runBare(TestCase.java:125)
+	at junit.framework.TestResult$1.protect(TestResult.java:106)
+	at junit.framework.TestResult.runProtected(TestResult.java:124)
+	at junit.framework.TestResult.run(TestResult.java:109)
+	at junit.framework.TestCase.run(TestCase.java:118)
+	at junit.framework.TestSuite.runTest(TestSuite.java:208)
+	at junit.framework.TestSuite.run(TestSuite.java:203)
+	at sun.reflect.GeneratedMethodAccessor8.invoke(Unknown Source)
+	at sun.reflect.DelegatingMethodAccessorImpl.invoke(DelegatingMethodAccessorImpl.java:25)
+	at java.lang.reflect.Method.invoke(Method.java:597)
+	at org.apache.maven.surefire.junit.JUnitTestSet.execute(JUnitTestSet.java:210)
+	at org.apache.maven.surefire.suite.AbstractDirectoryTestSuite.executeTestSet(AbstractDirectoryTestSuite.java:135)
+	at org.apache.maven.surefire.suite.AbstractDirectoryTestSuite.execute(AbstractDirectoryTestSuite.java:122)
+	at org.apache.maven.surefire.Surefire.run(Surefire.java:129)
+	at sun.reflect.NativeMethodAccessorImpl.invoke0(Native Method)
+	at sun.reflect.NativeMethodAccessorImpl.invoke(NativeMethodAccessorImpl.java:39)
+	at sun.reflect.DelegatingMethodAccessorImpl.invoke(DelegatingMethodAccessorImpl.java:25)
+	at java.lang.reflect.Method.invoke(Method.java:597)
+	at org.apache.maven.surefire.booter.SurefireBooter.runSuitesInProcess(SurefireBooter.java:225)
+	at org.apache.maven.surefire.booter.SurefireBooter.main(SurefireBooter.java:747)
+
+testCreateEcoreContext(org.apache.tuscany.das.ldap.schema.setup.test.DASContextsSetupTest)  Time elapsed: 0.075 sec  <<< ERROR!
+javax.naming.NameAlreadyBoundException: [LDAP: error code 68 - failed to add entry cn=das,ou=schema: 2.5.4.3=das,2.5.4.11=schema already exists!]; remaining name 'cn=das'
+	at com.sun.jndi.ldap.LdapCtx.mapErrorCode(LdapCtx.java:3000)
+	at com.sun.jndi.ldap.LdapCtx.processReturnCode(LdapCtx.java:2951)
+	at com.sun.jndi.ldap.LdapCtx.processReturnCode(LdapCtx.java:2758)
+	at com.sun.jndi.ldap.LdapCtx.c_createSubcontext(LdapCtx.java:774)
+	at com.sun.jndi.toolkit.ctx.ComponentDirContext.p_createSubcontext(ComponentDirContext.java:319)
+	at com.sun.jndi.toolkit.ctx.PartialCompositeDirContext.createSubcontext(PartialCompositeDirContext.java:248)
+	at com.sun.jndi.toolkit.ctx.PartialCompositeDirContext.createSubcontext(PartialCompositeDirContext.java:236)
+	at javax.naming.directory.InitialDirContext.createSubcontext(InitialDirContext.java:178)
+	at org.apache.tuscany.das.ldap.schema.setup.test.DASContextsSetupTest.createDasContext(DASContextsSetupTest.java:105)
+	at org.apache.tuscany.das.ldap.schema.setup.test.DASContextsSetupTest.setUp(DASContextsSetupTest.java:49)
+	at junit.framework.TestCase.runBare(TestCase.java:125)
+	at junit.framework.TestResult$1.protect(TestResult.java:106)
+	at junit.framework.TestResult.runProtected(TestResult.java:124)
+	at junit.framework.TestResult.run(TestResult.java:109)
+	at junit.framework.TestCase.run(TestCase.java:118)
+	at junit.framework.TestSuite.runTest(TestSuite.java:208)
+	at junit.framework.TestSuite.run(TestSuite.java:203)
+	at sun.reflect.GeneratedMethodAccessor8.invoke(Unknown Source)
+	at sun.reflect.DelegatingMethodAccessorImpl.invoke(DelegatingMethodAccessorImpl.java:25)
+	at java.lang.reflect.Method.invoke(Method.java:597)
+	at org.apache.maven.surefire.junit.JUnitTestSet.execute(JUnitTestSet.java:210)
+	at org.apache.maven.surefire.suite.AbstractDirectoryTestSuite.executeTestSet(AbstractDirectoryTestSuite.java:135)
+	at org.apache.maven.surefire.suite.AbstractDirectoryTestSuite.execute(AbstractDirectoryTestSuite.java:122)
+	at org.apache.maven.surefire.Surefire.run(Surefire.java:129)
+	at sun.reflect.NativeMethodAccessorImpl.invoke0(Native Method)
+	at sun.reflect.NativeMethodAccessorImpl.invoke(NativeMethodAccessorImpl.java:39)
+	at sun.reflect.DelegatingMethodAccessorImpl.invoke(DelegatingMethodAccessorImpl.java:25)
+	at java.lang.reflect.Method.invoke(Method.java:597)
+	at org.apache.maven.surefire.booter.SurefireBooter.runSuitesInProcess(SurefireBooter.java:225)
+	at org.apache.maven.surefire.booter.SurefireBooter.main(SurefireBooter.java:747)
+
+testCreateEcoreAttributeTypesContext(org.apache.tuscany.das.ldap.schema.setup.test.DASContextsSetupTest)  Time elapsed: 0.006 sec  <<< ERROR!
+javax.naming.NameAlreadyBoundException: [LDAP: error code 68 - failed to add entry cn=das,ou=schema: 2.5.4.3=das,2.5.4.11=schema already exists!]; remaining name 'cn=das'
+	at com.sun.jndi.ldap.LdapCtx.mapErrorCode(LdapCtx.java:3000)
+	at com.sun.jndi.ldap.LdapCtx.processReturnCode(LdapCtx.java:2951)
+	at com.sun.jndi.ldap.LdapCtx.processReturnCode(LdapCtx.java:2758)
+	at com.sun.jndi.ldap.LdapCtx.c_createSubcontext(LdapCtx.java:774)
+	at com.sun.jndi.toolkit.ctx.ComponentDirContext.p_createSubcontext(ComponentDirContext.java:319)
+	at com.sun.jndi.toolkit.ctx.PartialCompositeDirContext.createSubcontext(PartialCompositeDirContext.java:248)
+	at com.sun.jndi.toolkit.ctx.PartialCompositeDirContext.createSubcontext(PartialCompositeDirContext.java:236)
+	at javax.naming.directory.InitialDirContext.createSubcontext(InitialDirContext.java:178)
+	at org.apache.tuscany.das.ldap.schema.setup.test.DASContextsSetupTest.createDasContext(DASContextsSetupTest.java:105)
+	at org.apache.tuscany.das.ldap.schema.setup.test.DASContextsSetupTest.setUp(DASContextsSetupTest.java:49)
+	at junit.framework.TestCase.runBare(TestCase.java:125)
+	at junit.framework.TestResult$1.protect(TestResult.java:106)
+	at junit.framework.TestResult.runProtected(TestResult.java:124)
+	at junit.framework.TestResult.run(TestResult.java:109)
+	at junit.framework.TestCase.run(TestCase.java:118)
+	at junit.framework.TestSuite.runTest(TestSuite.java:208)
+	at junit.framework.TestSuite.run(TestSuite.java:203)
+	at sun.reflect.GeneratedMethodAccessor8.invoke(Unknown Source)
+	at sun.reflect.DelegatingMethodAccessorImpl.invoke(DelegatingMethodAccessorImpl.java:25)
+	at java.lang.reflect.Method.invoke(Method.java:597)
+	at org.apache.maven.surefire.junit.JUnitTestSet.execute(JUnitTestSet.java:210)
+	at org.apache.maven.surefire.suite.AbstractDirectoryTestSuite.executeTestSet(AbstractDirectoryTestSuite.java:135)
+	at org.apache.maven.surefire.suite.AbstractDirectoryTestSuite.execute(AbstractDirectoryTestSuite.java:122)
+	at org.apache.maven.surefire.Surefire.run(Surefire.java:129)
+	at sun.reflect.NativeMethodAccessorImpl.invoke0(Native Method)
+	at sun.reflect.NativeMethodAccessorImpl.invoke(NativeMethodAccessorImpl.java:39)
+	at sun.reflect.DelegatingMethodAccessorImpl.invoke(DelegatingMethodAccessorImpl.java:25)
+	at java.lang.reflect.Method.invoke(Method.java:597)
+	at org.apache.maven.surefire.booter.SurefireBooter.runSuitesInProcess(SurefireBooter.java:225)
+	at org.apache.maven.surefire.booter.SurefireBooter.main(SurefireBooter.java:747)
+
+testCreateDasSyntaxesContext(org.apache.tuscany.das.ldap.schema.setup.test.DASContextsSetupTest)  Time elapsed: 0.005 sec  <<< ERROR!
+javax.naming.NameAlreadyBoundException: [LDAP: error code 68 - failed to add entry cn=das,ou=schema: 2.5.4.3=das,2.5.4.11=schema already exists!]; remaining name 'cn=das'
+	at com.sun.jndi.ldap.LdapCtx.mapErrorCode(LdapCtx.java:3000)
+	at com.sun.jndi.ldap.LdapCtx.processReturnCode(LdapCtx.java:2951)
+	at com.sun.jndi.ldap.LdapCtx.processReturnCode(LdapCtx.java:2758)
+	at com.sun.jndi.ldap.LdapCtx.c_createSubcontext(LdapCtx.java:774)
+	at com.sun.jndi.toolkit.ctx.ComponentDirContext.p_createSubcontext(ComponentDirContext.java:319)
+	at com.sun.jndi.toolkit.ctx.PartialCompositeDirContext.createSubcontext(PartialCompositeDirContext.java:248)
+	at com.sun.jndi.toolkit.ctx.PartialCompositeDirContext.createSubcontext(PartialCompositeDirContext.java:236)
+	at javax.naming.directory.InitialDirContext.createSubcontext(InitialDirContext.java:178)
+	at org.apache.tuscany.das.ldap.schema.setup.test.DASContextsSetupTest.createDasContext(DASContextsSetupTest.java:105)
+	at org.apache.tuscany.das.ldap.schema.setup.test.DASContextsSetupTest.setUp(DASContextsSetupTest.java:49)
+	at junit.framework.TestCase.runBare(TestCase.java:125)
+	at junit.framework.TestResult$1.protect(TestResult.java:106)
+	at junit.framework.TestResult.runProtected(TestResult.java:124)
+	at junit.framework.TestResult.run(TestResult.java:109)
+	at junit.framework.TestCase.run(TestCase.java:118)
+	at junit.framework.TestSuite.runTest(TestSuite.java:208)
+	at junit.framework.TestSuite.run(TestSuite.java:203)
+	at sun.reflect.GeneratedMethodAccessor8.invoke(Unknown Source)
+	at sun.reflect.DelegatingMethodAccessorImpl.invoke(DelegatingMethodAccessorImpl.java:25)
+	at java.lang.reflect.Method.invoke(Method.java:597)
+	at org.apache.maven.surefire.junit.JUnitTestSet.execute(JUnitTestSet.java:210)
+	at org.apache.maven.surefire.suite.AbstractDirectoryTestSuite.executeTestSet(AbstractDirectoryTestSuite.java:135)
+	at org.apache.maven.surefire.suite.AbstractDirectoryTestSuite.execute(AbstractDirectoryTestSuite.java:122)
+	at org.apache.maven.surefire.Surefire.run(Surefire.java:129)
+	at sun.reflect.NativeMethodAccessorImpl.invoke0(Native Method)
+	at sun.reflect.NativeMethodAccessorImpl.invoke(NativeMethodAccessorImpl.java:39)
+	at sun.reflect.DelegatingMethodAccessorImpl.invoke(DelegatingMethodAccessorImpl.java:25)
+	at java.lang.reflect.Method.invoke(Method.java:597)
+	at org.apache.maven.surefire.booter.SurefireBooter.runSuitesInProcess(SurefireBooter.java:225)
+	at org.apache.maven.surefire.booter.SurefireBooter.main(SurefireBooter.java:747)
+
+testCreateDasObjectClassesContext(org.apache.tuscany.das.ldap.schema.setup.test.DASContextsSetupTest)  Time elapsed: 0.006 sec  <<< ERROR!
+javax.naming.NameAlreadyBoundException: [LDAP: error code 68 - failed to add entry cn=das,ou=schema: 2.5.4.3=das,2.5.4.11=schema already exists!]; remaining name 'cn=das'
+	at com.sun.jndi.ldap.LdapCtx.mapErrorCode(LdapCtx.java:3000)
+	at com.sun.jndi.ldap.LdapCtx.processReturnCode(LdapCtx.java:2951)
+	at com.sun.jndi.ldap.LdapCtx.processReturnCode(LdapCtx.java:2758)
+	at com.sun.jndi.ldap.LdapCtx.c_createSubcontext(LdapCtx.java:774)
+	at com.sun.jndi.toolkit.ctx.ComponentDirContext.p_createSubcontext(ComponentDirContext.java:319)
+	at com.sun.jndi.toolkit.ctx.PartialCompositeDirContext.createSubcontext(PartialCompositeDirContext.java:248)
+	at com.sun.jndi.toolkit.ctx.PartialCompositeDirContext.createSubcontext(PartialCompositeDirContext.java:236)
+	at javax.naming.directory.InitialDirContext.createSubcontext(InitialDirContext.java:178)
+	at org.apache.tuscany.das.ldap.schema.setup.test.DASContextsSetupTest.createDasContext(DASContextsSetupTest.java:105)
+	at org.apache.tuscany.das.ldap.schema.setup.test.DASContextsSetupTest.setUp(DASContextsSetupTest.java:49)
+	at junit.framework.TestCase.runBare(TestCase.java:125)
+	at junit.framework.TestResult$1.protect(TestResult.java:106)
+	at junit.framework.TestResult.runProtected(TestResult.java:124)
+	at junit.framework.TestResult.run(TestResult.java:109)
+	at junit.framework.TestCase.run(TestCase.java:118)
+	at junit.framework.TestSuite.runTest(TestSuite.java:208)
+	at junit.framework.TestSuite.run(TestSuite.java:203)
+	at sun.reflect.GeneratedMethodAccessor8.invoke(Unknown Source)
+	at sun.reflect.DelegatingMethodAccessorImpl.invoke(DelegatingMethodAccessorImpl.java:25)
+	at java.lang.reflect.Method.invoke(Method.java:597)
+	at org.apache.maven.surefire.junit.JUnitTestSet.execute(JUnitTestSet.java:210)
+	at org.apache.maven.surefire.suite.AbstractDirectoryTestSuite.executeTestSet(AbstractDirectoryTestSuite.java:135)
+	at org.apache.maven.surefire.suite.AbstractDirectoryTestSuite.execute(AbstractDirectoryTestSuite.java:122)
+	at org.apache.maven.surefire.Surefire.run(Surefire.java:129)
+	at sun.reflect.NativeMethodAccessorImpl.invoke0(Native Method)
+	at sun.reflect.NativeMethodAccessorImpl.invoke(NativeMethodAccessorImpl.java:39)
+	at sun.reflect.DelegatingMethodAccessorImpl.invoke(DelegatingMethodAccessorImpl.java:25)
+	at java.lang.reflect.Method.invoke(Method.java:597)
+	at org.apache.maven.surefire.booter.SurefireBooter.runSuitesInProcess(SurefireBooter.java:225)
+	at org.apache.maven.surefire.booter.SurefireBooter.main(SurefireBooter.java:747)
+

Added: directory/sandbox/oersoy/das.testing/das.ldap.parent/das.ldap/target/surefire-reports/org.apache.tuscany.das.ldap.schema.setup.test.EcoreContextsSetupTest.txt
URL: http://svn.apache.org/viewvc/directory/sandbox/oersoy/das.testing/das.ldap.parent/das.ldap/target/surefire-reports/org.apache.tuscany.das.ldap.schema.setup.test.EcoreContextsSetupTest.txt?view=auto&rev=543239
==============================================================================
--- directory/sandbox/oersoy/das.testing/das.ldap.parent/das.ldap/target/surefire-reports/org.apache.tuscany.das.ldap.schema.setup.test.EcoreContextsSetupTest.txt (added)
+++ directory/sandbox/oersoy/das.testing/das.ldap.parent/das.ldap/target/surefire-reports/org.apache.tuscany.das.ldap.schema.setup.test.EcoreContextsSetupTest.txt Thu May 31 12:58:13 2007
@@ -0,0 +1,4 @@
+-------------------------------------------------------------------------------
+Test set: org.apache.tuscany.das.ldap.schema.setup.test.EcoreContextsSetupTest
+-------------------------------------------------------------------------------
+Tests run: 4, Failures: 0, Errors: 0, Skipped: 0, Time elapsed: 0.373 sec

Added: directory/sandbox/oersoy/das.testing/das.ldap.parent/das.ldap/target/surefire-reports/org.apache.tuscany.das.ldap.schema.setup.test.SchemaContextSetupTest.txt
URL: http://svn.apache.org/viewvc/directory/sandbox/oersoy/das.testing/das.ldap.parent/das.ldap/target/surefire-reports/org.apache.tuscany.das.ldap.schema.setup.test.SchemaContextSetupTest.txt?view=auto&rev=543239
==============================================================================
--- directory/sandbox/oersoy/das.testing/das.ldap.parent/das.ldap/target/surefire-reports/org.apache.tuscany.das.ldap.schema.setup.test.SchemaContextSetupTest.txt (added)
+++ directory/sandbox/oersoy/das.testing/das.ldap.parent/das.ldap/target/surefire-reports/org.apache.tuscany.das.ldap.schema.setup.test.SchemaContextSetupTest.txt Thu May 31 12:58:13 2007
@@ -0,0 +1,4 @@
+-------------------------------------------------------------------------------
+Test set: org.apache.tuscany.das.ldap.schema.setup.test.SchemaContextSetupTest
+-------------------------------------------------------------------------------
+Tests run: 1, Failures: 0, Errors: 0, Skipped: 0, Time elapsed: 0.146 sec



Mime
View raw message