directory-commits mailing list archives

Site index · List index
Message view « Date » · « Thread »
Top « Date » · « Thread »
From oer...@apache.org
Subject svn commit: r543239 [34/37] - in /directory/sandbox/oersoy/das.testing/das.ldap.parent: ./ das.ldap.configuration.model.ecore.v100/ das.ldap.configuration.model.ecore.v100/.settings/ das.ldap.configuration.model.ecore.v100/model/ das.ldap.configuration...
Date Thu, 31 May 2007 19:58:38 GMT
Added: directory/sandbox/oersoy/das.testing/das.ldap.parent/das.ldap/target/surefire-reports/org.apache.tuscany.das.ldap.create.helper.test.UniqueOIDCreatorHelperTest.txt
URL: http://svn.apache.org/viewvc/directory/sandbox/oersoy/das.testing/das.ldap.parent/das.ldap/target/surefire-reports/org.apache.tuscany.das.ldap.create.helper.test.UniqueOIDCreatorHelperTest.txt?view=auto&rev=543239
==============================================================================
--- directory/sandbox/oersoy/das.testing/das.ldap.parent/das.ldap/target/surefire-reports/org.apache.tuscany.das.ldap.create.helper.test.UniqueOIDCreatorHelperTest.txt (added)
+++ directory/sandbox/oersoy/das.testing/das.ldap.parent/das.ldap/target/surefire-reports/org.apache.tuscany.das.ldap.create.helper.test.UniqueOIDCreatorHelperTest.txt Thu May 31 12:58:13 2007
@@ -0,0 +1,4 @@
+-------------------------------------------------------------------------------
+Test set: org.apache.tuscany.das.ldap.create.helper.test.UniqueOIDCreatorHelperTest
+-------------------------------------------------------------------------------
+Tests run: 1, Failures: 0, Errors: 0, Skipped: 0, Time elapsed: 0.175 sec

Added: directory/sandbox/oersoy/das.testing/das.ldap.parent/das.ldap/target/surefire-reports/org.apache.tuscany.das.ldap.create.test.CreateSyntaxEntrySelfContainedTest.txt
URL: http://svn.apache.org/viewvc/directory/sandbox/oersoy/das.testing/das.ldap.parent/das.ldap/target/surefire-reports/org.apache.tuscany.das.ldap.create.test.CreateSyntaxEntrySelfContainedTest.txt?view=auto&rev=543239
==============================================================================
--- directory/sandbox/oersoy/das.testing/das.ldap.parent/das.ldap/target/surefire-reports/org.apache.tuscany.das.ldap.create.test.CreateSyntaxEntrySelfContainedTest.txt (added)
+++ directory/sandbox/oersoy/das.testing/das.ldap.parent/das.ldap/target/surefire-reports/org.apache.tuscany.das.ldap.create.test.CreateSyntaxEntrySelfContainedTest.txt Thu May 31 12:58:13 2007
@@ -0,0 +1,38 @@
+-------------------------------------------------------------------------------
+Test set: org.apache.tuscany.das.ldap.create.test.CreateSyntaxEntrySelfContainedTest
+-------------------------------------------------------------------------------
+Tests run: 1, Failures: 0, Errors: 1, Skipped: 0, Time elapsed: 0.13 sec <<< FAILURE!
+testCreateSyntaxSchemaEntry(org.apache.tuscany.das.ldap.create.test.CreateSyntaxEntrySelfContainedTest)  Time elapsed: 0.006 sec  <<< ERROR!
+javax.naming.NameAlreadyBoundException: [LDAP: error code 68 - failed to add entry cn=xsd,ou=schema: 2.5.4.3=xsd,2.5.4.11=schema already exists!]; remaining name 'cn=xsd'
+	at com.sun.jndi.ldap.LdapCtx.mapErrorCode(LdapCtx.java:3000)
+	at com.sun.jndi.ldap.LdapCtx.processReturnCode(LdapCtx.java:2951)
+	at com.sun.jndi.ldap.LdapCtx.processReturnCode(LdapCtx.java:2758)
+	at com.sun.jndi.ldap.LdapCtx.c_createSubcontext(LdapCtx.java:774)
+	at com.sun.jndi.toolkit.ctx.ComponentDirContext.p_createSubcontext(ComponentDirContext.java:319)
+	at com.sun.jndi.toolkit.ctx.PartialCompositeDirContext.createSubcontext(PartialCompositeDirContext.java:248)
+	at com.sun.jndi.toolkit.ctx.PartialCompositeDirContext.createSubcontext(PartialCompositeDirContext.java:236)
+	at javax.naming.directory.InitialDirContext.createSubcontext(InitialDirContext.java:178)
+	at org.apache.tuscany.das.ldap.create.test.CreateSyntaxEntrySelfContainedTest.createXSDSchemaContext(CreateSyntaxEntrySelfContainedTest.java:105)
+	at org.apache.tuscany.das.ldap.create.test.CreateSyntaxEntrySelfContainedTest.setUp(CreateSyntaxEntrySelfContainedTest.java:49)
+	at junit.framework.TestCase.runBare(TestCase.java:125)
+	at junit.framework.TestResult$1.protect(TestResult.java:106)
+	at junit.framework.TestResult.runProtected(TestResult.java:124)
+	at junit.framework.TestResult.run(TestResult.java:109)
+	at junit.framework.TestCase.run(TestCase.java:118)
+	at junit.framework.TestSuite.runTest(TestSuite.java:208)
+	at junit.framework.TestSuite.run(TestSuite.java:203)
+	at sun.reflect.NativeMethodAccessorImpl.invoke0(Native Method)
+	at sun.reflect.NativeMethodAccessorImpl.invoke(NativeMethodAccessorImpl.java:39)
+	at sun.reflect.DelegatingMethodAccessorImpl.invoke(DelegatingMethodAccessorImpl.java:25)
+	at java.lang.reflect.Method.invoke(Method.java:597)
+	at org.apache.maven.surefire.junit.JUnitTestSet.execute(JUnitTestSet.java:210)
+	at org.apache.maven.surefire.suite.AbstractDirectoryTestSuite.executeTestSet(AbstractDirectoryTestSuite.java:135)
+	at org.apache.maven.surefire.suite.AbstractDirectoryTestSuite.execute(AbstractDirectoryTestSuite.java:122)
+	at org.apache.maven.surefire.Surefire.run(Surefire.java:129)
+	at sun.reflect.NativeMethodAccessorImpl.invoke0(Native Method)
+	at sun.reflect.NativeMethodAccessorImpl.invoke(NativeMethodAccessorImpl.java:39)
+	at sun.reflect.DelegatingMethodAccessorImpl.invoke(DelegatingMethodAccessorImpl.java:25)
+	at java.lang.reflect.Method.invoke(Method.java:597)
+	at org.apache.maven.surefire.booter.SurefireBooter.runSuitesInProcess(SurefireBooter.java:225)
+	at org.apache.maven.surefire.booter.SurefireBooter.main(SurefireBooter.java:747)
+

Added: directory/sandbox/oersoy/das.testing/das.ldap.parent/das.ldap/target/surefire-reports/org.apache.tuscany.das.ldap.create.test.InitialContextCreatorHelperTest.txt
URL: http://svn.apache.org/viewvc/directory/sandbox/oersoy/das.testing/das.ldap.parent/das.ldap/target/surefire-reports/org.apache.tuscany.das.ldap.create.test.InitialContextCreatorHelperTest.txt?view=auto&rev=543239
==============================================================================
--- directory/sandbox/oersoy/das.testing/das.ldap.parent/das.ldap/target/surefire-reports/org.apache.tuscany.das.ldap.create.test.InitialContextCreatorHelperTest.txt (added)
+++ directory/sandbox/oersoy/das.testing/das.ldap.parent/das.ldap/target/surefire-reports/org.apache.tuscany.das.ldap.create.test.InitialContextCreatorHelperTest.txt Thu May 31 12:58:13 2007
@@ -0,0 +1,224 @@
+-------------------------------------------------------------------------------
+Test set: org.apache.tuscany.das.ldap.create.test.InitialContextCreatorHelperTest
+-------------------------------------------------------------------------------
+Tests run: 4, Failures: 0, Errors: 4, Skipped: 0, Time elapsed: 0.211 sec <<< FAILURE!
+testCreateSystemSubContext(org.apache.tuscany.das.ldap.create.test.InitialContextCreatorHelperTest)  Time elapsed: 0.003 sec  <<< ERROR!
+org.apache.directory.shared.ldap.exception.LdapNameNotFoundException: ou=das
+	at org.apache.directory.server.core.partition.DefaultPartitionNexus.getBackend(DefaultPartitionNexus.java:987)
+	at org.apache.directory.server.core.partition.DefaultPartitionNexus.hasEntry(DefaultPartitionNexus.java:920)
+	at org.apache.directory.server.core.interceptor.InterceptorChain$1.hasEntry(InterceptorChain.java:157)
+	at org.apache.directory.server.core.interceptor.InterceptorChain$Entry$1.hasEntry(InterceptorChain.java:1326)
+	at org.apache.directory.server.core.interceptor.BaseInterceptor.hasEntry(BaseInterceptor.java:134)
+	at org.apache.directory.server.core.interceptor.InterceptorChain$Entry$1.hasEntry(InterceptorChain.java:1326)
+	at org.apache.directory.server.core.exception.ExceptionService.assertHasEntry(ExceptionService.java:405)
+	at org.apache.directory.server.core.exception.ExceptionService.lookup(ExceptionService.java:182)
+	at org.apache.directory.server.core.interceptor.InterceptorChain.lookup(InterceptorChain.java:849)
+	at org.apache.directory.server.core.partition.PartitionNexusProxy.lookup(PartitionNexusProxy.java:501)
+	at org.apache.directory.server.core.authz.AuthorizationService.hasEntry(AuthorizationService.java:599)
+	at org.apache.directory.server.core.interceptor.InterceptorChain$Entry$1.hasEntry(InterceptorChain.java:1326)
+	at org.apache.directory.server.core.interceptor.BaseInterceptor.hasEntry(BaseInterceptor.java:134)
+	at org.apache.directory.server.core.interceptor.InterceptorChain$Entry$1.hasEntry(InterceptorChain.java:1326)
+	at org.apache.directory.server.core.authn.AuthenticationService.hasEntry(AuthenticationService.java:258)
+	at org.apache.directory.server.core.interceptor.InterceptorChain$Entry$1.hasEntry(InterceptorChain.java:1326)
+	at org.apache.directory.server.core.normalization.NormalizationService.hasEntry(NormalizationService.java:333)
+	at org.apache.directory.server.core.interceptor.InterceptorChain.hasEntry(InterceptorChain.java:891)
+	at org.apache.directory.server.core.partition.PartitionNexusProxy.hasEntry(PartitionNexusProxy.java:547)
+	at org.apache.directory.server.core.partition.PartitionNexusProxy.hasEntry(PartitionNexusProxy.java:535)
+	at org.apache.directory.server.core.jndi.ServerContext.<init>(ServerContext.java:129)
+	at org.apache.directory.server.core.jndi.ServerDirContext.<init>(ServerDirContext.java:82)
+	at org.apache.directory.server.core.jndi.ServerLdapContext.<init>(ServerLdapContext.java:63)
+	at org.apache.directory.server.core.DefaultDirectoryService.getJndiContext(DefaultDirectoryService.java:170)
+	at org.apache.directory.server.core.jndi.AbstractContextFactory.getInitialContext(AbstractContextFactory.java:137)
+	at javax.naming.spi.NamingManager.getInitialContext(NamingManager.java:667)
+	at javax.naming.InitialContext.getDefaultInitCtx(InitialContext.java:288)
+	at javax.naming.InitialContext.init(InitialContext.java:223)
+	at javax.naming.InitialContext.<init>(InitialContext.java:197)
+	at javax.naming.directory.InitialDirContext.<init>(InitialDirContext.java:82)
+	at org.apache.tuscany.das.ldap.configuration.model.v100.impl.ConnectionManagerImpl.createDASPartition(ConnectionManagerImpl.java:629)
+	at org.apache.tuscany.das.ldap.create.test.InitialContextCreatorHelperTest.setUp(InitialContextCreatorHelperTest.java:57)
+	at junit.framework.TestCase.runBare(TestCase.java:125)
+	at junit.framework.TestResult$1.protect(TestResult.java:106)
+	at junit.framework.TestResult.runProtected(TestResult.java:124)
+	at junit.framework.TestResult.run(TestResult.java:109)
+	at junit.framework.TestCase.run(TestCase.java:118)
+	at junit.framework.TestSuite.runTest(TestSuite.java:208)
+	at junit.framework.TestSuite.run(TestSuite.java:203)
+	at sun.reflect.GeneratedMethodAccessor8.invoke(Unknown Source)
+	at sun.reflect.DelegatingMethodAccessorImpl.invoke(DelegatingMethodAccessorImpl.java:25)
+	at java.lang.reflect.Method.invoke(Method.java:597)
+	at org.apache.maven.surefire.junit.JUnitTestSet.execute(JUnitTestSet.java:210)
+	at org.apache.maven.surefire.suite.AbstractDirectoryTestSuite.executeTestSet(AbstractDirectoryTestSuite.java:135)
+	at org.apache.maven.surefire.suite.AbstractDirectoryTestSuite.execute(AbstractDirectoryTestSuite.java:122)
+	at org.apache.maven.surefire.Surefire.run(Surefire.java:129)
+	at sun.reflect.NativeMethodAccessorImpl.invoke0(Native Method)
+	at sun.reflect.NativeMethodAccessorImpl.invoke(NativeMethodAccessorImpl.java:39)
+	at sun.reflect.DelegatingMethodAccessorImpl.invoke(DelegatingMethodAccessorImpl.java:25)
+	at java.lang.reflect.Method.invoke(Method.java:597)
+	at org.apache.maven.surefire.booter.SurefireBooter.runSuitesInProcess(SurefireBooter.java:225)
+	at org.apache.maven.surefire.booter.SurefireBooter.main(SurefireBooter.java:747)
+
+testCreateExistingSystemSubContext(org.apache.tuscany.das.ldap.create.test.InitialContextCreatorHelperTest)  Time elapsed: 0.002 sec  <<< ERROR!
+org.apache.directory.shared.ldap.exception.LdapNameNotFoundException: ou=das
+	at org.apache.directory.server.core.partition.DefaultPartitionNexus.getBackend(DefaultPartitionNexus.java:987)
+	at org.apache.directory.server.core.partition.DefaultPartitionNexus.hasEntry(DefaultPartitionNexus.java:920)
+	at org.apache.directory.server.core.interceptor.InterceptorChain$1.hasEntry(InterceptorChain.java:157)
+	at org.apache.directory.server.core.interceptor.InterceptorChain$Entry$1.hasEntry(InterceptorChain.java:1326)
+	at org.apache.directory.server.core.interceptor.BaseInterceptor.hasEntry(BaseInterceptor.java:134)
+	at org.apache.directory.server.core.interceptor.InterceptorChain$Entry$1.hasEntry(InterceptorChain.java:1326)
+	at org.apache.directory.server.core.exception.ExceptionService.assertHasEntry(ExceptionService.java:405)
+	at org.apache.directory.server.core.exception.ExceptionService.lookup(ExceptionService.java:182)
+	at org.apache.directory.server.core.interceptor.InterceptorChain.lookup(InterceptorChain.java:849)
+	at org.apache.directory.server.core.partition.PartitionNexusProxy.lookup(PartitionNexusProxy.java:501)
+	at org.apache.directory.server.core.authz.AuthorizationService.hasEntry(AuthorizationService.java:599)
+	at org.apache.directory.server.core.interceptor.InterceptorChain$Entry$1.hasEntry(InterceptorChain.java:1326)
+	at org.apache.directory.server.core.interceptor.BaseInterceptor.hasEntry(BaseInterceptor.java:134)
+	at org.apache.directory.server.core.interceptor.InterceptorChain$Entry$1.hasEntry(InterceptorChain.java:1326)
+	at org.apache.directory.server.core.authn.AuthenticationService.hasEntry(AuthenticationService.java:258)
+	at org.apache.directory.server.core.interceptor.InterceptorChain$Entry$1.hasEntry(InterceptorChain.java:1326)
+	at org.apache.directory.server.core.normalization.NormalizationService.hasEntry(NormalizationService.java:333)
+	at org.apache.directory.server.core.interceptor.InterceptorChain.hasEntry(InterceptorChain.java:891)
+	at org.apache.directory.server.core.partition.PartitionNexusProxy.hasEntry(PartitionNexusProxy.java:547)
+	at org.apache.directory.server.core.partition.PartitionNexusProxy.hasEntry(PartitionNexusProxy.java:535)
+	at org.apache.directory.server.core.jndi.ServerContext.<init>(ServerContext.java:129)
+	at org.apache.directory.server.core.jndi.ServerDirContext.<init>(ServerDirContext.java:82)
+	at org.apache.directory.server.core.jndi.ServerLdapContext.<init>(ServerLdapContext.java:63)
+	at org.apache.directory.server.core.DefaultDirectoryService.getJndiContext(DefaultDirectoryService.java:170)
+	at org.apache.directory.server.core.jndi.AbstractContextFactory.getInitialContext(AbstractContextFactory.java:137)
+	at javax.naming.spi.NamingManager.getInitialContext(NamingManager.java:667)
+	at javax.naming.InitialContext.getDefaultInitCtx(InitialContext.java:288)
+	at javax.naming.InitialContext.init(InitialContext.java:223)
+	at javax.naming.InitialContext.<init>(InitialContext.java:197)
+	at javax.naming.directory.InitialDirContext.<init>(InitialDirContext.java:82)
+	at org.apache.tuscany.das.ldap.configuration.model.v100.impl.ConnectionManagerImpl.createDASPartition(ConnectionManagerImpl.java:629)
+	at org.apache.tuscany.das.ldap.create.test.InitialContextCreatorHelperTest.setUp(InitialContextCreatorHelperTest.java:57)
+	at junit.framework.TestCase.runBare(TestCase.java:125)
+	at junit.framework.TestResult$1.protect(TestResult.java:106)
+	at junit.framework.TestResult.runProtected(TestResult.java:124)
+	at junit.framework.TestResult.run(TestResult.java:109)
+	at junit.framework.TestCase.run(TestCase.java:118)
+	at junit.framework.TestSuite.runTest(TestSuite.java:208)
+	at junit.framework.TestSuite.run(TestSuite.java:203)
+	at sun.reflect.GeneratedMethodAccessor8.invoke(Unknown Source)
+	at sun.reflect.DelegatingMethodAccessorImpl.invoke(DelegatingMethodAccessorImpl.java:25)
+	at java.lang.reflect.Method.invoke(Method.java:597)
+	at org.apache.maven.surefire.junit.JUnitTestSet.execute(JUnitTestSet.java:210)
+	at org.apache.maven.surefire.suite.AbstractDirectoryTestSuite.executeTestSet(AbstractDirectoryTestSuite.java:135)
+	at org.apache.maven.surefire.suite.AbstractDirectoryTestSuite.execute(AbstractDirectoryTestSuite.java:122)
+	at org.apache.maven.surefire.Surefire.run(Surefire.java:129)
+	at sun.reflect.NativeMethodAccessorImpl.invoke0(Native Method)
+	at sun.reflect.NativeMethodAccessorImpl.invoke(NativeMethodAccessorImpl.java:39)
+	at sun.reflect.DelegatingMethodAccessorImpl.invoke(DelegatingMethodAccessorImpl.java:25)
+	at java.lang.reflect.Method.invoke(Method.java:597)
+	at org.apache.maven.surefire.booter.SurefireBooter.runSuitesInProcess(SurefireBooter.java:225)
+	at org.apache.maven.surefire.booter.SurefireBooter.main(SurefireBooter.java:747)
+
+testCreateAuthorityContext(org.apache.tuscany.das.ldap.create.test.InitialContextCreatorHelperTest)  Time elapsed: 0.002 sec  <<< ERROR!
+org.apache.directory.shared.ldap.exception.LdapNameNotFoundException: ou=das
+	at org.apache.directory.server.core.partition.DefaultPartitionNexus.getBackend(DefaultPartitionNexus.java:987)
+	at org.apache.directory.server.core.partition.DefaultPartitionNexus.hasEntry(DefaultPartitionNexus.java:920)
+	at org.apache.directory.server.core.interceptor.InterceptorChain$1.hasEntry(InterceptorChain.java:157)
+	at org.apache.directory.server.core.interceptor.InterceptorChain$Entry$1.hasEntry(InterceptorChain.java:1326)
+	at org.apache.directory.server.core.interceptor.BaseInterceptor.hasEntry(BaseInterceptor.java:134)
+	at org.apache.directory.server.core.interceptor.InterceptorChain$Entry$1.hasEntry(InterceptorChain.java:1326)
+	at org.apache.directory.server.core.exception.ExceptionService.assertHasEntry(ExceptionService.java:405)
+	at org.apache.directory.server.core.exception.ExceptionService.lookup(ExceptionService.java:182)
+	at org.apache.directory.server.core.interceptor.InterceptorChain.lookup(InterceptorChain.java:849)
+	at org.apache.directory.server.core.partition.PartitionNexusProxy.lookup(PartitionNexusProxy.java:501)
+	at org.apache.directory.server.core.authz.AuthorizationService.hasEntry(AuthorizationService.java:599)
+	at org.apache.directory.server.core.interceptor.InterceptorChain$Entry$1.hasEntry(InterceptorChain.java:1326)
+	at org.apache.directory.server.core.interceptor.BaseInterceptor.hasEntry(BaseInterceptor.java:134)
+	at org.apache.directory.server.core.interceptor.InterceptorChain$Entry$1.hasEntry(InterceptorChain.java:1326)
+	at org.apache.directory.server.core.authn.AuthenticationService.hasEntry(AuthenticationService.java:258)
+	at org.apache.directory.server.core.interceptor.InterceptorChain$Entry$1.hasEntry(InterceptorChain.java:1326)
+	at org.apache.directory.server.core.normalization.NormalizationService.hasEntry(NormalizationService.java:333)
+	at org.apache.directory.server.core.interceptor.InterceptorChain.hasEntry(InterceptorChain.java:891)
+	at org.apache.directory.server.core.partition.PartitionNexusProxy.hasEntry(PartitionNexusProxy.java:547)
+	at org.apache.directory.server.core.partition.PartitionNexusProxy.hasEntry(PartitionNexusProxy.java:535)
+	at org.apache.directory.server.core.jndi.ServerContext.<init>(ServerContext.java:129)
+	at org.apache.directory.server.core.jndi.ServerDirContext.<init>(ServerDirContext.java:82)
+	at org.apache.directory.server.core.jndi.ServerLdapContext.<init>(ServerLdapContext.java:63)
+	at org.apache.directory.server.core.DefaultDirectoryService.getJndiContext(DefaultDirectoryService.java:170)
+	at org.apache.directory.server.core.jndi.AbstractContextFactory.getInitialContext(AbstractContextFactory.java:137)
+	at javax.naming.spi.NamingManager.getInitialContext(NamingManager.java:667)
+	at javax.naming.InitialContext.getDefaultInitCtx(InitialContext.java:288)
+	at javax.naming.InitialContext.init(InitialContext.java:223)
+	at javax.naming.InitialContext.<init>(InitialContext.java:197)
+	at javax.naming.directory.InitialDirContext.<init>(InitialDirContext.java:82)
+	at org.apache.tuscany.das.ldap.configuration.model.v100.impl.ConnectionManagerImpl.createDASPartition(ConnectionManagerImpl.java:629)
+	at org.apache.tuscany.das.ldap.create.test.InitialContextCreatorHelperTest.setUp(InitialContextCreatorHelperTest.java:57)
+	at junit.framework.TestCase.runBare(TestCase.java:125)
+	at junit.framework.TestResult$1.protect(TestResult.java:106)
+	at junit.framework.TestResult.runProtected(TestResult.java:124)
+	at junit.framework.TestResult.run(TestResult.java:109)
+	at junit.framework.TestCase.run(TestCase.java:118)
+	at junit.framework.TestSuite.runTest(TestSuite.java:208)
+	at junit.framework.TestSuite.run(TestSuite.java:203)
+	at sun.reflect.GeneratedMethodAccessor8.invoke(Unknown Source)
+	at sun.reflect.DelegatingMethodAccessorImpl.invoke(DelegatingMethodAccessorImpl.java:25)
+	at java.lang.reflect.Method.invoke(Method.java:597)
+	at org.apache.maven.surefire.junit.JUnitTestSet.execute(JUnitTestSet.java:210)
+	at org.apache.maven.surefire.suite.AbstractDirectoryTestSuite.executeTestSet(AbstractDirectoryTestSuite.java:135)
+	at org.apache.maven.surefire.suite.AbstractDirectoryTestSuite.execute(AbstractDirectoryTestSuite.java:122)
+	at org.apache.maven.surefire.Surefire.run(Surefire.java:129)
+	at sun.reflect.NativeMethodAccessorImpl.invoke0(Native Method)
+	at sun.reflect.NativeMethodAccessorImpl.invoke(NativeMethodAccessorImpl.java:39)
+	at sun.reflect.DelegatingMethodAccessorImpl.invoke(DelegatingMethodAccessorImpl.java:25)
+	at java.lang.reflect.Method.invoke(Method.java:597)
+	at org.apache.maven.surefire.booter.SurefireBooter.runSuitesInProcess(SurefireBooter.java:225)
+	at org.apache.maven.surefire.booter.SurefireBooter.main(SurefireBooter.java:747)
+
+testCreatePathContext(org.apache.tuscany.das.ldap.create.test.InitialContextCreatorHelperTest)  Time elapsed: 0.002 sec  <<< ERROR!
+org.apache.directory.shared.ldap.exception.LdapNameNotFoundException: ou=das
+	at org.apache.directory.server.core.partition.DefaultPartitionNexus.getBackend(DefaultPartitionNexus.java:987)
+	at org.apache.directory.server.core.partition.DefaultPartitionNexus.hasEntry(DefaultPartitionNexus.java:920)
+	at org.apache.directory.server.core.interceptor.InterceptorChain$1.hasEntry(InterceptorChain.java:157)
+	at org.apache.directory.server.core.interceptor.InterceptorChain$Entry$1.hasEntry(InterceptorChain.java:1326)
+	at org.apache.directory.server.core.interceptor.BaseInterceptor.hasEntry(BaseInterceptor.java:134)
+	at org.apache.directory.server.core.interceptor.InterceptorChain$Entry$1.hasEntry(InterceptorChain.java:1326)
+	at org.apache.directory.server.core.exception.ExceptionService.assertHasEntry(ExceptionService.java:405)
+	at org.apache.directory.server.core.exception.ExceptionService.lookup(ExceptionService.java:182)
+	at org.apache.directory.server.core.interceptor.InterceptorChain.lookup(InterceptorChain.java:849)
+	at org.apache.directory.server.core.partition.PartitionNexusProxy.lookup(PartitionNexusProxy.java:501)
+	at org.apache.directory.server.core.authz.AuthorizationService.hasEntry(AuthorizationService.java:599)
+	at org.apache.directory.server.core.interceptor.InterceptorChain$Entry$1.hasEntry(InterceptorChain.java:1326)
+	at org.apache.directory.server.core.interceptor.BaseInterceptor.hasEntry(BaseInterceptor.java:134)
+	at org.apache.directory.server.core.interceptor.InterceptorChain$Entry$1.hasEntry(InterceptorChain.java:1326)
+	at org.apache.directory.server.core.authn.AuthenticationService.hasEntry(AuthenticationService.java:258)
+	at org.apache.directory.server.core.interceptor.InterceptorChain$Entry$1.hasEntry(InterceptorChain.java:1326)
+	at org.apache.directory.server.core.normalization.NormalizationService.hasEntry(NormalizationService.java:333)
+	at org.apache.directory.server.core.interceptor.InterceptorChain.hasEntry(InterceptorChain.java:891)
+	at org.apache.directory.server.core.partition.PartitionNexusProxy.hasEntry(PartitionNexusProxy.java:547)
+	at org.apache.directory.server.core.partition.PartitionNexusProxy.hasEntry(PartitionNexusProxy.java:535)
+	at org.apache.directory.server.core.jndi.ServerContext.<init>(ServerContext.java:129)
+	at org.apache.directory.server.core.jndi.ServerDirContext.<init>(ServerDirContext.java:82)
+	at org.apache.directory.server.core.jndi.ServerLdapContext.<init>(ServerLdapContext.java:63)
+	at org.apache.directory.server.core.DefaultDirectoryService.getJndiContext(DefaultDirectoryService.java:170)
+	at org.apache.directory.server.core.jndi.AbstractContextFactory.getInitialContext(AbstractContextFactory.java:137)
+	at javax.naming.spi.NamingManager.getInitialContext(NamingManager.java:667)
+	at javax.naming.InitialContext.getDefaultInitCtx(InitialContext.java:288)
+	at javax.naming.InitialContext.init(InitialContext.java:223)
+	at javax.naming.InitialContext.<init>(InitialContext.java:197)
+	at javax.naming.directory.InitialDirContext.<init>(InitialDirContext.java:82)
+	at org.apache.tuscany.das.ldap.configuration.model.v100.impl.ConnectionManagerImpl.createDASPartition(ConnectionManagerImpl.java:629)
+	at org.apache.tuscany.das.ldap.create.test.InitialContextCreatorHelperTest.setUp(InitialContextCreatorHelperTest.java:57)
+	at junit.framework.TestCase.runBare(TestCase.java:125)
+	at junit.framework.TestResult$1.protect(TestResult.java:106)
+	at junit.framework.TestResult.runProtected(TestResult.java:124)
+	at junit.framework.TestResult.run(TestResult.java:109)
+	at junit.framework.TestCase.run(TestCase.java:118)
+	at junit.framework.TestSuite.runTest(TestSuite.java:208)
+	at junit.framework.TestSuite.run(TestSuite.java:203)
+	at sun.reflect.GeneratedMethodAccessor8.invoke(Unknown Source)
+	at sun.reflect.DelegatingMethodAccessorImpl.invoke(DelegatingMethodAccessorImpl.java:25)
+	at java.lang.reflect.Method.invoke(Method.java:597)
+	at org.apache.maven.surefire.junit.JUnitTestSet.execute(JUnitTestSet.java:210)
+	at org.apache.maven.surefire.suite.AbstractDirectoryTestSuite.executeTestSet(AbstractDirectoryTestSuite.java:135)
+	at org.apache.maven.surefire.suite.AbstractDirectoryTestSuite.execute(AbstractDirectoryTestSuite.java:122)
+	at org.apache.maven.surefire.Surefire.run(Surefire.java:129)
+	at sun.reflect.NativeMethodAccessorImpl.invoke0(Native Method)
+	at sun.reflect.NativeMethodAccessorImpl.invoke(NativeMethodAccessorImpl.java:39)
+	at sun.reflect.DelegatingMethodAccessorImpl.invoke(DelegatingMethodAccessorImpl.java:25)
+	at java.lang.reflect.Method.invoke(Method.java:597)
+	at org.apache.maven.surefire.booter.SurefireBooter.runSuitesInProcess(SurefireBooter.java:225)
+	at org.apache.maven.surefire.booter.SurefireBooter.main(SurefireBooter.java:747)
+

Added: directory/sandbox/oersoy/das.testing/das.ldap.parent/das.ldap/target/surefire-reports/org.apache.tuscany.das.ldap.create.test.InitialContextCreatorTest.txt
URL: http://svn.apache.org/viewvc/directory/sandbox/oersoy/das.testing/das.ldap.parent/das.ldap/target/surefire-reports/org.apache.tuscany.das.ldap.create.test.InitialContextCreatorTest.txt?view=auto&rev=543239
==============================================================================
--- directory/sandbox/oersoy/das.testing/das.ldap.parent/das.ldap/target/surefire-reports/org.apache.tuscany.das.ldap.create.test.InitialContextCreatorTest.txt (added)
+++ directory/sandbox/oersoy/das.testing/das.ldap.parent/das.ldap/target/surefire-reports/org.apache.tuscany.das.ldap.create.test.InitialContextCreatorTest.txt Thu May 31 12:58:13 2007
@@ -0,0 +1,60 @@
+-------------------------------------------------------------------------------
+Test set: org.apache.tuscany.das.ldap.create.test.InitialContextCreatorTest
+-------------------------------------------------------------------------------
+Tests run: 1, Failures: 0, Errors: 1, Skipped: 0, Time elapsed: 0.126 sec <<< FAILURE!
+testCreate(org.apache.tuscany.das.ldap.create.test.InitialContextCreatorTest)  Time elapsed: 0.003 sec  <<< ERROR!
+org.apache.directory.shared.ldap.exception.LdapNameNotFoundException: ou=das
+	at org.apache.directory.server.core.partition.DefaultPartitionNexus.getBackend(DefaultPartitionNexus.java:987)
+	at org.apache.directory.server.core.partition.DefaultPartitionNexus.hasEntry(DefaultPartitionNexus.java:920)
+	at org.apache.directory.server.core.interceptor.InterceptorChain$1.hasEntry(InterceptorChain.java:157)
+	at org.apache.directory.server.core.interceptor.InterceptorChain$Entry$1.hasEntry(InterceptorChain.java:1326)
+	at org.apache.directory.server.core.interceptor.BaseInterceptor.hasEntry(BaseInterceptor.java:134)
+	at org.apache.directory.server.core.interceptor.InterceptorChain$Entry$1.hasEntry(InterceptorChain.java:1326)
+	at org.apache.directory.server.core.exception.ExceptionService.assertHasEntry(ExceptionService.java:405)
+	at org.apache.directory.server.core.exception.ExceptionService.lookup(ExceptionService.java:182)
+	at org.apache.directory.server.core.interceptor.InterceptorChain.lookup(InterceptorChain.java:849)
+	at org.apache.directory.server.core.partition.PartitionNexusProxy.lookup(PartitionNexusProxy.java:501)
+	at org.apache.directory.server.core.authz.AuthorizationService.hasEntry(AuthorizationService.java:599)
+	at org.apache.directory.server.core.interceptor.InterceptorChain$Entry$1.hasEntry(InterceptorChain.java:1326)
+	at org.apache.directory.server.core.interceptor.BaseInterceptor.hasEntry(BaseInterceptor.java:134)
+	at org.apache.directory.server.core.interceptor.InterceptorChain$Entry$1.hasEntry(InterceptorChain.java:1326)
+	at org.apache.directory.server.core.authn.AuthenticationService.hasEntry(AuthenticationService.java:258)
+	at org.apache.directory.server.core.interceptor.InterceptorChain$Entry$1.hasEntry(InterceptorChain.java:1326)
+	at org.apache.directory.server.core.normalization.NormalizationService.hasEntry(NormalizationService.java:333)
+	at org.apache.directory.server.core.interceptor.InterceptorChain.hasEntry(InterceptorChain.java:891)
+	at org.apache.directory.server.core.partition.PartitionNexusProxy.hasEntry(PartitionNexusProxy.java:547)
+	at org.apache.directory.server.core.partition.PartitionNexusProxy.hasEntry(PartitionNexusProxy.java:535)
+	at org.apache.directory.server.core.jndi.ServerContext.<init>(ServerContext.java:129)
+	at org.apache.directory.server.core.jndi.ServerDirContext.<init>(ServerDirContext.java:82)
+	at org.apache.directory.server.core.jndi.ServerLdapContext.<init>(ServerLdapContext.java:63)
+	at org.apache.directory.server.core.DefaultDirectoryService.getJndiContext(DefaultDirectoryService.java:170)
+	at org.apache.directory.server.core.jndi.AbstractContextFactory.getInitialContext(AbstractContextFactory.java:137)
+	at javax.naming.spi.NamingManager.getInitialContext(NamingManager.java:667)
+	at javax.naming.InitialContext.getDefaultInitCtx(InitialContext.java:288)
+	at javax.naming.InitialContext.init(InitialContext.java:223)
+	at javax.naming.InitialContext.<init>(InitialContext.java:197)
+	at javax.naming.directory.InitialDirContext.<init>(InitialDirContext.java:82)
+	at org.apache.tuscany.das.ldap.configuration.model.v100.impl.ConnectionManagerImpl.createDASPartition(ConnectionManagerImpl.java:629)
+	at org.apache.tuscany.das.ldap.test.TestSetup.setUp(TestSetup.java:27)
+	at junit.framework.TestCase.runBare(TestCase.java:125)
+	at junit.framework.TestResult$1.protect(TestResult.java:106)
+	at junit.framework.TestResult.runProtected(TestResult.java:124)
+	at junit.framework.TestResult.run(TestResult.java:109)
+	at junit.framework.TestCase.run(TestCase.java:118)
+	at junit.framework.TestSuite.runTest(TestSuite.java:208)
+	at junit.framework.TestSuite.run(TestSuite.java:203)
+	at sun.reflect.NativeMethodAccessorImpl.invoke0(Native Method)
+	at sun.reflect.NativeMethodAccessorImpl.invoke(NativeMethodAccessorImpl.java:39)
+	at sun.reflect.DelegatingMethodAccessorImpl.invoke(DelegatingMethodAccessorImpl.java:25)
+	at java.lang.reflect.Method.invoke(Method.java:597)
+	at org.apache.maven.surefire.junit.JUnitTestSet.execute(JUnitTestSet.java:210)
+	at org.apache.maven.surefire.suite.AbstractDirectoryTestSuite.executeTestSet(AbstractDirectoryTestSuite.java:135)
+	at org.apache.maven.surefire.suite.AbstractDirectoryTestSuite.execute(AbstractDirectoryTestSuite.java:122)
+	at org.apache.maven.surefire.Surefire.run(Surefire.java:129)
+	at sun.reflect.NativeMethodAccessorImpl.invoke0(Native Method)
+	at sun.reflect.NativeMethodAccessorImpl.invoke(NativeMethodAccessorImpl.java:39)
+	at sun.reflect.DelegatingMethodAccessorImpl.invoke(DelegatingMethodAccessorImpl.java:25)
+	at java.lang.reflect.Method.invoke(Method.java:597)
+	at org.apache.maven.surefire.booter.SurefireBooter.runSuitesInProcess(SurefireBooter.java:225)
+	at org.apache.maven.surefire.booter.SurefireBooter.main(SurefireBooter.java:747)
+

Added: directory/sandbox/oersoy/das.testing/das.ldap.parent/das.ldap/target/surefire-reports/org.apache.tuscany.das.ldap.create.test.SyntaxEntryCreatorTest.txt
URL: http://svn.apache.org/viewvc/directory/sandbox/oersoy/das.testing/das.ldap.parent/das.ldap/target/surefire-reports/org.apache.tuscany.das.ldap.create.test.SyntaxEntryCreatorTest.txt?view=auto&rev=543239
==============================================================================
--- directory/sandbox/oersoy/das.testing/das.ldap.parent/das.ldap/target/surefire-reports/org.apache.tuscany.das.ldap.create.test.SyntaxEntryCreatorTest.txt (added)
+++ directory/sandbox/oersoy/das.testing/das.ldap.parent/das.ldap/target/surefire-reports/org.apache.tuscany.das.ldap.create.test.SyntaxEntryCreatorTest.txt Thu May 31 12:58:13 2007
@@ -0,0 +1,136 @@
+-------------------------------------------------------------------------------
+Test set: org.apache.tuscany.das.ldap.create.test.SyntaxEntryCreatorTest
+-------------------------------------------------------------------------------
+Tests run: 4, Failures: 0, Errors: 4, Skipped: 0, Time elapsed: 0.124 sec <<< FAILURE!
+testCreate(org.apache.tuscany.das.ldap.create.test.SyntaxEntryCreatorTest)  Time elapsed: 0.005 sec  <<< ERROR!
+javax.naming.NameAlreadyBoundException: [LDAP: error code 68 - failed to add entry cn=xsd,ou=schema: 2.5.4.3=xsd,2.5.4.11=schema already exists!]; remaining name 'cn=xsd'
+	at com.sun.jndi.ldap.LdapCtx.mapErrorCode(LdapCtx.java:3000)
+	at com.sun.jndi.ldap.LdapCtx.processReturnCode(LdapCtx.java:2951)
+	at com.sun.jndi.ldap.LdapCtx.processReturnCode(LdapCtx.java:2758)
+	at com.sun.jndi.ldap.LdapCtx.c_createSubcontext(LdapCtx.java:774)
+	at com.sun.jndi.toolkit.ctx.ComponentDirContext.p_createSubcontext(ComponentDirContext.java:319)
+	at com.sun.jndi.toolkit.ctx.PartialCompositeDirContext.createSubcontext(PartialCompositeDirContext.java:248)
+	at com.sun.jndi.toolkit.ctx.PartialCompositeDirContext.createSubcontext(PartialCompositeDirContext.java:236)
+	at javax.naming.directory.InitialDirContext.createSubcontext(InitialDirContext.java:178)
+	at org.apache.tuscany.das.ldap.schema.setup.test.XSDContextsSetupTest.createEcoreContext(XSDContextsSetupTest.java:66)
+	at org.apache.tuscany.das.ldap.schema.setup.test.XSDContextsSetupTest.setUp(XSDContextsSetupTest.java:32)
+	at junit.framework.TestCase.runBare(TestCase.java:125)
+	at junit.framework.TestResult$1.protect(TestResult.java:106)
+	at junit.framework.TestResult.runProtected(TestResult.java:124)
+	at junit.framework.TestResult.run(TestResult.java:109)
+	at junit.framework.TestCase.run(TestCase.java:118)
+	at junit.framework.TestSuite.runTest(TestSuite.java:208)
+	at junit.framework.TestSuite.run(TestSuite.java:203)
+	at sun.reflect.GeneratedMethodAccessor8.invoke(Unknown Source)
+	at sun.reflect.DelegatingMethodAccessorImpl.invoke(DelegatingMethodAccessorImpl.java:25)
+	at java.lang.reflect.Method.invoke(Method.java:597)
+	at org.apache.maven.surefire.junit.JUnitTestSet.execute(JUnitTestSet.java:210)
+	at org.apache.maven.surefire.suite.AbstractDirectoryTestSuite.executeTestSet(AbstractDirectoryTestSuite.java:135)
+	at org.apache.maven.surefire.suite.AbstractDirectoryTestSuite.execute(AbstractDirectoryTestSuite.java:122)
+	at org.apache.maven.surefire.Surefire.run(Surefire.java:129)
+	at sun.reflect.NativeMethodAccessorImpl.invoke0(Native Method)
+	at sun.reflect.NativeMethodAccessorImpl.invoke(NativeMethodAccessorImpl.java:39)
+	at sun.reflect.DelegatingMethodAccessorImpl.invoke(DelegatingMethodAccessorImpl.java:25)
+	at java.lang.reflect.Method.invoke(Method.java:597)
+	at org.apache.maven.surefire.booter.SurefireBooter.runSuitesInProcess(SurefireBooter.java:225)
+	at org.apache.maven.surefire.booter.SurefireBooter.main(SurefireBooter.java:747)
+
+testConnect(org.apache.tuscany.das.ldap.create.test.SyntaxEntryCreatorTest)  Time elapsed: 0.075 sec  <<< ERROR!
+javax.naming.NameAlreadyBoundException: [LDAP: error code 68 - failed to add entry cn=xsd,ou=schema: 2.5.4.3=xsd,2.5.4.11=schema already exists!]; remaining name 'cn=xsd'
+	at com.sun.jndi.ldap.LdapCtx.mapErrorCode(LdapCtx.java:3000)
+	at com.sun.jndi.ldap.LdapCtx.processReturnCode(LdapCtx.java:2951)
+	at com.sun.jndi.ldap.LdapCtx.processReturnCode(LdapCtx.java:2758)
+	at com.sun.jndi.ldap.LdapCtx.c_createSubcontext(LdapCtx.java:774)
+	at com.sun.jndi.toolkit.ctx.ComponentDirContext.p_createSubcontext(ComponentDirContext.java:319)
+	at com.sun.jndi.toolkit.ctx.PartialCompositeDirContext.createSubcontext(PartialCompositeDirContext.java:248)
+	at com.sun.jndi.toolkit.ctx.PartialCompositeDirContext.createSubcontext(PartialCompositeDirContext.java:236)
+	at javax.naming.directory.InitialDirContext.createSubcontext(InitialDirContext.java:178)
+	at org.apache.tuscany.das.ldap.schema.setup.test.XSDContextsSetupTest.createEcoreContext(XSDContextsSetupTest.java:66)
+	at org.apache.tuscany.das.ldap.schema.setup.test.XSDContextsSetupTest.setUp(XSDContextsSetupTest.java:32)
+	at junit.framework.TestCase.runBare(TestCase.java:125)
+	at junit.framework.TestResult$1.protect(TestResult.java:106)
+	at junit.framework.TestResult.runProtected(TestResult.java:124)
+	at junit.framework.TestResult.run(TestResult.java:109)
+	at junit.framework.TestCase.run(TestCase.java:118)
+	at junit.framework.TestSuite.runTest(TestSuite.java:208)
+	at junit.framework.TestSuite.run(TestSuite.java:203)
+	at sun.reflect.GeneratedMethodAccessor8.invoke(Unknown Source)
+	at sun.reflect.DelegatingMethodAccessorImpl.invoke(DelegatingMethodAccessorImpl.java:25)
+	at java.lang.reflect.Method.invoke(Method.java:597)
+	at org.apache.maven.surefire.junit.JUnitTestSet.execute(JUnitTestSet.java:210)
+	at org.apache.maven.surefire.suite.AbstractDirectoryTestSuite.executeTestSet(AbstractDirectoryTestSuite.java:135)
+	at org.apache.maven.surefire.suite.AbstractDirectoryTestSuite.execute(AbstractDirectoryTestSuite.java:122)
+	at org.apache.maven.surefire.Surefire.run(Surefire.java:129)
+	at sun.reflect.NativeMethodAccessorImpl.invoke0(Native Method)
+	at sun.reflect.NativeMethodAccessorImpl.invoke(NativeMethodAccessorImpl.java:39)
+	at sun.reflect.DelegatingMethodAccessorImpl.invoke(DelegatingMethodAccessorImpl.java:25)
+	at java.lang.reflect.Method.invoke(Method.java:597)
+	at org.apache.maven.surefire.booter.SurefireBooter.runSuitesInProcess(SurefireBooter.java:225)
+	at org.apache.maven.surefire.booter.SurefireBooter.main(SurefireBooter.java:747)
+
+testCreateEcoreContext(org.apache.tuscany.das.ldap.create.test.SyntaxEntryCreatorTest)  Time elapsed: 0.006 sec  <<< ERROR!
+javax.naming.NameAlreadyBoundException: [LDAP: error code 68 - failed to add entry cn=xsd,ou=schema: 2.5.4.3=xsd,2.5.4.11=schema already exists!]; remaining name 'cn=xsd'
+	at com.sun.jndi.ldap.LdapCtx.mapErrorCode(LdapCtx.java:3000)
+	at com.sun.jndi.ldap.LdapCtx.processReturnCode(LdapCtx.java:2951)
+	at com.sun.jndi.ldap.LdapCtx.processReturnCode(LdapCtx.java:2758)
+	at com.sun.jndi.ldap.LdapCtx.c_createSubcontext(LdapCtx.java:774)
+	at com.sun.jndi.toolkit.ctx.ComponentDirContext.p_createSubcontext(ComponentDirContext.java:319)
+	at com.sun.jndi.toolkit.ctx.PartialCompositeDirContext.createSubcontext(PartialCompositeDirContext.java:248)
+	at com.sun.jndi.toolkit.ctx.PartialCompositeDirContext.createSubcontext(PartialCompositeDirContext.java:236)
+	at javax.naming.directory.InitialDirContext.createSubcontext(InitialDirContext.java:178)
+	at org.apache.tuscany.das.ldap.schema.setup.test.XSDContextsSetupTest.createEcoreContext(XSDContextsSetupTest.java:66)
+	at org.apache.tuscany.das.ldap.schema.setup.test.XSDContextsSetupTest.setUp(XSDContextsSetupTest.java:32)
+	at junit.framework.TestCase.runBare(TestCase.java:125)
+	at junit.framework.TestResult$1.protect(TestResult.java:106)
+	at junit.framework.TestResult.runProtected(TestResult.java:124)
+	at junit.framework.TestResult.run(TestResult.java:109)
+	at junit.framework.TestCase.run(TestCase.java:118)
+	at junit.framework.TestSuite.runTest(TestSuite.java:208)
+	at junit.framework.TestSuite.run(TestSuite.java:203)
+	at sun.reflect.GeneratedMethodAccessor8.invoke(Unknown Source)
+	at sun.reflect.DelegatingMethodAccessorImpl.invoke(DelegatingMethodAccessorImpl.java:25)
+	at java.lang.reflect.Method.invoke(Method.java:597)
+	at org.apache.maven.surefire.junit.JUnitTestSet.execute(JUnitTestSet.java:210)
+	at org.apache.maven.surefire.suite.AbstractDirectoryTestSuite.executeTestSet(AbstractDirectoryTestSuite.java:135)
+	at org.apache.maven.surefire.suite.AbstractDirectoryTestSuite.execute(AbstractDirectoryTestSuite.java:122)
+	at org.apache.maven.surefire.Surefire.run(Surefire.java:129)
+	at sun.reflect.NativeMethodAccessorImpl.invoke0(Native Method)
+	at sun.reflect.NativeMethodAccessorImpl.invoke(NativeMethodAccessorImpl.java:39)
+	at sun.reflect.DelegatingMethodAccessorImpl.invoke(DelegatingMethodAccessorImpl.java:25)
+	at java.lang.reflect.Method.invoke(Method.java:597)
+	at org.apache.maven.surefire.booter.SurefireBooter.runSuitesInProcess(SurefireBooter.java:225)
+	at org.apache.maven.surefire.booter.SurefireBooter.main(SurefireBooter.java:747)
+
+testCreateEcoreSyntaxesContext(org.apache.tuscany.das.ldap.create.test.SyntaxEntryCreatorTest)  Time elapsed: 0.005 sec  <<< ERROR!
+javax.naming.NameAlreadyBoundException: [LDAP: error code 68 - failed to add entry cn=xsd,ou=schema: 2.5.4.3=xsd,2.5.4.11=schema already exists!]; remaining name 'cn=xsd'
+	at com.sun.jndi.ldap.LdapCtx.mapErrorCode(LdapCtx.java:3000)
+	at com.sun.jndi.ldap.LdapCtx.processReturnCode(LdapCtx.java:2951)
+	at com.sun.jndi.ldap.LdapCtx.processReturnCode(LdapCtx.java:2758)
+	at com.sun.jndi.ldap.LdapCtx.c_createSubcontext(LdapCtx.java:774)
+	at com.sun.jndi.toolkit.ctx.ComponentDirContext.p_createSubcontext(ComponentDirContext.java:319)
+	at com.sun.jndi.toolkit.ctx.PartialCompositeDirContext.createSubcontext(PartialCompositeDirContext.java:248)
+	at com.sun.jndi.toolkit.ctx.PartialCompositeDirContext.createSubcontext(PartialCompositeDirContext.java:236)
+	at javax.naming.directory.InitialDirContext.createSubcontext(InitialDirContext.java:178)
+	at org.apache.tuscany.das.ldap.schema.setup.test.XSDContextsSetupTest.createEcoreContext(XSDContextsSetupTest.java:66)
+	at org.apache.tuscany.das.ldap.schema.setup.test.XSDContextsSetupTest.setUp(XSDContextsSetupTest.java:32)
+	at junit.framework.TestCase.runBare(TestCase.java:125)
+	at junit.framework.TestResult$1.protect(TestResult.java:106)
+	at junit.framework.TestResult.runProtected(TestResult.java:124)
+	at junit.framework.TestResult.run(TestResult.java:109)
+	at junit.framework.TestCase.run(TestCase.java:118)
+	at junit.framework.TestSuite.runTest(TestSuite.java:208)
+	at junit.framework.TestSuite.run(TestSuite.java:203)
+	at sun.reflect.GeneratedMethodAccessor8.invoke(Unknown Source)
+	at sun.reflect.DelegatingMethodAccessorImpl.invoke(DelegatingMethodAccessorImpl.java:25)
+	at java.lang.reflect.Method.invoke(Method.java:597)
+	at org.apache.maven.surefire.junit.JUnitTestSet.execute(JUnitTestSet.java:210)
+	at org.apache.maven.surefire.suite.AbstractDirectoryTestSuite.executeTestSet(AbstractDirectoryTestSuite.java:135)
+	at org.apache.maven.surefire.suite.AbstractDirectoryTestSuite.execute(AbstractDirectoryTestSuite.java:122)
+	at org.apache.maven.surefire.Surefire.run(Surefire.java:129)
+	at sun.reflect.NativeMethodAccessorImpl.invoke0(Native Method)
+	at sun.reflect.NativeMethodAccessorImpl.invoke(NativeMethodAccessorImpl.java:39)
+	at sun.reflect.DelegatingMethodAccessorImpl.invoke(DelegatingMethodAccessorImpl.java:25)
+	at java.lang.reflect.Method.invoke(Method.java:597)
+	at org.apache.maven.surefire.booter.SurefireBooter.runSuitesInProcess(SurefireBooter.java:225)
+	at org.apache.maven.surefire.booter.SurefireBooter.main(SurefireBooter.java:747)
+

Added: directory/sandbox/oersoy/das.testing/das.ldap.parent/das.ldap/target/surefire-reports/org.apache.tuscany.das.ldap.create.test.UniqueOIDCreatorHelperTest.txt
URL: http://svn.apache.org/viewvc/directory/sandbox/oersoy/das.testing/das.ldap.parent/das.ldap/target/surefire-reports/org.apache.tuscany.das.ldap.create.test.UniqueOIDCreatorHelperTest.txt?view=auto&rev=543239
==============================================================================
--- directory/sandbox/oersoy/das.testing/das.ldap.parent/das.ldap/target/surefire-reports/org.apache.tuscany.das.ldap.create.test.UniqueOIDCreatorHelperTest.txt (added)
+++ directory/sandbox/oersoy/das.testing/das.ldap.parent/das.ldap/target/surefire-reports/org.apache.tuscany.das.ldap.create.test.UniqueOIDCreatorHelperTest.txt Thu May 31 12:58:13 2007
@@ -0,0 +1,4 @@
+-------------------------------------------------------------------------------
+Test set: org.apache.tuscany.das.ldap.create.test.UniqueOIDCreatorHelperTest
+-------------------------------------------------------------------------------
+Tests run: 1, Failures: 0, Errors: 0, Skipped: 0, Time elapsed: 0.116 sec

Added: directory/sandbox/oersoy/das.testing/das.ldap.parent/das.ldap/target/surefire-reports/org.apache.tuscany.das.ldap.destroy.test.InitialContextDestroyerTest.txt
URL: http://svn.apache.org/viewvc/directory/sandbox/oersoy/das.testing/das.ldap.parent/das.ldap/target/surefire-reports/org.apache.tuscany.das.ldap.destroy.test.InitialContextDestroyerTest.txt?view=auto&rev=543239
==============================================================================
--- directory/sandbox/oersoy/das.testing/das.ldap.parent/das.ldap/target/surefire-reports/org.apache.tuscany.das.ldap.destroy.test.InitialContextDestroyerTest.txt (added)
+++ directory/sandbox/oersoy/das.testing/das.ldap.parent/das.ldap/target/surefire-reports/org.apache.tuscany.das.ldap.destroy.test.InitialContextDestroyerTest.txt Thu May 31 12:58:13 2007
@@ -0,0 +1,60 @@
+-------------------------------------------------------------------------------
+Test set: org.apache.tuscany.das.ldap.destroy.test.InitialContextDestroyerTest
+-------------------------------------------------------------------------------
+Tests run: 1, Failures: 0, Errors: 1, Skipped: 0, Time elapsed: 0.164 sec <<< FAILURE!
+testDestroy(org.apache.tuscany.das.ldap.destroy.test.InitialContextDestroyerTest)  Time elapsed: 0.144 sec  <<< ERROR!
+org.apache.directory.shared.ldap.exception.LdapNameNotFoundException: ou=das
+	at org.apache.directory.server.core.partition.DefaultPartitionNexus.getBackend(DefaultPartitionNexus.java:987)
+	at org.apache.directory.server.core.partition.DefaultPartitionNexus.hasEntry(DefaultPartitionNexus.java:920)
+	at org.apache.directory.server.core.interceptor.InterceptorChain$1.hasEntry(InterceptorChain.java:157)
+	at org.apache.directory.server.core.interceptor.InterceptorChain$Entry$1.hasEntry(InterceptorChain.java:1326)
+	at org.apache.directory.server.core.interceptor.BaseInterceptor.hasEntry(BaseInterceptor.java:134)
+	at org.apache.directory.server.core.interceptor.InterceptorChain$Entry$1.hasEntry(InterceptorChain.java:1326)
+	at org.apache.directory.server.core.exception.ExceptionService.assertHasEntry(ExceptionService.java:405)
+	at org.apache.directory.server.core.exception.ExceptionService.lookup(ExceptionService.java:182)
+	at org.apache.directory.server.core.interceptor.InterceptorChain.lookup(InterceptorChain.java:849)
+	at org.apache.directory.server.core.partition.PartitionNexusProxy.lookup(PartitionNexusProxy.java:501)
+	at org.apache.directory.server.core.authz.AuthorizationService.hasEntry(AuthorizationService.java:599)
+	at org.apache.directory.server.core.interceptor.InterceptorChain$Entry$1.hasEntry(InterceptorChain.java:1326)
+	at org.apache.directory.server.core.interceptor.BaseInterceptor.hasEntry(BaseInterceptor.java:134)
+	at org.apache.directory.server.core.interceptor.InterceptorChain$Entry$1.hasEntry(InterceptorChain.java:1326)
+	at org.apache.directory.server.core.authn.AuthenticationService.hasEntry(AuthenticationService.java:258)
+	at org.apache.directory.server.core.interceptor.InterceptorChain$Entry$1.hasEntry(InterceptorChain.java:1326)
+	at org.apache.directory.server.core.normalization.NormalizationService.hasEntry(NormalizationService.java:333)
+	at org.apache.directory.server.core.interceptor.InterceptorChain.hasEntry(InterceptorChain.java:891)
+	at org.apache.directory.server.core.partition.PartitionNexusProxy.hasEntry(PartitionNexusProxy.java:547)
+	at org.apache.directory.server.core.partition.PartitionNexusProxy.hasEntry(PartitionNexusProxy.java:535)
+	at org.apache.directory.server.core.jndi.ServerContext.<init>(ServerContext.java:129)
+	at org.apache.directory.server.core.jndi.ServerDirContext.<init>(ServerDirContext.java:82)
+	at org.apache.directory.server.core.jndi.ServerLdapContext.<init>(ServerLdapContext.java:63)
+	at org.apache.directory.server.core.DefaultDirectoryService.getJndiContext(DefaultDirectoryService.java:170)
+	at org.apache.directory.server.core.jndi.AbstractContextFactory.getInitialContext(AbstractContextFactory.java:137)
+	at javax.naming.spi.NamingManager.getInitialContext(NamingManager.java:667)
+	at javax.naming.InitialContext.getDefaultInitCtx(InitialContext.java:288)
+	at javax.naming.InitialContext.init(InitialContext.java:223)
+	at javax.naming.InitialContext.<init>(InitialContext.java:197)
+	at javax.naming.directory.InitialDirContext.<init>(InitialDirContext.java:82)
+	at org.apache.tuscany.das.ldap.configuration.model.v100.impl.ConnectionManagerImpl.createDASPartition(ConnectionManagerImpl.java:629)
+	at org.apache.tuscany.das.ldap.test.TestSetup.setUp(TestSetup.java:27)
+	at junit.framework.TestCase.runBare(TestCase.java:125)
+	at junit.framework.TestResult$1.protect(TestResult.java:106)
+	at junit.framework.TestResult.runProtected(TestResult.java:124)
+	at junit.framework.TestResult.run(TestResult.java:109)
+	at junit.framework.TestCase.run(TestCase.java:118)
+	at junit.framework.TestSuite.runTest(TestSuite.java:208)
+	at junit.framework.TestSuite.run(TestSuite.java:203)
+	at sun.reflect.NativeMethodAccessorImpl.invoke0(Native Method)
+	at sun.reflect.NativeMethodAccessorImpl.invoke(NativeMethodAccessorImpl.java:39)
+	at sun.reflect.DelegatingMethodAccessorImpl.invoke(DelegatingMethodAccessorImpl.java:25)
+	at java.lang.reflect.Method.invoke(Method.java:597)
+	at org.apache.maven.surefire.junit.JUnitTestSet.execute(JUnitTestSet.java:210)
+	at org.apache.maven.surefire.suite.AbstractDirectoryTestSuite.executeTestSet(AbstractDirectoryTestSuite.java:135)
+	at org.apache.maven.surefire.suite.AbstractDirectoryTestSuite.execute(AbstractDirectoryTestSuite.java:122)
+	at org.apache.maven.surefire.Surefire.run(Surefire.java:129)
+	at sun.reflect.NativeMethodAccessorImpl.invoke0(Native Method)
+	at sun.reflect.NativeMethodAccessorImpl.invoke(NativeMethodAccessorImpl.java:39)
+	at sun.reflect.DelegatingMethodAccessorImpl.invoke(DelegatingMethodAccessorImpl.java:25)
+	at java.lang.reflect.Method.invoke(Method.java:597)
+	at org.apache.maven.surefire.booter.SurefireBooter.runSuitesInProcess(SurefireBooter.java:225)
+	at org.apache.maven.surefire.booter.SurefireBooter.main(SurefireBooter.java:747)
+

Added: directory/sandbox/oersoy/das.testing/das.ldap.parent/das.ldap/target/surefire-reports/org.apache.tuscany.das.ldap.learning.DualHotPartitionTest.txt
URL: http://svn.apache.org/viewvc/directory/sandbox/oersoy/das.testing/das.ldap.parent/das.ldap/target/surefire-reports/org.apache.tuscany.das.ldap.learning.DualHotPartitionTest.txt?view=auto&rev=543239
==============================================================================
--- directory/sandbox/oersoy/das.testing/das.ldap.parent/das.ldap/target/surefire-reports/org.apache.tuscany.das.ldap.learning.DualHotPartitionTest.txt (added)
+++ directory/sandbox/oersoy/das.testing/das.ldap.parent/das.ldap/target/surefire-reports/org.apache.tuscany.das.ldap.learning.DualHotPartitionTest.txt Thu May 31 12:58:13 2007
@@ -0,0 +1,4 @@
+-------------------------------------------------------------------------------
+Test set: org.apache.tuscany.das.ldap.learning.DualHotPartitionTest
+-------------------------------------------------------------------------------
+Tests run: 1, Failures: 0, Errors: 0, Skipped: 0, Time elapsed: 1.749 sec

Added: directory/sandbox/oersoy/das.testing/das.ldap.parent/das.ldap/target/surefire-reports/org.apache.tuscany.das.ldap.learning.HotPartitionTest.txt
URL: http://svn.apache.org/viewvc/directory/sandbox/oersoy/das.testing/das.ldap.parent/das.ldap/target/surefire-reports/org.apache.tuscany.das.ldap.learning.HotPartitionTest.txt?view=auto&rev=543239
==============================================================================
--- directory/sandbox/oersoy/das.testing/das.ldap.parent/das.ldap/target/surefire-reports/org.apache.tuscany.das.ldap.learning.HotPartitionTest.txt (added)
+++ directory/sandbox/oersoy/das.testing/das.ldap.parent/das.ldap/target/surefire-reports/org.apache.tuscany.das.ldap.learning.HotPartitionTest.txt Thu May 31 12:58:13 2007
@@ -0,0 +1,39 @@
+-------------------------------------------------------------------------------
+Test set: org.apache.tuscany.das.ldap.learning.HotPartitionTest
+-------------------------------------------------------------------------------
+Tests run: 1, Failures: 0, Errors: 1, Skipped: 0, Time elapsed: 0.101 sec <<< FAILURE!
+testCreateDASSubContext(org.apache.tuscany.das.ldap.learning.HotPartitionTest)  Time elapsed: 0.002 sec  <<< ERROR!
+org.apache.directory.shared.ldap.exception.LdapNameNotFoundException: ou=das
+	at org.apache.directory.server.core.partition.DefaultPartitionNexus.getBackend(DefaultPartitionNexus.java:987)
+	at org.apache.directory.server.core.partition.DefaultPartitionNexus.hasEntry(DefaultPartitionNexus.java:920)
+	at org.apache.directory.server.core.interceptor.InterceptorChain$1.hasEntry(InterceptorChain.java:157)
+	at org.apache.directory.server.core.interceptor.InterceptorChain$Entry$1.hasEntry(InterceptorChain.java:1326)
+	at org.apache.directory.server.core.interceptor.BaseInterceptor.hasEntry(BaseInterceptor.java:134)
+	at org.apache.directory.server.core.interceptor.InterceptorChain$Entry$1.hasEntry(InterceptorChain.java:1326)
+	at org.apache.directory.server.core.exception.ExceptionService.assertHasEntry(ExceptionService.java:405)
+	at org.apache.directory.server.core.exception.ExceptionService.lookup(ExceptionService.java:182)
+	at org.apache.directory.server.core.interceptor.InterceptorChain.lookup(InterceptorChain.java:849)
+	at org.apache.directory.server.core.partition.PartitionNexusProxy.lookup(PartitionNexusProxy.java:501)
+	at org.apache.directory.server.core.authz.AuthorizationService.hasEntry(AuthorizationService.java:599)
+	at org.apache.directory.server.core.interceptor.InterceptorChain$Entry$1.hasEntry(InterceptorChain.java:1326)
+	at org.apache.directory.server.core.interceptor.BaseInterceptor.hasEntry(BaseInterceptor.java:134)
+	at org.apache.directory.server.core.interceptor.InterceptorChain$Entry$1.hasEntry(InterceptorChain.java:1326)
+	at org.apache.directory.server.core.authn.AuthenticationService.hasEntry(AuthenticationService.java:258)
+	at org.apache.directory.server.core.interceptor.InterceptorChain$Entry$1.hasEntry(InterceptorChain.java:1326)
+	at org.apache.directory.server.core.normalization.NormalizationService.hasEntry(NormalizationService.java:333)
+	at org.apache.directory.server.core.interceptor.InterceptorChain.hasEntry(InterceptorChain.java:891)
+	at org.apache.directory.server.core.partition.PartitionNexusProxy.hasEntry(PartitionNexusProxy.java:547)
+	at org.apache.directory.server.core.partition.PartitionNexusProxy.hasEntry(PartitionNexusProxy.java:535)
+	at org.apache.directory.server.core.jndi.ServerContext.<init>(ServerContext.java:129)
+	at org.apache.directory.server.core.jndi.ServerDirContext.<init>(ServerDirContext.java:82)
+	at org.apache.directory.server.core.jndi.ServerLdapContext.<init>(ServerLdapContext.java:63)
+	at org.apache.directory.server.core.DefaultDirectoryService.getJndiContext(DefaultDirectoryService.java:170)
+	at org.apache.directory.server.core.jndi.AbstractContextFactory.getInitialContext(AbstractContextFactory.java:137)
+	at javax.naming.spi.NamingManager.getInitialContext(NamingManager.java:667)
+	at javax.naming.InitialContext.getDefaultInitCtx(InitialContext.java:288)
+	at javax.naming.InitialContext.init(InitialContext.java:223)
+	at javax.naming.InitialContext.<init>(InitialContext.java:197)
+	at javax.naming.directory.InitialDirContext.<init>(InitialDirContext.java:82)
+	at org.apache.tuscany.das.ldap.configuration.model.v100.impl.ConnectionManagerImpl.createDASPartition(ConnectionManagerImpl.java:629)
+	at org.apache.tuscany.das.ldap.learning.HotPartitionTest.testCreateDASSubContext(HotPartitionTest.java:29)
+

Added: directory/sandbox/oersoy/das.testing/das.ldap.parent/das.ldap/target/surefire-reports/org.apache.tuscany.das.ldap.learning.LearningTest.txt
URL: http://svn.apache.org/viewvc/directory/sandbox/oersoy/das.testing/das.ldap.parent/das.ldap/target/surefire-reports/org.apache.tuscany.das.ldap.learning.LearningTest.txt?view=auto&rev=543239
==============================================================================
--- directory/sandbox/oersoy/das.testing/das.ldap.parent/das.ldap/target/surefire-reports/org.apache.tuscany.das.ldap.learning.LearningTest.txt (added)
+++ directory/sandbox/oersoy/das.testing/das.ldap.parent/das.ldap/target/surefire-reports/org.apache.tuscany.das.ldap.learning.LearningTest.txt Thu May 31 12:58:13 2007
@@ -0,0 +1,202 @@
+-------------------------------------------------------------------------------
+Test set: org.apache.tuscany.das.ldap.learning.LearningTest
+-------------------------------------------------------------------------------
+Tests run: 6, Failures: 0, Errors: 6, Skipped: 0, Time elapsed: 0.152 sec <<< FAILURE!
+testCreateMComplexMayAttributeType(org.apache.tuscany.das.ldap.learning.LearningTest)  Time elapsed: 0.005 sec  <<< ERROR!
+javax.naming.NameAlreadyBoundException: [LDAP: error code 68 - failed to add entry cn=das,ou=schema: 2.5.4.3=das,2.5.4.11=schema already exists!]; remaining name 'cn=das'
+	at com.sun.jndi.ldap.LdapCtx.mapErrorCode(LdapCtx.java:3000)
+	at com.sun.jndi.ldap.LdapCtx.processReturnCode(LdapCtx.java:2951)
+	at com.sun.jndi.ldap.LdapCtx.processReturnCode(LdapCtx.java:2758)
+	at com.sun.jndi.ldap.LdapCtx.c_createSubcontext(LdapCtx.java:774)
+	at com.sun.jndi.toolkit.ctx.ComponentDirContext.p_createSubcontext(ComponentDirContext.java:319)
+	at com.sun.jndi.toolkit.ctx.PartialCompositeDirContext.createSubcontext(PartialCompositeDirContext.java:248)
+	at com.sun.jndi.toolkit.ctx.PartialCompositeDirContext.createSubcontext(PartialCompositeDirContext.java:236)
+	at javax.naming.directory.InitialDirContext.createSubcontext(InitialDirContext.java:178)
+	at org.apache.tuscany.das.ldap.schema.setup.test.DASContextsSetupTest.createDasContext(DASContextsSetupTest.java:105)
+	at org.apache.tuscany.das.ldap.schema.setup.test.DASContextsSetupTest.setUp(DASContextsSetupTest.java:49)
+	at junit.framework.TestCase.runBare(TestCase.java:125)
+	at junit.framework.TestResult$1.protect(TestResult.java:106)
+	at junit.framework.TestResult.runProtected(TestResult.java:124)
+	at junit.framework.TestResult.run(TestResult.java:109)
+	at junit.framework.TestCase.run(TestCase.java:118)
+	at junit.framework.TestSuite.runTest(TestSuite.java:208)
+	at junit.framework.TestSuite.run(TestSuite.java:203)
+	at sun.reflect.GeneratedMethodAccessor8.invoke(Unknown Source)
+	at sun.reflect.DelegatingMethodAccessorImpl.invoke(DelegatingMethodAccessorImpl.java:25)
+	at java.lang.reflect.Method.invoke(Method.java:597)
+	at org.apache.maven.surefire.junit.JUnitTestSet.execute(JUnitTestSet.java:210)
+	at org.apache.maven.surefire.suite.AbstractDirectoryTestSuite.executeTestSet(AbstractDirectoryTestSuite.java:135)
+	at org.apache.maven.surefire.suite.AbstractDirectoryTestSuite.execute(AbstractDirectoryTestSuite.java:122)
+	at org.apache.maven.surefire.Surefire.run(Surefire.java:129)
+	at sun.reflect.NativeMethodAccessorImpl.invoke0(Native Method)
+	at sun.reflect.NativeMethodAccessorImpl.invoke(NativeMethodAccessorImpl.java:39)
+	at sun.reflect.DelegatingMethodAccessorImpl.invoke(DelegatingMethodAccessorImpl.java:25)
+	at java.lang.reflect.Method.invoke(Method.java:597)
+	at org.apache.maven.surefire.booter.SurefireBooter.runSuitesInProcess(SurefireBooter.java:225)
+	at org.apache.maven.surefire.booter.SurefireBooter.main(SurefireBooter.java:747)
+
+testConnect(org.apache.tuscany.das.ldap.learning.LearningTest)  Time elapsed: 0.099 sec  <<< ERROR!
+javax.naming.NameAlreadyBoundException: [LDAP: error code 68 - failed to add entry cn=das,ou=schema: 2.5.4.3=das,2.5.4.11=schema already exists!]; remaining name 'cn=das'
+	at com.sun.jndi.ldap.LdapCtx.mapErrorCode(LdapCtx.java:3000)
+	at com.sun.jndi.ldap.LdapCtx.processReturnCode(LdapCtx.java:2951)
+	at com.sun.jndi.ldap.LdapCtx.processReturnCode(LdapCtx.java:2758)
+	at com.sun.jndi.ldap.LdapCtx.c_createSubcontext(LdapCtx.java:774)
+	at com.sun.jndi.toolkit.ctx.ComponentDirContext.p_createSubcontext(ComponentDirContext.java:319)
+	at com.sun.jndi.toolkit.ctx.PartialCompositeDirContext.createSubcontext(PartialCompositeDirContext.java:248)
+	at com.sun.jndi.toolkit.ctx.PartialCompositeDirContext.createSubcontext(PartialCompositeDirContext.java:236)
+	at javax.naming.directory.InitialDirContext.createSubcontext(InitialDirContext.java:178)
+	at org.apache.tuscany.das.ldap.schema.setup.test.DASContextsSetupTest.createDasContext(DASContextsSetupTest.java:105)
+	at org.apache.tuscany.das.ldap.schema.setup.test.DASContextsSetupTest.setUp(DASContextsSetupTest.java:49)
+	at junit.framework.TestCase.runBare(TestCase.java:125)
+	at junit.framework.TestResult$1.protect(TestResult.java:106)
+	at junit.framework.TestResult.runProtected(TestResult.java:124)
+	at junit.framework.TestResult.run(TestResult.java:109)
+	at junit.framework.TestCase.run(TestCase.java:118)
+	at junit.framework.TestSuite.runTest(TestSuite.java:208)
+	at junit.framework.TestSuite.run(TestSuite.java:203)
+	at sun.reflect.GeneratedMethodAccessor8.invoke(Unknown Source)
+	at sun.reflect.DelegatingMethodAccessorImpl.invoke(DelegatingMethodAccessorImpl.java:25)
+	at java.lang.reflect.Method.invoke(Method.java:597)
+	at org.apache.maven.surefire.junit.JUnitTestSet.execute(JUnitTestSet.java:210)
+	at org.apache.maven.surefire.suite.AbstractDirectoryTestSuite.executeTestSet(AbstractDirectoryTestSuite.java:135)
+	at org.apache.maven.surefire.suite.AbstractDirectoryTestSuite.execute(AbstractDirectoryTestSuite.java:122)
+	at org.apache.maven.surefire.Surefire.run(Surefire.java:129)
+	at sun.reflect.NativeMethodAccessorImpl.invoke0(Native Method)
+	at sun.reflect.NativeMethodAccessorImpl.invoke(NativeMethodAccessorImpl.java:39)
+	at sun.reflect.DelegatingMethodAccessorImpl.invoke(DelegatingMethodAccessorImpl.java:25)
+	at java.lang.reflect.Method.invoke(Method.java:597)
+	at org.apache.maven.surefire.booter.SurefireBooter.runSuitesInProcess(SurefireBooter.java:225)
+	at org.apache.maven.surefire.booter.SurefireBooter.main(SurefireBooter.java:747)
+
+testCreateEcoreContext(org.apache.tuscany.das.ldap.learning.LearningTest)  Time elapsed: 0.005 sec  <<< ERROR!
+javax.naming.NameAlreadyBoundException: [LDAP: error code 68 - failed to add entry cn=das,ou=schema: 2.5.4.3=das,2.5.4.11=schema already exists!]; remaining name 'cn=das'
+	at com.sun.jndi.ldap.LdapCtx.mapErrorCode(LdapCtx.java:3000)
+	at com.sun.jndi.ldap.LdapCtx.processReturnCode(LdapCtx.java:2951)
+	at com.sun.jndi.ldap.LdapCtx.processReturnCode(LdapCtx.java:2758)
+	at com.sun.jndi.ldap.LdapCtx.c_createSubcontext(LdapCtx.java:774)
+	at com.sun.jndi.toolkit.ctx.ComponentDirContext.p_createSubcontext(ComponentDirContext.java:319)
+	at com.sun.jndi.toolkit.ctx.PartialCompositeDirContext.createSubcontext(PartialCompositeDirContext.java:248)
+	at com.sun.jndi.toolkit.ctx.PartialCompositeDirContext.createSubcontext(PartialCompositeDirContext.java:236)
+	at javax.naming.directory.InitialDirContext.createSubcontext(InitialDirContext.java:178)
+	at org.apache.tuscany.das.ldap.schema.setup.test.DASContextsSetupTest.createDasContext(DASContextsSetupTest.java:105)
+	at org.apache.tuscany.das.ldap.schema.setup.test.DASContextsSetupTest.setUp(DASContextsSetupTest.java:49)
+	at junit.framework.TestCase.runBare(TestCase.java:125)
+	at junit.framework.TestResult$1.protect(TestResult.java:106)
+	at junit.framework.TestResult.runProtected(TestResult.java:124)
+	at junit.framework.TestResult.run(TestResult.java:109)
+	at junit.framework.TestCase.run(TestCase.java:118)
+	at junit.framework.TestSuite.runTest(TestSuite.java:208)
+	at junit.framework.TestSuite.run(TestSuite.java:203)
+	at sun.reflect.GeneratedMethodAccessor8.invoke(Unknown Source)
+	at sun.reflect.DelegatingMethodAccessorImpl.invoke(DelegatingMethodAccessorImpl.java:25)
+	at java.lang.reflect.Method.invoke(Method.java:597)
+	at org.apache.maven.surefire.junit.JUnitTestSet.execute(JUnitTestSet.java:210)
+	at org.apache.maven.surefire.suite.AbstractDirectoryTestSuite.executeTestSet(AbstractDirectoryTestSuite.java:135)
+	at org.apache.maven.surefire.suite.AbstractDirectoryTestSuite.execute(AbstractDirectoryTestSuite.java:122)
+	at org.apache.maven.surefire.Surefire.run(Surefire.java:129)
+	at sun.reflect.NativeMethodAccessorImpl.invoke0(Native Method)
+	at sun.reflect.NativeMethodAccessorImpl.invoke(NativeMethodAccessorImpl.java:39)
+	at sun.reflect.DelegatingMethodAccessorImpl.invoke(DelegatingMethodAccessorImpl.java:25)
+	at java.lang.reflect.Method.invoke(Method.java:597)
+	at org.apache.maven.surefire.booter.SurefireBooter.runSuitesInProcess(SurefireBooter.java:225)
+	at org.apache.maven.surefire.booter.SurefireBooter.main(SurefireBooter.java:747)
+
+testCreateEcoreAttributeTypesContext(org.apache.tuscany.das.ldap.learning.LearningTest)  Time elapsed: 0.005 sec  <<< ERROR!
+javax.naming.NameAlreadyBoundException: [LDAP: error code 68 - failed to add entry cn=das,ou=schema: 2.5.4.3=das,2.5.4.11=schema already exists!]; remaining name 'cn=das'
+	at com.sun.jndi.ldap.LdapCtx.mapErrorCode(LdapCtx.java:3000)
+	at com.sun.jndi.ldap.LdapCtx.processReturnCode(LdapCtx.java:2951)
+	at com.sun.jndi.ldap.LdapCtx.processReturnCode(LdapCtx.java:2758)
+	at com.sun.jndi.ldap.LdapCtx.c_createSubcontext(LdapCtx.java:774)
+	at com.sun.jndi.toolkit.ctx.ComponentDirContext.p_createSubcontext(ComponentDirContext.java:319)
+	at com.sun.jndi.toolkit.ctx.PartialCompositeDirContext.createSubcontext(PartialCompositeDirContext.java:248)
+	at com.sun.jndi.toolkit.ctx.PartialCompositeDirContext.createSubcontext(PartialCompositeDirContext.java:236)
+	at javax.naming.directory.InitialDirContext.createSubcontext(InitialDirContext.java:178)
+	at org.apache.tuscany.das.ldap.schema.setup.test.DASContextsSetupTest.createDasContext(DASContextsSetupTest.java:105)
+	at org.apache.tuscany.das.ldap.schema.setup.test.DASContextsSetupTest.setUp(DASContextsSetupTest.java:49)
+	at junit.framework.TestCase.runBare(TestCase.java:125)
+	at junit.framework.TestResult$1.protect(TestResult.java:106)
+	at junit.framework.TestResult.runProtected(TestResult.java:124)
+	at junit.framework.TestResult.run(TestResult.java:109)
+	at junit.framework.TestCase.run(TestCase.java:118)
+	at junit.framework.TestSuite.runTest(TestSuite.java:208)
+	at junit.framework.TestSuite.run(TestSuite.java:203)
+	at sun.reflect.GeneratedMethodAccessor8.invoke(Unknown Source)
+	at sun.reflect.DelegatingMethodAccessorImpl.invoke(DelegatingMethodAccessorImpl.java:25)
+	at java.lang.reflect.Method.invoke(Method.java:597)
+	at org.apache.maven.surefire.junit.JUnitTestSet.execute(JUnitTestSet.java:210)
+	at org.apache.maven.surefire.suite.AbstractDirectoryTestSuite.executeTestSet(AbstractDirectoryTestSuite.java:135)
+	at org.apache.maven.surefire.suite.AbstractDirectoryTestSuite.execute(AbstractDirectoryTestSuite.java:122)
+	at org.apache.maven.surefire.Surefire.run(Surefire.java:129)
+	at sun.reflect.NativeMethodAccessorImpl.invoke0(Native Method)
+	at sun.reflect.NativeMethodAccessorImpl.invoke(NativeMethodAccessorImpl.java:39)
+	at sun.reflect.DelegatingMethodAccessorImpl.invoke(DelegatingMethodAccessorImpl.java:25)
+	at java.lang.reflect.Method.invoke(Method.java:597)
+	at org.apache.maven.surefire.booter.SurefireBooter.runSuitesInProcess(SurefireBooter.java:225)
+	at org.apache.maven.surefire.booter.SurefireBooter.main(SurefireBooter.java:747)
+
+testCreateDasSyntaxesContext(org.apache.tuscany.das.ldap.learning.LearningTest)  Time elapsed: 0.007 sec  <<< ERROR!
+javax.naming.NameAlreadyBoundException: [LDAP: error code 68 - failed to add entry cn=das,ou=schema: 2.5.4.3=das,2.5.4.11=schema already exists!]; remaining name 'cn=das'
+	at com.sun.jndi.ldap.LdapCtx.mapErrorCode(LdapCtx.java:3000)
+	at com.sun.jndi.ldap.LdapCtx.processReturnCode(LdapCtx.java:2951)
+	at com.sun.jndi.ldap.LdapCtx.processReturnCode(LdapCtx.java:2758)
+	at com.sun.jndi.ldap.LdapCtx.c_createSubcontext(LdapCtx.java:774)
+	at com.sun.jndi.toolkit.ctx.ComponentDirContext.p_createSubcontext(ComponentDirContext.java:319)
+	at com.sun.jndi.toolkit.ctx.PartialCompositeDirContext.createSubcontext(PartialCompositeDirContext.java:248)
+	at com.sun.jndi.toolkit.ctx.PartialCompositeDirContext.createSubcontext(PartialCompositeDirContext.java:236)
+	at javax.naming.directory.InitialDirContext.createSubcontext(InitialDirContext.java:178)
+	at org.apache.tuscany.das.ldap.schema.setup.test.DASContextsSetupTest.createDasContext(DASContextsSetupTest.java:105)
+	at org.apache.tuscany.das.ldap.schema.setup.test.DASContextsSetupTest.setUp(DASContextsSetupTest.java:49)
+	at junit.framework.TestCase.runBare(TestCase.java:125)
+	at junit.framework.TestResult$1.protect(TestResult.java:106)
+	at junit.framework.TestResult.runProtected(TestResult.java:124)
+	at junit.framework.TestResult.run(TestResult.java:109)
+	at junit.framework.TestCase.run(TestCase.java:118)
+	at junit.framework.TestSuite.runTest(TestSuite.java:208)
+	at junit.framework.TestSuite.run(TestSuite.java:203)
+	at sun.reflect.GeneratedMethodAccessor8.invoke(Unknown Source)
+	at sun.reflect.DelegatingMethodAccessorImpl.invoke(DelegatingMethodAccessorImpl.java:25)
+	at java.lang.reflect.Method.invoke(Method.java:597)
+	at org.apache.maven.surefire.junit.JUnitTestSet.execute(JUnitTestSet.java:210)
+	at org.apache.maven.surefire.suite.AbstractDirectoryTestSuite.executeTestSet(AbstractDirectoryTestSuite.java:135)
+	at org.apache.maven.surefire.suite.AbstractDirectoryTestSuite.execute(AbstractDirectoryTestSuite.java:122)
+	at org.apache.maven.surefire.Surefire.run(Surefire.java:129)
+	at sun.reflect.NativeMethodAccessorImpl.invoke0(Native Method)
+	at sun.reflect.NativeMethodAccessorImpl.invoke(NativeMethodAccessorImpl.java:39)
+	at sun.reflect.DelegatingMethodAccessorImpl.invoke(DelegatingMethodAccessorImpl.java:25)
+	at java.lang.reflect.Method.invoke(Method.java:597)
+	at org.apache.maven.surefire.booter.SurefireBooter.runSuitesInProcess(SurefireBooter.java:225)
+	at org.apache.maven.surefire.booter.SurefireBooter.main(SurefireBooter.java:747)
+
+testCreateDasObjectClassesContext(org.apache.tuscany.das.ldap.learning.LearningTest)  Time elapsed: 0.005 sec  <<< ERROR!
+javax.naming.NameAlreadyBoundException: [LDAP: error code 68 - failed to add entry cn=das,ou=schema: 2.5.4.3=das,2.5.4.11=schema already exists!]; remaining name 'cn=das'
+	at com.sun.jndi.ldap.LdapCtx.mapErrorCode(LdapCtx.java:3000)
+	at com.sun.jndi.ldap.LdapCtx.processReturnCode(LdapCtx.java:2951)
+	at com.sun.jndi.ldap.LdapCtx.processReturnCode(LdapCtx.java:2758)
+	at com.sun.jndi.ldap.LdapCtx.c_createSubcontext(LdapCtx.java:774)
+	at com.sun.jndi.toolkit.ctx.ComponentDirContext.p_createSubcontext(ComponentDirContext.java:319)
+	at com.sun.jndi.toolkit.ctx.PartialCompositeDirContext.createSubcontext(PartialCompositeDirContext.java:248)
+	at com.sun.jndi.toolkit.ctx.PartialCompositeDirContext.createSubcontext(PartialCompositeDirContext.java:236)
+	at javax.naming.directory.InitialDirContext.createSubcontext(InitialDirContext.java:178)
+	at org.apache.tuscany.das.ldap.schema.setup.test.DASContextsSetupTest.createDasContext(DASContextsSetupTest.java:105)
+	at org.apache.tuscany.das.ldap.schema.setup.test.DASContextsSetupTest.setUp(DASContextsSetupTest.java:49)
+	at junit.framework.TestCase.runBare(TestCase.java:125)
+	at junit.framework.TestResult$1.protect(TestResult.java:106)
+	at junit.framework.TestResult.runProtected(TestResult.java:124)
+	at junit.framework.TestResult.run(TestResult.java:109)
+	at junit.framework.TestCase.run(TestCase.java:118)
+	at junit.framework.TestSuite.runTest(TestSuite.java:208)
+	at junit.framework.TestSuite.run(TestSuite.java:203)
+	at sun.reflect.GeneratedMethodAccessor8.invoke(Unknown Source)
+	at sun.reflect.DelegatingMethodAccessorImpl.invoke(DelegatingMethodAccessorImpl.java:25)
+	at java.lang.reflect.Method.invoke(Method.java:597)
+	at org.apache.maven.surefire.junit.JUnitTestSet.execute(JUnitTestSet.java:210)
+	at org.apache.maven.surefire.suite.AbstractDirectoryTestSuite.executeTestSet(AbstractDirectoryTestSuite.java:135)
+	at org.apache.maven.surefire.suite.AbstractDirectoryTestSuite.execute(AbstractDirectoryTestSuite.java:122)
+	at org.apache.maven.surefire.Surefire.run(Surefire.java:129)
+	at sun.reflect.NativeMethodAccessorImpl.invoke0(Native Method)
+	at sun.reflect.NativeMethodAccessorImpl.invoke(NativeMethodAccessorImpl.java:39)
+	at sun.reflect.DelegatingMethodAccessorImpl.invoke(DelegatingMethodAccessorImpl.java:25)
+	at java.lang.reflect.Method.invoke(Method.java:597)
+	at org.apache.maven.surefire.booter.SurefireBooter.runSuitesInProcess(SurefireBooter.java:225)
+	at org.apache.maven.surefire.booter.SurefireBooter.main(SurefireBooter.java:747)
+

Added: directory/sandbox/oersoy/das.testing/das.ldap.parent/das.ldap/target/surefire-reports/org.apache.tuscany.das.ldap.modify.test.DataObjectModififierTest.txt
URL: http://svn.apache.org/viewvc/directory/sandbox/oersoy/das.testing/das.ldap.parent/das.ldap/target/surefire-reports/org.apache.tuscany.das.ldap.modify.test.DataObjectModififierTest.txt?view=auto&rev=543239
==============================================================================
--- directory/sandbox/oersoy/das.testing/das.ldap.parent/das.ldap/target/surefire-reports/org.apache.tuscany.das.ldap.modify.test.DataObjectModififierTest.txt (added)
+++ directory/sandbox/oersoy/das.testing/das.ldap.parent/das.ldap/target/surefire-reports/org.apache.tuscany.das.ldap.modify.test.DataObjectModififierTest.txt Thu May 31 12:58:13 2007
@@ -0,0 +1,103 @@
+-------------------------------------------------------------------------------
+Test set: org.apache.tuscany.das.ldap.modify.test.DataObjectModififierTest
+-------------------------------------------------------------------------------
+Tests run: 3, Failures: 0, Errors: 3, Skipped: 0, Time elapsed: 0.133 sec <<< FAILURE!
+testConnect(org.apache.tuscany.das.ldap.modify.test.DataObjectModififierTest)  Time elapsed: 0.005 sec  <<< ERROR!
+javax.naming.NameAlreadyBoundException: [LDAP: error code 68 - failed to add entry cn=xsd,ou=schema: 2.5.4.3=xsd,2.5.4.11=schema already exists!]; remaining name 'cn=xsd'
+	at com.sun.jndi.ldap.LdapCtx.mapErrorCode(LdapCtx.java:3000)
+	at com.sun.jndi.ldap.LdapCtx.processReturnCode(LdapCtx.java:2951)
+	at com.sun.jndi.ldap.LdapCtx.processReturnCode(LdapCtx.java:2758)
+	at com.sun.jndi.ldap.LdapCtx.c_createSubcontext(LdapCtx.java:774)
+	at com.sun.jndi.toolkit.ctx.ComponentDirContext.p_createSubcontext(ComponentDirContext.java:319)
+	at com.sun.jndi.toolkit.ctx.PartialCompositeDirContext.createSubcontext(PartialCompositeDirContext.java:248)
+	at com.sun.jndi.toolkit.ctx.PartialCompositeDirContext.createSubcontext(PartialCompositeDirContext.java:236)
+	at javax.naming.directory.InitialDirContext.createSubcontext(InitialDirContext.java:178)
+	at org.apache.tuscany.das.ldap.schema.setup.test.XSDContextsSetupTest.createEcoreContext(XSDContextsSetupTest.java:66)
+	at org.apache.tuscany.das.ldap.schema.setup.test.XSDContextsSetupTest.setUp(XSDContextsSetupTest.java:32)
+	at junit.framework.TestCase.runBare(TestCase.java:125)
+	at junit.framework.TestResult$1.protect(TestResult.java:106)
+	at junit.framework.TestResult.runProtected(TestResult.java:124)
+	at junit.framework.TestResult.run(TestResult.java:109)
+	at junit.framework.TestCase.run(TestCase.java:118)
+	at junit.framework.TestSuite.runTest(TestSuite.java:208)
+	at junit.framework.TestSuite.run(TestSuite.java:203)
+	at sun.reflect.GeneratedMethodAccessor8.invoke(Unknown Source)
+	at sun.reflect.DelegatingMethodAccessorImpl.invoke(DelegatingMethodAccessorImpl.java:25)
+	at java.lang.reflect.Method.invoke(Method.java:597)
+	at org.apache.maven.surefire.junit.JUnitTestSet.execute(JUnitTestSet.java:210)
+	at org.apache.maven.surefire.suite.AbstractDirectoryTestSuite.executeTestSet(AbstractDirectoryTestSuite.java:135)
+	at org.apache.maven.surefire.suite.AbstractDirectoryTestSuite.execute(AbstractDirectoryTestSuite.java:122)
+	at org.apache.maven.surefire.Surefire.run(Surefire.java:129)
+	at sun.reflect.NativeMethodAccessorImpl.invoke0(Native Method)
+	at sun.reflect.NativeMethodAccessorImpl.invoke(NativeMethodAccessorImpl.java:39)
+	at sun.reflect.DelegatingMethodAccessorImpl.invoke(DelegatingMethodAccessorImpl.java:25)
+	at java.lang.reflect.Method.invoke(Method.java:597)
+	at org.apache.maven.surefire.booter.SurefireBooter.runSuitesInProcess(SurefireBooter.java:225)
+	at org.apache.maven.surefire.booter.SurefireBooter.main(SurefireBooter.java:747)
+
+testCreateEcoreContext(org.apache.tuscany.das.ldap.modify.test.DataObjectModififierTest)  Time elapsed: 0.098 sec  <<< ERROR!
+javax.naming.NameAlreadyBoundException: [LDAP: error code 68 - failed to add entry cn=xsd,ou=schema: 2.5.4.3=xsd,2.5.4.11=schema already exists!]; remaining name 'cn=xsd'
+	at com.sun.jndi.ldap.LdapCtx.mapErrorCode(LdapCtx.java:3000)
+	at com.sun.jndi.ldap.LdapCtx.processReturnCode(LdapCtx.java:2951)
+	at com.sun.jndi.ldap.LdapCtx.processReturnCode(LdapCtx.java:2758)
+	at com.sun.jndi.ldap.LdapCtx.c_createSubcontext(LdapCtx.java:774)
+	at com.sun.jndi.toolkit.ctx.ComponentDirContext.p_createSubcontext(ComponentDirContext.java:319)
+	at com.sun.jndi.toolkit.ctx.PartialCompositeDirContext.createSubcontext(PartialCompositeDirContext.java:248)
+	at com.sun.jndi.toolkit.ctx.PartialCompositeDirContext.createSubcontext(PartialCompositeDirContext.java:236)
+	at javax.naming.directory.InitialDirContext.createSubcontext(InitialDirContext.java:178)
+	at org.apache.tuscany.das.ldap.schema.setup.test.XSDContextsSetupTest.createEcoreContext(XSDContextsSetupTest.java:66)
+	at org.apache.tuscany.das.ldap.schema.setup.test.XSDContextsSetupTest.setUp(XSDContextsSetupTest.java:32)
+	at junit.framework.TestCase.runBare(TestCase.java:125)
+	at junit.framework.TestResult$1.protect(TestResult.java:106)
+	at junit.framework.TestResult.runProtected(TestResult.java:124)
+	at junit.framework.TestResult.run(TestResult.java:109)
+	at junit.framework.TestCase.run(TestCase.java:118)
+	at junit.framework.TestSuite.runTest(TestSuite.java:208)
+	at junit.framework.TestSuite.run(TestSuite.java:203)
+	at sun.reflect.GeneratedMethodAccessor8.invoke(Unknown Source)
+	at sun.reflect.DelegatingMethodAccessorImpl.invoke(DelegatingMethodAccessorImpl.java:25)
+	at java.lang.reflect.Method.invoke(Method.java:597)
+	at org.apache.maven.surefire.junit.JUnitTestSet.execute(JUnitTestSet.java:210)
+	at org.apache.maven.surefire.suite.AbstractDirectoryTestSuite.executeTestSet(AbstractDirectoryTestSuite.java:135)
+	at org.apache.maven.surefire.suite.AbstractDirectoryTestSuite.execute(AbstractDirectoryTestSuite.java:122)
+	at org.apache.maven.surefire.Surefire.run(Surefire.java:129)
+	at sun.reflect.NativeMethodAccessorImpl.invoke0(Native Method)
+	at sun.reflect.NativeMethodAccessorImpl.invoke(NativeMethodAccessorImpl.java:39)
+	at sun.reflect.DelegatingMethodAccessorImpl.invoke(DelegatingMethodAccessorImpl.java:25)
+	at java.lang.reflect.Method.invoke(Method.java:597)
+	at org.apache.maven.surefire.booter.SurefireBooter.runSuitesInProcess(SurefireBooter.java:225)
+	at org.apache.maven.surefire.booter.SurefireBooter.main(SurefireBooter.java:747)
+
+testCreateEcoreSyntaxesContext(org.apache.tuscany.das.ldap.modify.test.DataObjectModififierTest)  Time elapsed: 0.006 sec  <<< ERROR!
+javax.naming.NameAlreadyBoundException: [LDAP: error code 68 - failed to add entry cn=xsd,ou=schema: 2.5.4.3=xsd,2.5.4.11=schema already exists!]; remaining name 'cn=xsd'
+	at com.sun.jndi.ldap.LdapCtx.mapErrorCode(LdapCtx.java:3000)
+	at com.sun.jndi.ldap.LdapCtx.processReturnCode(LdapCtx.java:2951)
+	at com.sun.jndi.ldap.LdapCtx.processReturnCode(LdapCtx.java:2758)
+	at com.sun.jndi.ldap.LdapCtx.c_createSubcontext(LdapCtx.java:774)
+	at com.sun.jndi.toolkit.ctx.ComponentDirContext.p_createSubcontext(ComponentDirContext.java:319)
+	at com.sun.jndi.toolkit.ctx.PartialCompositeDirContext.createSubcontext(PartialCompositeDirContext.java:248)
+	at com.sun.jndi.toolkit.ctx.PartialCompositeDirContext.createSubcontext(PartialCompositeDirContext.java:236)
+	at javax.naming.directory.InitialDirContext.createSubcontext(InitialDirContext.java:178)
+	at org.apache.tuscany.das.ldap.schema.setup.test.XSDContextsSetupTest.createEcoreContext(XSDContextsSetupTest.java:66)
+	at org.apache.tuscany.das.ldap.schema.setup.test.XSDContextsSetupTest.setUp(XSDContextsSetupTest.java:32)
+	at junit.framework.TestCase.runBare(TestCase.java:125)
+	at junit.framework.TestResult$1.protect(TestResult.java:106)
+	at junit.framework.TestResult.runProtected(TestResult.java:124)
+	at junit.framework.TestResult.run(TestResult.java:109)
+	at junit.framework.TestCase.run(TestCase.java:118)
+	at junit.framework.TestSuite.runTest(TestSuite.java:208)
+	at junit.framework.TestSuite.run(TestSuite.java:203)
+	at sun.reflect.GeneratedMethodAccessor8.invoke(Unknown Source)
+	at sun.reflect.DelegatingMethodAccessorImpl.invoke(DelegatingMethodAccessorImpl.java:25)
+	at java.lang.reflect.Method.invoke(Method.java:597)
+	at org.apache.maven.surefire.junit.JUnitTestSet.execute(JUnitTestSet.java:210)
+	at org.apache.maven.surefire.suite.AbstractDirectoryTestSuite.executeTestSet(AbstractDirectoryTestSuite.java:135)
+	at org.apache.maven.surefire.suite.AbstractDirectoryTestSuite.execute(AbstractDirectoryTestSuite.java:122)
+	at org.apache.maven.surefire.Surefire.run(Surefire.java:129)
+	at sun.reflect.NativeMethodAccessorImpl.invoke0(Native Method)
+	at sun.reflect.NativeMethodAccessorImpl.invoke(NativeMethodAccessorImpl.java:39)
+	at sun.reflect.DelegatingMethodAccessorImpl.invoke(DelegatingMethodAccessorImpl.java:25)
+	at java.lang.reflect.Method.invoke(Method.java:597)
+	at org.apache.maven.surefire.booter.SurefireBooter.runSuitesInProcess(SurefireBooter.java:225)
+	at org.apache.maven.surefire.booter.SurefireBooter.main(SurefireBooter.java:747)
+



Mime
View raw message