deltaspike-commits mailing list archives

Site index · List index
Message view « Date » · « Thread »
Top « Date » · « Thread »
From Apache Jenkins Server <jenk...@builds.apache.org>
Subject Build failed in Jenkins: DeltaSpike Deploy #2211
Date Wed, 14 Feb 2018 13:42:17 GMT
See <https://builds.apache.org/job/DeltaSpike%20Deploy/2211/display/redirect>

------------------------------------------
Started by timer
[EnvInject] - Loading node environment variables.
Building remotely on H32 (ubuntu xenial) in workspace /home/jenkins/jenkins-slave/workspace/DeltaSpike
Deploy
[WS-CLEANUP] Deleting project workspace...
[WS-CLEANUP] Done
Cloning the remote Git repository
Cloning repository https://git-wip-us.apache.org/repos/asf/deltaspike.git
 > git init /home/jenkins/jenkins-slave/workspace/DeltaSpike Deploy # timeout=10
Fetching upstream changes from https://git-wip-us.apache.org/repos/asf/deltaspike.git
 > git --version # timeout=10
 > git fetch --tags --progress https://git-wip-us.apache.org/repos/asf/deltaspike.git +refs/heads/*:refs/remotes/origin/*
 > git config remote.origin.url https://git-wip-us.apache.org/repos/asf/deltaspike.git
# timeout=10
 > git config --add remote.origin.fetch +refs/heads/*:refs/remotes/origin/* # timeout=10
 > git config remote.origin.url https://git-wip-us.apache.org/repos/asf/deltaspike.git
# timeout=10
Fetching upstream changes from https://git-wip-us.apache.org/repos/asf/deltaspike.git
 > git fetch --tags --progress https://git-wip-us.apache.org/repos/asf/deltaspike.git +refs/heads/*:refs/remotes/origin/*
Seen branch in repository origin/deltaspike-0.1-incubating
Seen branch in repository origin/deltaspike-0.2-incubating
Seen branch in repository origin/deltaspike-0.3-incubating
Seen branch in repository origin/deltaspike-0.4
Seen branch in repository origin/deltaspike-0.5
Seen branch in repository origin/deltaspike-0.6
Seen branch in repository origin/deltaspike-0.7
Seen branch in repository origin/deltaspike-1.0.0
Seen branch in repository origin/deltaspike-1.0.1
Seen branch in repository origin/deltaspike-1.0.2
Seen branch in repository origin/deltaspike-1.0.3
Seen branch in repository origin/deltaspike-1.1.0
Seen branch in repository origin/deltaspike-1.2.0
Seen branch in repository origin/deltaspike-1.2.1
Seen branch in repository origin/ds-1.4.0
Seen branch in repository origin/ds-1.4.1
Seen branch in repository origin/ds-1.4.2
Seen branch in repository origin/ds-1.5.0
Seen branch in repository origin/ds-1.5.1
Seen branch in repository origin/ds-1.5.2
Seen branch in repository origin/ds-1.5.3
Seen branch in repository origin/ds-1.5.4
Seen branch in repository origin/ds-1.6.0
Seen branch in repository origin/ds-1.6.1
Seen branch in repository origin/ds-1.7.0
Seen branch in repository origin/ds-1.7.1
Seen branch in repository origin/ds-1.7.2
Seen branch in repository origin/master
Seen branch in repository origin/release_deltaspike_1.8.0
Seen 29 remote branches
 > git tag -l # timeout=10
 > git rev-parse refs/tags/deltaspike-1.5.4^{commit} # timeout=10
 > git rev-parse refs/tags/deltaspike-1.5.3^{commit} # timeout=10
 > git rev-parse refs/tags/deltaspike-1.5.2^{commit} # timeout=10
 > git rev-parse refs/tags/deltaspike-project-1.0.1^{commit} # timeout=10
 > git rev-parse refs/tags/deltaspike-project-1.1.0^{commit} # timeout=10
 > git rev-parse refs/tags/deltaspike-1.4.2^{commit} # timeout=10
 > git rev-parse refs/tags/deltaspike-1.5.1^{commit} # timeout=10
 > git rev-parse refs/tags/deltaspike-project-1.0.0^{commit} # timeout=10
 > git rev-parse refs/tags/deltaspike-1.4.1^{commit} # timeout=10
 > git rev-parse refs/tags/deltaspike-1.5.0^{commit} # timeout=10
 > git rev-parse refs/tags/deltaspike-project-1.0.3^{commit} # timeout=10
 > git rev-parse refs/tags/deltaspike-project-1.2.1^{commit} # timeout=10
 > git rev-parse refs/tags/deltaspike-1.4.0^{commit} # timeout=10
 > git rev-parse refs/tags/deltaspike-project-1.0.2^{commit} # timeout=10
 > git rev-parse refs/tags/deltaspike-project-1.2.0^{commit} # timeout=10
 > git rev-parse refs/tags/deltaspike-root-1.3.0^{commit} # timeout=10
 > git rev-parse refs/tags/deltaspike-project-0.3-incubating^{commit} # timeout=10
 > git rev-parse refs/tags/deltaspike-project-0.1-incubating^{commit} # timeout=10
 > git rev-parse refs/tags/deltaspike-project-0.2-incubating^{commit} # timeout=10
 > git rev-parse refs/tags/deltaspike-project-0.5^{commit} # timeout=10
 > git rev-parse refs/tags/deltaspike-project-0.6^{commit} # timeout=10
 > git rev-parse refs/tags/deltaspike-project-0.7^{commit} # timeout=10
 > git rev-parse refs/tags/deltaspike-1.6.0^{commit} # timeout=10
 > git rev-parse refs/tags/deltaspike-1.6.1^{commit} # timeout=10
 > git rev-parse refs/tags/deltaspike-1.7.0^{commit} # timeout=10
 > git rev-parse refs/tags/deltaspike-1.7.1^{commit} # timeout=10
 > git rev-parse refs/tags/deltaspike-1.8.0^{commit} # timeout=10
 > git rev-parse refs/tags/deltaspike-1.7.2^{commit} # timeout=10
 > git rev-parse refs/tags/deltaspike-1.8.1^{commit} # timeout=10
 > git rev-parse refs/tags/deltaspike-project-0.4^{commit} # timeout=10
Checking out Revision 1af137d843c9ba2e07015e654a4d84b59fc2a738 (origin/master)
 > git config core.sparsecheckout # timeout=10
 > git checkout -f 1af137d843c9ba2e07015e654a4d84b59fc2a738
Commit message: "fix release date for 1.8.0"
 > git rev-list 1af137d843c9ba2e07015e654a4d84b59fc2a738 # timeout=10
Parsing POMs
Modules changed, recalculating dependency graph
Established TCP socket on 45054
maven33-agent.jar already up to date
maven33-interceptor.jar already up to date
maven3-interceptor-commons.jar already up to date
[DeltaSpike Deploy] $ /home/jenkins/tools/java/latest1.8/bin/java -Xmx2g -Xms256m -cp /home/jenkins/jenkins-slave/maven33-agent.jar:/home/jenkins/tools/maven/apache-maven-3.3.3/boot/plexus-classworlds-2.5.2.jar:/home/jenkins/tools/maven/apache-maven-3.3.3/conf/logging
jenkins.maven3.agent.Maven33Main /home/jenkins/tools/maven/apache-maven-3.3.3 /home/jenkins/jenkins-slave/slave.jar
/home/jenkins/jenkins-slave/maven33-interceptor.jar /home/jenkins/jenkins-slave/maven3-interceptor-commons.jar
45054
ERROR: Failed to parse POMs
java.io.IOException: java.io.IOException: Unexpected termination of the channel
	at hudson.remoting.FastPipedInputStream.read(FastPipedInputStream.java:169)
	at java.io.BufferedInputStream.fill(BufferedInputStream.java:246)
	at java.io.BufferedInputStream.read(BufferedInputStream.java:265)
	at hudson.remoting.ChannelBuilder.negotiate(ChannelBuilder.java:406)
	at hudson.remoting.ChannelBuilder.build(ChannelBuilder.java:353)
	at hudson.slaves.Channels.forProcess(Channels.java:115)
	at hudson.maven.AbstractMavenProcessFactory.newProcess(AbstractMavenProcessFactory.java:294)
	at hudson.maven.ProcessCache.get(ProcessCache.java:236)
	at hudson.maven.MavenModuleSetBuild$MavenModuleSetBuildExecution.doRun(MavenModuleSetBuild.java:804)
	at hudson.model.AbstractBuild$AbstractBuildExecution.run(AbstractBuild.java:504)
	at hudson.model.Run.execute(Run.java:1724)
	at hudson.maven.MavenModuleSetBuild.run(MavenModuleSetBuild.java:543)
	at hudson.model.ResourceController.execute(ResourceController.java:97)
	at hudson.model.Executor.run(Executor.java:421)
Caused by: java.io.IOException: Unexpected termination of the channel
	at hudson.remoting.SynchronousCommandTransport$ReaderThread.run(SynchronousCommandTransport.java:77)
Caused by: java.io.EOFException
	at java.io.ObjectInputStream$PeekInputStream.readFully(ObjectInputStream.java:2675)
	at java.io.ObjectInputStream$BlockDataInputStream.readShort(ObjectInputStream.java:3150)
	at java.io.ObjectInputStream.readStreamHeader(ObjectInputStream.java:859)
	at java.io.ObjectInputStream.<init>(ObjectInputStream.java:355)
	at hudson.remoting.ObjectInputStreamEx.<init>(ObjectInputStreamEx.java:48)
	at hudson.remoting.AbstractSynchronousByteArrayCommandTransport.read(AbstractSynchronousByteArrayCommandTransport.java:35)
	at hudson.remoting.SynchronousCommandTransport$ReaderThread.run(SynchronousCommandTransport.java:63)
FATAL: Remote call on H32 failed. The channel is closing down or has closed down
java.io.EOFException
	at java.io.ObjectInputStream$PeekInputStream.readFully(ObjectInputStream.java:2675)
	at java.io.ObjectInputStream$BlockDataInputStream.readShort(ObjectInputStream.java:3150)
	at java.io.ObjectInputStream.readStreamHeader(ObjectInputStream.java:859)
	at java.io.ObjectInputStream.<init>(ObjectInputStream.java:355)
	at hudson.remoting.ObjectInputStreamEx.<init>(ObjectInputStreamEx.java:48)
	at hudson.remoting.AbstractSynchronousByteArrayCommandTransport.read(AbstractSynchronousByteArrayCommandTransport.java:35)
	at hudson.remoting.SynchronousCommandTransport$ReaderThread.run(SynchronousCommandTransport.java:63)
Caused: java.io.IOException: Unexpected termination of the channel
	at hudson.remoting.SynchronousCommandTransport$ReaderThread.run(SynchronousCommandTransport.java:77)
Caused: hudson.remoting.ChannelClosedException: Remote call on H32 failed. The channel is
closing down or has closed down
	at hudson.remoting.Channel.call(Channel.java:901)
	at hudson.Launcher$RemoteLauncher.kill(Launcher.java:1079)
	at hudson.model.AbstractBuild$AbstractBuildExecution.run(AbstractBuild.java:510)
	at hudson.model.Run.execute(Run.java:1724)
	at hudson.maven.MavenModuleSetBuild.run(MavenModuleSetBuild.java:543)
	at hudson.model.ResourceController.execute(ResourceController.java:97)
	at hudson.model.Executor.run(Executor.java:421)
ERROR: H32 is offline; cannot locate JDK 1.8 (latest)
ERROR: H32 is offline; cannot locate Maven 3.3.3
ERROR: H32 is offline; cannot locate JDK 1.8 (latest)
ERROR: H32 is offline; cannot locate Maven 3.3.3


Mime
View raw message