deltaspike-commits mailing list archives

Site index · List index
Message view « Date » · « Thread »
Top « Date » · « Thread »
From Apache Jenkins Server <jenk...@builds.apache.org>
Subject Build failed in Jenkins: DeltaSpike OWB 1.7.2 #260
Date Sun, 26 Nov 2017 14:37:01 GMT
See <https://builds.apache.org/job/DeltaSpike%20OWB%201.7.2/260/display/redirect>

------------------------------------------
[...truncated 1.09 MB...]
  MessageTest.org.apache.deltaspike.test.core.api.message.MessageTest » WebBeansConfiguration
  MinimalMessagesTest.org.apache.deltaspike.test.core.api.message.MinimalMessagesTest » WebBeansConfiguration
  SimpleMessageTest.org.apache.deltaspike.test.core.api.message.SimpleMessageTest » WebBeansConfiguration
  ConfigurableLocaleMessageTest.org.apache.deltaspike.test.core.api.message.locale.ConfigurableLocaleMessageTest
» WebBeansConfiguration
  BeanManagerProviderWarFileTest.org.apache.deltaspike.test.core.api.provider.BeanManagerProviderWarFileTest
» WebBeansConfiguration
  BeanProviderTest.org.apache.deltaspike.test.core.api.provider.BeanProviderTest » WebBeansConfiguration
  ExplicitlyGroupedConversationsTest.org.apache.deltaspike.test.core.api.scope.conversation.grouped.explicit.ExplicitlyGroupedConversationsTest
» WebBeansConfiguration
  ImplicitlyGroupedConversationsTest.org.apache.deltaspike.test.core.api.scope.conversation.grouped.implicit.ImplicitlyGroupedConversationsTest
» WebBeansConfiguration
  GroupedConversationSubGroupTest.org.apache.deltaspike.test.core.api.scope.conversation.subgroup.uc001.GroupedConversationSubGroupTest
» WebBeansConfiguration
  GroupedConversationSubGroupTest.org.apache.deltaspike.test.core.api.scope.conversation.subgroup.uc002.GroupedConversationSubGroupTest
» WebBeansConfiguration
  GroupedConversationSubGroupTest.org.apache.deltaspike.test.core.api.scope.conversation.subgroup.uc003.GroupedConversationSubGroupTest
» WebBeansConfiguration
  ViewAccessScopedTest.org.apache.deltaspike.test.core.api.scope.viewaccess.ViewAccessScopedTest
» WebBeansConfiguration
  ProxyUtilsTest.org.apache.deltaspike.test.core.api.util.ProxyUtilsTest » WebBeansConfiguration
  BeanBuilderTest.org.apache.deltaspike.test.core.api.util.bean.BeanBuilderTest » WebBeansConfiguration
  AbstractContextTest.org.apache.deltaspike.test.core.api.util.context.AbstractContextTest
» WebBeansConfiguration
  ClassDeactivationWarFileTest.org.apache.deltaspike.test.core.impl.activation.ClassDeactivationWarFileTest
» WebBeansConfiguration
  DefaultClassDeactivatorTest.org.apache.deltaspike.test.core.impl.activation.DefaultClassDeactivatorTest
» WebBeansConfiguration
  ServiceUtilsWarFileTest.org.apache.deltaspike.test.core.impl.custom.spi.ServiceUtilsWarFileTest
» WebBeansConfiguration
  EventTest.org.apache.deltaspike.test.core.impl.exception.control.event.EventTest » WebBeansConfiguration
  BreadthFirstAbortControlTest.org.apache.deltaspike.test.core.impl.exception.control.flow.BreadthFirstAbortControlTest
» WebBeansConfiguration
  DepthAbortControlTest.org.apache.deltaspike.test.core.impl.exception.control.flow.DepthAbortControlTest
» WebBeansConfiguration
  HandledExceptionHandlerTest.org.apache.deltaspike.test.core.impl.exception.control.flow.HandledExceptionHandlerTest
» WebBeansConfiguration
  ProceedCauseHandlerTest.org.apache.deltaspike.test.core.impl.exception.control.flow.ProceedCauseHandlerTest
» WebBeansConfiguration
  RethrowTest.org.apache.deltaspike.test.core.impl.exception.control.flow.RethrowTest » WebBeansConfiguration
  ThrowingNewExceptionTest.org.apache.deltaspike.test.core.impl.exception.control.flow.ThrowingNewExceptionTest
» WebBeansConfiguration
  CallingHandlersTest.org.apache.deltaspike.test.core.impl.exception.control.handler.CallingHandlersTest
» WebBeansConfiguration
  HandlerComparatorTest.org.apache.deltaspike.test.core.impl.exception.control.handler.HandlerComparatorTest
» WebBeansConfiguration
  UnMuteHandlerTest.org.apache.deltaspike.test.core.impl.exception.control.handler.UnMuteHandlerTest
» WebBeansConfiguration
  TraversalPathTest.org.apache.deltaspike.test.core.impl.exception.control.traversal.TraversalPathTest
» WebBeansConfiguration
  FutureableTest.org.apache.deltaspike.test.core.impl.future.FutureableTest » WebBeansConfiguration
  CustomPropertiesTest.org.apache.deltaspike.test.core.impl.jmx.CustomPropertiesTest » WebBeansConfiguration
  CustomTypeTest.org.apache.deltaspike.test.core.impl.jmx.CustomTypeTest » WebBeansConfiguration
  SimpleRegistrationWarFileTest.org.apache.deltaspike.test.core.impl.jmx.SimpleRegistrationWarFileTest
» WebBeansConfiguration
  LockedTest.org.apache.deltaspike.test.core.impl.lock.LockedTest » WebBeansConfiguration
  ClasspathResourceTest.org.apache.deltaspike.test.core.impl.resourceloader.ClasspathResourceTest
» WebBeansConfiguration
  FileResourceTest.org.apache.deltaspike.test.core.impl.resourceloader.FileResourceTest »
WebBeansConfiguration
  DefaultWindowContextTest.org.apache.deltaspike.test.core.impl.scope.window.DefaultWindowContextTest
» WebBeansConfiguration
  ThrottledTest.org.apache.deltaspike.test.core.impl.throttling.ThrottledTest » WebBeansConfiguration

Tests run: 63, Failures: 0, Errors: 47, Skipped: 0

[ERROR] There are test failures.

Please refer to <https://builds.apache.org/job/DeltaSpike%20OWB%201.7.2/ws/deltaspike/core/impl/target/surefire-reports>
for the individual test results.
[JENKINS] Recording test results
[INFO] 
[INFO] --- maven-bundle-plugin:2.3.7:bundle (default-bundle) @ deltaspike-core-impl ---
[WARNING] Bundle org.apache.deltaspike.core:deltaspike-core-impl:bundle:1.8.1-SNAPSHOT : Did
not find matching referal for !org.apache.deltaspike.core.impl.*
[INFO] 
[INFO] --- maven-site-plugin:3.5.1:attach-descriptor (attach-descriptor) @ deltaspike-core-impl
---
[INFO] 
[INFO] --- maven-jar-plugin:2.4:test-jar (default) @ deltaspike-core-impl ---
[INFO] Building jar: <https://builds.apache.org/job/DeltaSpike%20OWB%201.7.2/ws/deltaspike/core/impl/target/deltaspike-core-impl-1.8.1-SNAPSHOT-tests.jar>
[INFO] 
[INFO] >>> maven-source-plugin:3.0.0:jar (attach-sources) > generate-sources @
deltaspike-core-impl >>>
[INFO] 
[INFO] --- maven-bundle-plugin:2.3.7:cleanVersions (versions) @ deltaspike-core-impl ---
[INFO] 
[INFO] --- maven-antrun-plugin:1.8:run (javadoc.resources) @ deltaspike-core-impl ---
[WARNING] Parameter tasks is deprecated, use target instead
[INFO] Executing tasks

main:
[INFO] Executed tasks
[WARNING] Failed to getClass for org.apache.maven.plugins.source.SourceJarMojo
[INFO] 
[INFO] <<< maven-source-plugin:3.0.0:jar (attach-sources) < generate-sources @
deltaspike-core-impl <<<
[INFO] 
[INFO] 
[INFO] --- maven-source-plugin:3.0.0:jar (attach-sources) @ deltaspike-core-impl ---
[INFO] Building jar: <https://builds.apache.org/job/DeltaSpike%20OWB%201.7.2/ws/deltaspike/core/impl/target/deltaspike-core-impl-1.8.1-SNAPSHOT-sources.jar>
[INFO] 
[INFO] --- maven-checkstyle-plugin:2.9.1:check (verify-style) @ deltaspike-core-impl ---
[INFO] Starting audit...
<https://builds.apache.org/job/DeltaSpike%20OWB%201.7.2/ws/deltaspike/core/impl/src/main/java/org/apache/deltaspike/core/impl/future/ThreadPoolManager.java>:39:8:
Unused import - java.util.concurrent.Executor.
<https://builds.apache.org/job/DeltaSpike%20OWB%201.7.2/ws/deltaspike/core/impl/src/main/java/org/apache/deltaspike/core/impl/future/ThreadPoolManager.java>:42:8:
Unused import - java.util.concurrent.LinkedBlockingDeque.
<https://builds.apache.org/job/DeltaSpike%20OWB%201.7.2/ws/deltaspike/core/impl/src/main/java/org/apache/deltaspike/core/impl/future/ThreadPoolManager.java>:51:15:
Unused import - java.util.Locale.ENGLISH.
<https://builds.apache.org/job/DeltaSpike%20OWB%201.7.2/ws/deltaspike/core/impl/src/main/java/org/apache/deltaspike/core/impl/future/ThreadPoolManager.java>:118:
Line is longer than 120 characters.
<https://builds.apache.org/job/DeltaSpike%20OWB%201.7.2/ws/deltaspike/core/impl/src/main/java/org/apache/deltaspike/core/impl/future/ThreadPoolManager.java>:123:
Line is longer than 120 characters.
<https://builds.apache.org/job/DeltaSpike%20OWB%201.7.2/ws/deltaspike/core/impl/src/main/java/org/apache/deltaspike/core/impl/future/ThreadPoolManager.java>:130:
Line is longer than 120 characters.
<https://builds.apache.org/job/DeltaSpike%20OWB%201.7.2/ws/deltaspike/core/impl/src/main/java/org/apache/deltaspike/core/impl/future/ThreadPoolManager.java>:132:33:
'{' should be on a new line.
<https://builds.apache.org/job/DeltaSpike%20OWB%201.7.2/ws/deltaspike/core/impl/src/main/java/org/apache/deltaspike/core/impl/future/ThreadPoolManager.java>:139:29:
'}' should be alone on a line.
<https://builds.apache.org/job/DeltaSpike%20OWB%201.7.2/ws/deltaspike/core/impl/src/main/java/org/apache/deltaspike/core/impl/future/ThreadPoolManager.java>:139:63:
'{' should be on a new line.
<https://builds.apache.org/job/DeltaSpike%20OWB%201.7.2/ws/deltaspike/core/impl/src/main/java/org/apache/deltaspike/core/impl/future/ThreadPoolManager.java>:190:29:
'else' is not followed by whitespace.
<https://builds.apache.org/job/DeltaSpike%20OWB%201.7.2/ws/deltaspike/core/impl/src/main/java/org/apache/deltaspike/core/impl/future/ThreadPoolManager.java>:199:
Line is longer than 120 characters.
<https://builds.apache.org/job/DeltaSpike%20OWB%201.7.2/ws/deltaspike/core/impl/src/main/java/org/apache/deltaspike/core/impl/future/ThreadPoolManager.java>:210:
Line is longer than 120 characters.
<https://builds.apache.org/job/DeltaSpike%20OWB%201.7.2/ws/deltaspike/core/impl/src/main/java/org/apache/deltaspike/core/impl/future/ThreadPoolManager.java>:234:72:
'{' should be on a new line.
Audit done.

[INFO] There are 13 checkstyle errors.
[INFO] ------------------------------------------------------------------------
[INFO] Reactor Summary:
[INFO] 
[INFO] Apache DeltaSpike .................................. SUCCESS [  5.681 s]
[INFO] Apache DeltaSpike Sources .......................... SUCCESS [  1.135 s]
[INFO] Apache DeltaSpike CheckStyle-rules ................. SUCCESS [  4.088 s]
[INFO] Apache DeltaSpike Parent ........................... SUCCESS [  5.933 s]
[INFO] Apache DeltaSpike Test-Utils ....................... SUCCESS [  7.638 s]
[INFO] Apache DeltaSpike Code Parent ...................... SUCCESS [  3.546 s]
[INFO] Apache DeltaSpike Core ............................. SUCCESS [  3.088 s]
[INFO] Apache DeltaSpike Core-API ......................... SUCCESS [01:11 min]
[INFO] Apache DeltaSpike Core-Implementation .............. FAILURE [ 32.091 s]
[INFO] Apache DeltaSpike ContainerControl parent .......... SKIPPED
[INFO] Apache DeltaSpike CDI ContainerControl API ......... SKIPPED
[INFO] Apache DeltaSpike CDI ContainerControl TCK ......... SKIPPED
[INFO] Apache DeltaSpike CDI OWB-ContainerControl ......... SKIPPED
[INFO] Apache DeltaSpike CDI Servlet-ContainerControl ..... SKIPPED
[INFO] Apache DeltaSpike Modules .......................... SKIPPED
[INFO] Apache DeltaSpike Proxy-Module ..................... SKIPPED
[INFO] Apache DeltaSpike Proxy-Module API ................. SKIPPED
[INFO] Apache DeltaSpike Proxy-Module Impl ASM5 ........... SKIPPED
[INFO] Apache DeltaSpike Security-Module .................. SKIPPED
[INFO] Apache DeltaSpike Security-Module API .............. SKIPPED
[INFO] Apache DeltaSpike Security-Module Impl ............. SKIPPED
[INFO] Apache DeltaSpike JPA-Module ....................... SKIPPED
[INFO] Apache DeltaSpike JPA-Module API ................... SKIPPED
[INFO] Apache DeltaSpike JPA-Module Impl .................. SKIPPED
[INFO] Apache DeltaSpike Servlet-Module ................... SKIPPED
[INFO] Apache DeltaSpike Servlet-Module API ............... SKIPPED
[INFO] Apache DeltaSpike Servlet-Module Impl .............. SKIPPED
[INFO] Apache DeltaSpike JSF-Module ....................... SKIPPED
[INFO] Apache DeltaSpike JSF-Module API ................... SKIPPED
[INFO] Apache DeltaSpike JSF-Module Impl .................. SKIPPED
[INFO] Apache DeltaSpike JSF-Module Impl (EE6 only) ....... SKIPPED
[INFO] Apache DeltaSpike Partial-Bean-Module .............. SKIPPED
[INFO] Apache DeltaSpike Partial-Bean-Module API .......... SKIPPED
[INFO] Apache DeltaSpike Partial-Bean-Module Impl ......... SKIPPED
[INFO] Apache DeltaSpike BeanValidation-Module ............ SKIPPED
[INFO] Apache DeltaSpike BeanValidation-Module API ........ SKIPPED
[INFO] Apache DeltaSpike BeanValidation-Module Impl ....... SKIPPED
[INFO] Apache DeltaSpike Data-Module ...................... SKIPPED
[INFO] Apache DeltaSpike Data-Module API .................. SKIPPED
[INFO] Apache DeltaSpike Data-Module Impl ................. SKIPPED
[INFO] Apache DeltaSpike Data-Module Tests with Java 8 .... SKIPPED
[INFO] Apache DeltaSpike Scheduler-Module ................. SKIPPED
[INFO] Apache DeltaSpike Scheduler-Module API ............. SKIPPED
[INFO] Apache DeltaSpike Scheduler-Module Impl ............ SKIPPED
[INFO] Apache DeltaSpike Test-Control-Module .............. SKIPPED
[INFO] Apache DeltaSpike Test-Control-Module API .......... SKIPPED
[INFO] Apache DeltaSpike Test-Control-Module Impl ......... SKIPPED
[INFO] Apache DeltaSpike Examples ......................... SKIPPED
[INFO] Apache DeltaSpike Java-SE Examples ................. SKIPPED
[INFO] Apache DeltaSpike JSF Examples ..................... SKIPPED
[INFO] Apache DeltaSpike JSF Playground ................... SKIPPED
[INFO] Apache DeltaSpike Security Example CDI ............. SKIPPED
[INFO] Apache DeltaSpike Security Example PicketLink ...... SKIPPED
[INFO] Apache DeltaSpike Java-SE Scheduler Examples ....... SKIPPED
[INFO] Apache DeltaSpike JPA Examples ..................... SKIPPED
[INFO] Apache DeltaSpike Data Examples .................... SKIPPED
[INFO] Apache DeltaSpike Distribution ..................... SKIPPED
[INFO] Apache DeltaSpike Distribution Bill of Materials ... SKIPPED
[INFO] Apache DeltaSpike Full Distribution ................ SKIPPED
[INFO] Apache DeltaSpike Documentation .................... SKIPPED
[INFO] Apache DeltaSpike Site ............................. SKIPPED
[INFO] ------------------------------------------------------------------------
[INFO] BUILD FAILURE
[INFO] ------------------------------------------------------------------------
[INFO] Total time: 03:22 min
[INFO] Finished at: 2017-11-26T14:36:11Z
[INFO] Final Memory: 52M/1162M
[INFO] ------------------------------------------------------------------------
[WARNING] The requested profile "OpenEJB-TomEE" could not be activated because it does not
exist.
Waiting for Jenkins to finish collecting data
[ERROR] Failed to execute goal org.apache.maven.plugins:maven-checkstyle-plugin:2.9.1:check
(verify-style) on project deltaspike-core-impl: You have 13 Checkstyle violations. -> [Help
1]
[ERROR] 
[ERROR] To see the full stack trace of the errors, re-run Maven with the -e switch.
[ERROR] Re-run Maven using the -X switch to enable full debug logging.
[ERROR] 
[ERROR] For more information about the errors and possible solutions, please read the following
articles:
[ERROR] [Help 1] http://cwiki.apache.org/confluence/display/MAVEN/MojoFailureException
[ERROR] 
[ERROR] After correcting the problems, you can resume the build with the command
[ERROR]   mvn <goals> -rf :deltaspike-core-impl
[JENKINS] Archiving <https://builds.apache.org/job/DeltaSpike%20OWB%201.7.2/ws/deltaspike/cdictrl/tck/pom.xml>
to org.apache.deltaspike.test/deltaspike-cdictrl-tck/1.8.1-SNAPSHOT/deltaspike-cdictrl-tck-1.8.1-SNAPSHOT.pom
[JENKINS] Archiving <https://builds.apache.org/job/DeltaSpike%20OWB%201.7.2/ws/deltaspike/dist/pom.xml>
to org.apache.deltaspike.distribution/distributions-project/1.8.1-SNAPSHOT/distributions-project-1.8.1-SNAPSHOT.pom
[JENKINS] Archiving <https://builds.apache.org/job/DeltaSpike%20OWB%201.7.2/ws/deltaspike/modules/jsf/impl/pom.xml>
to org.apache.deltaspike.modules/deltaspike-jsf-module-impl/1.8.1-SNAPSHOT/deltaspike-jsf-module-impl-1.8.1-SNAPSHOT.pom
[JENKINS] Archiving <https://builds.apache.org/job/DeltaSpike%20OWB%201.7.2/ws/deltaspike/modules/data/impl/pom.xml>
to org.apache.deltaspike.modules/deltaspike-data-module-impl/1.8.1-SNAPSHOT/deltaspike-data-module-impl-1.8.1-SNAPSHOT.pom
[JENKINS] Archiving <https://builds.apache.org/job/DeltaSpike%20OWB%201.7.2/ws/deltaspike/modules/jsf/pom.xml>
to org.apache.deltaspike.modules/jsf-module-project/1.8.1-SNAPSHOT/jsf-module-project-1.8.1-SNAPSHOT.pom
[JENKINS] Archiving <https://builds.apache.org/job/DeltaSpike%20OWB%201.7.2/ws/deltaspike/modules/bean-validation/impl/pom.xml>
to org.apache.deltaspike.modules/deltaspike-bean-validation-module-impl/1.8.1-SNAPSHOT/deltaspike-bean-validation-module-impl-1.8.1-SNAPSHOT.pom
[JENKINS] Archiving <https://builds.apache.org/job/DeltaSpike%20OWB%201.7.2/ws/deltaspike/examples/jpa-examples/pom.xml>
to org.apache.deltaspike.examples/deltaspike-jpa-examples/1.8.1-SNAPSHOT/deltaspike-jpa-examples-1.8.1-SNAPSHOT.pom
[JENKINS] Archiving <https://builds.apache.org/job/DeltaSpike%20OWB%201.7.2/ws/deltaspike/cdictrl/pom.xml>
to org.apache.deltaspike.cdictrl/cdictrl-project/1.8.1-SNAPSHOT/cdictrl-project-1.8.1-SNAPSHOT.pom
[JENKINS] Archiving <https://builds.apache.org/job/DeltaSpike%20OWB%201.7.2/ws/deltaspike/modules/partial-bean/api/pom.xml>
to org.apache.deltaspike.modules/deltaspike-partial-bean-module-api/1.8.1-SNAPSHOT/deltaspike-partial-bean-module-api-1.8.1-SNAPSHOT.pom
[JENKINS] Archiving <https://builds.apache.org/job/DeltaSpike%20OWB%201.7.2/ws/deltaspike/cdictrl/api/pom.xml>
to org.apache.deltaspike.cdictrl/deltaspike-cdictrl-api/1.8.1-SNAPSHOT/deltaspike-cdictrl-api-1.8.1-SNAPSHOT.pom
[JENKINS] Archiving <https://builds.apache.org/job/DeltaSpike%20OWB%201.7.2/ws/deltaspike/modules/security/api/pom.xml>
to org.apache.deltaspike.modules/deltaspike-security-module-api/1.8.1-SNAPSHOT/deltaspike-security-module-api-1.8.1-SNAPSHOT.pom
[JENKINS] Archiving <https://builds.apache.org/job/DeltaSpike%20OWB%201.7.2/ws/deltaspike/modules/data/api/pom.xml>
to org.apache.deltaspike.modules/deltaspike-data-module-api/1.8.1-SNAPSHOT/deltaspike-data-module-api-1.8.1-SNAPSHOT.pom
[JENKINS] Archiving <https://builds.apache.org/job/DeltaSpike%20OWB%201.7.2/ws/documentation/pom.xml>
to org.apache.deltaspike/deltaspike-documentation/1.8.1-SNAPSHOT/deltaspike-documentation-1.8.1-SNAPSHOT.pom
[JENKINS] Archiving <https://builds.apache.org/job/DeltaSpike%20OWB%201.7.2/ws/deltaspike/examples/jse-examples/pom.xml>
to org.apache.deltaspike.examples/deltaspike-jse-example/1.8.1-SNAPSHOT/deltaspike-jse-example-1.8.1-SNAPSHOT.pom
[JENKINS] Archiving <https://builds.apache.org/job/DeltaSpike%20OWB%201.7.2/ws/deltaspike/modules/data/test-java8/pom.xml>
to org.apache.deltaspike.modules/deltaspike-data-module-test-java8/1.8.1-SNAPSHOT/deltaspike-data-module-test-java8-1.8.1-SNAPSHOT.pom
[Fast Archiver] No prior successful build to compare, so performing full copy of artifacts
[JENKINS] Archiving <https://builds.apache.org/job/DeltaSpike%20OWB%201.7.2/ws/deltaspike/examples/pom.xml>
to org.apache.deltaspike.examples/examples-project/1.8.1-SNAPSHOT/examples-project-1.8.1-SNAPSHOT.pom
[JENKINS] Archiving <https://builds.apache.org/job/DeltaSpike%20OWB%201.7.2/ws/deltaspike/modules/jpa/pom.xml>
to org.apache.deltaspike.modules/jpa-module-project/1.8.1-SNAPSHOT/jpa-module-project-1.8.1-SNAPSHOT.pom
[JENKINS] Archiving <https://builds.apache.org/job/DeltaSpike%20OWB%201.7.2/ws/deltaspike/modules/servlet/pom.xml>
to org.apache.deltaspike.modules/servlet-module-project/1.8.1-SNAPSHOT/servlet-module-project-1.8.1-SNAPSHOT.pom
[JENKINS] Archiving <https://builds.apache.org/job/DeltaSpike%20OWB%201.7.2/ws/deltaspike/pom.xml>
to org.apache.deltaspike/deltaspike-project/1.8.1-SNAPSHOT/deltaspike-project-1.8.1-SNAPSHOT.pom
[JENKINS] Archiving <https://builds.apache.org/job/DeltaSpike%20OWB%201.7.2/ws/pom.xml>
to org.apache.deltaspike/deltaspike/1.8.1-SNAPSHOT/deltaspike-1.8.1-SNAPSHOT.pom
[JENKINS] Archiving <https://builds.apache.org/job/DeltaSpike%20OWB%201.7.2/ws/deltaspike/core/impl/pom.xml>
to org.apache.deltaspike.core/deltaspike-core-impl/1.8.1-SNAPSHOT/deltaspike-core-impl-1.8.1-SNAPSHOT.pom
[JENKINS] Archiving <https://builds.apache.org/job/DeltaSpike%20OWB%201.7.2/ws/deltaspike/core/impl/target/deltaspike-core-impl-1.8.1-SNAPSHOT.jar>
to org.apache.deltaspike.core/deltaspike-core-impl/1.8.1-SNAPSHOT/deltaspike-core-impl-1.8.1-SNAPSHOT.jar
[JENKINS] Archiving <https://builds.apache.org/job/DeltaSpike%20OWB%201.7.2/ws/deltaspike/core/impl/target/deltaspike-core-impl-1.8.1-SNAPSHOT-tests.jar>
to org.apache.deltaspike.core/deltaspike-core-impl/1.8.1-SNAPSHOT/deltaspike-core-impl-1.8.1-SNAPSHOT-tests.jar
[JENKINS] Archiving <https://builds.apache.org/job/DeltaSpike%20OWB%201.7.2/ws/deltaspike/core/impl/target/deltaspike-core-impl-1.8.1-SNAPSHOT-sources.jar>
to org.apache.deltaspike.core/deltaspike-core-impl/1.8.1-SNAPSHOT/deltaspike-core-impl-1.8.1-SNAPSHOT-sources.jar
[JENKINS] Archiving <https://builds.apache.org/job/DeltaSpike%20OWB%201.7.2/ws/deltaspike/modules/partial-bean/pom.xml>
to org.apache.deltaspike.modules/partial-bean-module-project/1.8.1-SNAPSHOT/partial-bean-module-project-1.8.1-SNAPSHOT.pom
[JENKINS] Archiving <https://builds.apache.org/job/DeltaSpike%20OWB%201.7.2/ws/deltaspike/cdictrl/impl-owb/pom.xml>
to org.apache.deltaspike.cdictrl/deltaspike-cdictrl-owb/1.8.1-SNAPSHOT/deltaspike-cdictrl-owb-1.8.1-SNAPSHOT.pom
[JENKINS] Archiving <https://builds.apache.org/job/DeltaSpike%20OWB%201.7.2/ws/deltaspike/modules/proxy/pom.xml>
to org.apache.deltaspike.modules/proxy-module-project/1.8.1-SNAPSHOT/proxy-module-project-1.8.1-SNAPSHOT.pom
[JENKINS] Archiving <https://builds.apache.org/job/DeltaSpike%20OWB%201.7.2/ws/deltaspike/parent/pom.xml>
to org.apache.deltaspike/parent/1.8.1-SNAPSHOT/parent-1.8.1-SNAPSHOT.pom
[Fast Archiver] Compressed 41.32 KB of artifacts by 77.4% relative to #259
[JENKINS] Archiving <https://builds.apache.org/job/DeltaSpike%20OWB%201.7.2/ws/deltaspike/modules/security/impl/pom.xml>
to org.apache.deltaspike.modules/deltaspike-security-module-impl/1.8.1-SNAPSHOT/deltaspike-security-module-impl-1.8.1-SNAPSHOT.pom
[JENKINS] Archiving <https://builds.apache.org/job/DeltaSpike%20OWB%201.7.2/ws/deltaspike/modules/jpa/api/pom.xml>
to org.apache.deltaspike.modules/deltaspike-jpa-module-api/1.8.1-SNAPSHOT/deltaspike-jpa-module-api-1.8.1-SNAPSHOT.pom
[JENKINS] Archiving <https://builds.apache.org/job/DeltaSpike%20OWB%201.7.2/ws/deltaspike/modules/proxy/impl-asm5/pom.xml>
to org.apache.deltaspike.modules/deltaspike-proxy-module-impl-asm5/1.8.1-SNAPSHOT/deltaspike-proxy-module-impl-asm5-1.8.1-SNAPSHOT.pom
[JENKINS] Archiving <https://builds.apache.org/job/DeltaSpike%20OWB%201.7.2/ws/deltaspike/dist/bom/pom.xml>
to org.apache.deltaspike.distribution/distributions-bom/1.8.1-SNAPSHOT/distributions-bom-1.8.1-SNAPSHOT.pom
[JENKINS] Archiving <https://builds.apache.org/job/DeltaSpike%20OWB%201.7.2/ws/deltaspike/modules/bean-validation/pom.xml>
to org.apache.deltaspike.modules/bean-validation-module-project/1.8.1-SNAPSHOT/bean-validation-module-project-1.8.1-SNAPSHOT.pom
[JENKINS] Archiving <https://builds.apache.org/job/DeltaSpike%20OWB%201.7.2/ws/deltaspike/parent/code/pom.xml>
to org.apache.deltaspike/parent-code/1.8.1-SNAPSHOT/parent-code-1.8.1-SNAPSHOT.pom
[JENKINS] Archiving <https://builds.apache.org/job/DeltaSpike%20OWB%201.7.2/ws/deltaspike/parent/code/target/parent-code-1.8.1-SNAPSHOT-tests.jar>
to org.apache.deltaspike/parent-code/1.8.1-SNAPSHOT/parent-code-1.8.1-SNAPSHOT-tests.jar
[Fast Archiver] Compressed 102.92 KB of artifacts by 62.2% relative to #259
[JENKINS] Archiving <https://builds.apache.org/job/DeltaSpike%20OWB%201.7.2/ws/deltaspike/modules/jpa/impl/pom.xml>
to org.apache.deltaspike.modules/deltaspike-jpa-module-impl/1.8.1-SNAPSHOT/deltaspike-jpa-module-impl-1.8.1-SNAPSHOT.pom
[JENKINS] Archiving <https://builds.apache.org/job/DeltaSpike%20OWB%201.7.2/ws/deltaspike/modules/partial-bean/impl/pom.xml>
to org.apache.deltaspike.modules/deltaspike-partial-bean-module-impl/1.8.1-SNAPSHOT/deltaspike-partial-bean-module-impl-1.8.1-SNAPSHOT.pom
[JENKINS] Archiving <https://builds.apache.org/job/DeltaSpike%20OWB%201.7.2/ws/deltaspike/cdictrl/servlet/pom.xml>
to org.apache.deltaspike.cdictrl/deltaspike-cdictrl-servlet/1.8.1-SNAPSHOT/deltaspike-cdictrl-servlet-1.8.1-SNAPSHOT.pom
[JENKINS] Archiving <https://builds.apache.org/job/DeltaSpike%20OWB%201.7.2/ws/deltaspike/modules/scheduler/api/pom.xml>
to org.apache.deltaspike.modules/deltaspike-scheduler-module-api/1.8.1-SNAPSHOT/deltaspike-scheduler-module-api-1.8.1-SNAPSHOT.pom
[JENKINS] Archiving <https://builds.apache.org/job/DeltaSpike%20OWB%201.7.2/ws/deltaspike/modules/test-control/pom.xml>
to org.apache.deltaspike.modules/test-control-module-project/1.8.1-SNAPSHOT/test-control-module-project-1.8.1-SNAPSHOT.pom
[JENKINS] Archiving <https://builds.apache.org/job/DeltaSpike%20OWB%201.7.2/ws/deltaspike/modules/scheduler/impl/pom.xml>
to org.apache.deltaspike.modules/deltaspike-scheduler-module-impl/1.8.1-SNAPSHOT/deltaspike-scheduler-module-impl-1.8.1-SNAPSHOT.pom
[JENKINS] Archiving <https://builds.apache.org/job/DeltaSpike%20OWB%201.7.2/ws/deltaspike/examples/jsf-playground/pom.xml>
to org.apache.deltaspike.examples/deltaspike-jsf-playground/1.8.1-SNAPSHOT/deltaspike-jsf-playground-1.8.1-SNAPSHOT.pom
[JENKINS] Archiving <https://builds.apache.org/job/DeltaSpike%20OWB%201.7.2/ws/deltaspike/modules/test-control/impl/pom.xml>
to org.apache.deltaspike.modules/deltaspike-test-control-module-impl/1.8.1-SNAPSHOT/deltaspike-test-control-module-impl-1.8.1-SNAPSHOT.pom
[JENKINS] Archiving <https://builds.apache.org/job/DeltaSpike%20OWB%201.7.2/ws/deltaspike/checkstyle-rules/pom.xml>
to org.apache.deltaspike/checkstyle-rules/1.8.1-SNAPSHOT/checkstyle-rules-1.8.1-SNAPSHOT.pom
[JENKINS] Archiving <https://builds.apache.org/job/DeltaSpike%20OWB%201.7.2/ws/deltaspike/checkstyle-rules/target/checkstyle-rules-1.8.1-SNAPSHOT.jar>
to org.apache.deltaspike/checkstyle-rules/1.8.1-SNAPSHOT/checkstyle-rules-1.8.1-SNAPSHOT.jar
[JENKINS] Archiving <https://builds.apache.org/job/DeltaSpike%20OWB%201.7.2/ws/deltaspike/modules/proxy/api/pom.xml>
to org.apache.deltaspike.modules/deltaspike-proxy-module-api/1.8.1-SNAPSHOT/deltaspike-proxy-module-api-1.8.1-SNAPSHOT.pom
[JENKINS] Archiving <https://builds.apache.org/job/DeltaSpike%20OWB%201.7.2/ws/deltaspike/modules/servlet/api/pom.xml>
to org.apache.deltaspike.modules/deltaspike-servlet-module-api/1.8.1-SNAPSHOT/deltaspike-servlet-module-api-1.8.1-SNAPSHOT.pom
[JENKINS] Archiving <https://builds.apache.org/job/DeltaSpike%20OWB%201.7.2/ws/deltaspike/examples/data-examples/pom.xml>
to org.apache.deltaspike.examples/deltaspike-data-examples/1.8.1-SNAPSHOT/deltaspike-data-examples-1.8.1-SNAPSHOT.pom
[JENKINS] Archiving <https://builds.apache.org/job/DeltaSpike%20OWB%201.7.2/ws/deltaspike/core/api/pom.xml>
to org.apache.deltaspike.core/deltaspike-core-api/1.8.1-SNAPSHOT/deltaspike-core-api-1.8.1-SNAPSHOT.pom
[JENKINS] Archiving <https://builds.apache.org/job/DeltaSpike%20OWB%201.7.2/ws/deltaspike/core/api/target/deltaspike-core-api-1.8.1-SNAPSHOT.jar>
to org.apache.deltaspike.core/deltaspike-core-api/1.8.1-SNAPSHOT/deltaspike-core-api-1.8.1-SNAPSHOT.jar
[JENKINS] Archiving <https://builds.apache.org/job/DeltaSpike%20OWB%201.7.2/ws/deltaspike/core/api/target/deltaspike-core-api-1.8.1-SNAPSHOT-tests.jar>
to org.apache.deltaspike.core/deltaspike-core-api/1.8.1-SNAPSHOT/deltaspike-core-api-1.8.1-SNAPSHOT-tests.jar
[JENKINS] Archiving <https://builds.apache.org/job/DeltaSpike%20OWB%201.7.2/ws/deltaspike/core/api/target/deltaspike-core-api-1.8.1-SNAPSHOT-sources.jar>
to org.apache.deltaspike.core/deltaspike-core-api/1.8.1-SNAPSHOT/deltaspike-core-api-1.8.1-SNAPSHOT-sources.jar
[JENKINS] Archiving <https://builds.apache.org/job/DeltaSpike%20OWB%201.7.2/ws/deltaspike/examples/security-requested-page-after-login-picketlink/pom.xml>
to org.apache.deltaspike.examples/deltaspike-security-requested-page-after-login-picketlink/1.8.1-SNAPSHOT/deltaspike-security-requested-page-after-login-picketlink-1.8.1-SNAPSHOT.pom
[JENKINS] Archiving <https://builds.apache.org/job/DeltaSpike%20OWB%201.7.2/ws/deltaspike/modules/bean-validation/api/pom.xml>
to org.apache.deltaspike.modules/deltaspike-bean-validation-module-api/1.8.1-SNAPSHOT/deltaspike-bean-validation-module-api-1.8.1-SNAPSHOT.pom
[JENKINS] Archiving <https://builds.apache.org/job/DeltaSpike%20OWB%201.7.2/ws/deltaspike/examples/scheduler-playground/pom.xml>
to org.apache.deltaspike.examples/deltaspike-scheduler-example/1.8.1-SNAPSHOT/deltaspike-scheduler-example-1.8.1-SNAPSHOT.pom
[JENKINS] Archiving <https://builds.apache.org/job/DeltaSpike%20OWB%201.7.2/ws/deltaspike/modules/pom.xml>
to org.apache.deltaspike.modules/modules-project/1.8.1-SNAPSHOT/modules-project-1.8.1-SNAPSHOT.pom
[JENKINS] Archiving <https://builds.apache.org/job/DeltaSpike%20OWB%201.7.2/ws/deltaspike/modules/scheduler/pom.xml>
to org.apache.deltaspike.modules/scheduler-module-project/1.8.1-SNAPSHOT/scheduler-module-project-1.8.1-SNAPSHOT.pom
[JENKINS] Archiving <https://builds.apache.org/job/DeltaSpike%20OWB%201.7.2/ws/deltaspike/test-utils/pom.xml>
to org.apache.deltaspike.test/test-utils/1.8.1-SNAPSHOT/test-utils-1.8.1-SNAPSHOT.pom
[JENKINS] Archiving <https://builds.apache.org/job/DeltaSpike%20OWB%201.7.2/ws/deltaspike/test-utils/target/test-utils-1.8.1-SNAPSHOT.jar>
to org.apache.deltaspike.test/test-utils/1.8.1-SNAPSHOT/test-utils-1.8.1-SNAPSHOT.jar
[JENKINS] Archiving <https://builds.apache.org/job/DeltaSpike%20OWB%201.7.2/ws/deltaspike/test-utils/target/test-utils-1.8.1-SNAPSHOT-sources.jar>
to org.apache.deltaspike.test/test-utils/1.8.1-SNAPSHOT/test-utils-1.8.1-SNAPSHOT-sources.jar
[JENKINS] Archiving <https://builds.apache.org/job/DeltaSpike%20OWB%201.7.2/ws/deltaspike/modules/security/pom.xml>
to org.apache.deltaspike.modules/security-module-project/1.8.1-SNAPSHOT/security-module-project-1.8.1-SNAPSHOT.pom
[JENKINS] Archiving <https://builds.apache.org/job/DeltaSpike%20OWB%201.7.2/ws/deltaspike/modules/jsf/api/pom.xml>
to org.apache.deltaspike.modules/deltaspike-jsf-module-api/1.8.1-SNAPSHOT/deltaspike-jsf-module-api-1.8.1-SNAPSHOT.pom
[JENKINS] Archiving <https://builds.apache.org/job/DeltaSpike%20OWB%201.7.2/ws/deltaspike/modules/data/pom.xml>
to org.apache.deltaspike.modules/data-module-project/1.8.1-SNAPSHOT/data-module-project-1.8.1-SNAPSHOT.pom
[JENKINS] Archiving <https://builds.apache.org/job/DeltaSpike%20OWB%201.7.2/ws/deltaspike/modules/servlet/impl/pom.xml>
to org.apache.deltaspike.modules/deltaspike-servlet-module-impl/1.8.1-SNAPSHOT/deltaspike-servlet-module-impl-1.8.1-SNAPSHOT.pom
[JENKINS] Archiving <https://builds.apache.org/job/DeltaSpike%20OWB%201.7.2/ws/deltaspike/modules/test-control/api/pom.xml>
to org.apache.deltaspike.modules/deltaspike-test-control-module-api/1.8.1-SNAPSHOT/deltaspike-test-control-module-api-1.8.1-SNAPSHOT.pom
[JENKINS] Archiving <https://builds.apache.org/job/DeltaSpike%20OWB%201.7.2/ws/deltaspike/examples/jsf-examples/pom.xml>
to org.apache.deltaspike.examples/deltaspike-jsf-example/1.8.1-SNAPSHOT/deltaspike-jsf-example-1.8.1-SNAPSHOT.pom
[JENKINS] Archiving <https://builds.apache.org/job/DeltaSpike%20OWB%201.7.2/ws/deltaspike/modules/jsf/impl-ee6/pom.xml>
to org.apache.deltaspike.modules/deltaspike-jsf-module-impl-ee6/1.8.1-SNAPSHOT/deltaspike-jsf-module-impl-ee6-1.8.1-SNAPSHOT.pom
[JENKINS] Archiving <https://builds.apache.org/job/DeltaSpike%20OWB%201.7.2/ws/deltaspike/examples/security-requested-page-after-login-cdi/pom.xml>
to org.apache.deltaspike.examples/deltaspike-security-requested-page-after-login-cdi/1.8.1-SNAPSHOT/deltaspike-security-requested-page-after-login-cdi-1.8.1-SNAPSHOT.pom
[JENKINS] Archiving <https://builds.apache.org/job/DeltaSpike%20OWB%201.7.2/ws/deltaspike/core/pom.xml>
to org.apache.deltaspike.core/core-project/1.8.1-SNAPSHOT/core-project-1.8.1-SNAPSHOT.pom
[JENKINS] Archiving <https://builds.apache.org/job/DeltaSpike%20OWB%201.7.2/ws/deltaspike/core/target/core-project-1.8.1-SNAPSHOT-tests.jar>
to org.apache.deltaspike.core/core-project/1.8.1-SNAPSHOT/core-project-1.8.1-SNAPSHOT-tests.jar
[JENKINS] Archiving <https://builds.apache.org/job/DeltaSpike%20OWB%201.7.2/ws/deltaspike/dist/full/pom.xml>
to org.apache.deltaspike.distribution/distribution-full/1.8.1-SNAPSHOT/distribution-full-1.8.1-SNAPSHOT.pom
[JENKINS] Archiving <https://builds.apache.org/job/DeltaSpike%20OWB%201.7.2/ws/site/pom.xml>
to org.apache.deltaspike/deltaspike-site/1.8.1-SNAPSHOT/deltaspike-site-1.8.1-SNAPSHOT.pom
channel stopped

Mime
View raw message