deltaspike-commits mailing list archives

Site index · List index
Message view « Date » · « Thread »
Top « Date » · « Thread »
From Apache Jenkins Server <jenk...@builds.apache.org>
Subject Build failed in Jenkins: DeltaSpike_TomEE_7.0.3 #90
Date Wed, 29 Nov 2017 10:19:53 GMT
See <https://builds.apache.org/job/DeltaSpike_TomEE_7.0.3/90/display/redirect?page=changes>

Changes:

[rmannibucau] DELTASPIKE-1296 fixing configuration extension lifecycle

------------------------------------------
[...truncated 1.02 MB...]
[INFO] Compiling 138 source files to <https://builds.apache.org/job/DeltaSpike_TomEE_7.0.3/ws/deltaspike/modules/data/impl/target/classes>
[INFO] 
[INFO] --- maven-processor-plugin:2.0.7:process-test (process-test) @ deltaspike-data-module-impl ---
[INFO] Source directory: <https://builds.apache.org/job/DeltaSpike_TomEE_7.0.3/ws/deltaspike/modules/data/impl/target/generated-sources/apt-test> added
[INFO] javac option: -cp
[INFO] javac option: /home/jenkins/jenkins-slave/maven-repositories/0/org/hibernate/hibernate-jpamodelgen/1.2.0.Final/hibernate-jpamodelgen-1.2.0.Final.jar:/home/jenkins/jenkins-slave/maven-repositories/0/org/apache/maven/maven-plugin-api/3.0.1/maven-plugin-api-3.0.1.jar:/home/jenkins/jenkins-slave/maven-repositories/0/org/apache/maven/maven-model/3.0.1/maven-model-3.0.1.jar:/home/jenkins/jenkins-slave/maven-repositories/0/org/apache/maven/maven-artifact/3.0.1/maven-artifact-3.0.1.jar:/home/jenkins/jenkins-slave/maven-repositories/0/org/sonatype/sisu/sisu-inject-plexus/1.4.3.1/sisu-inject-plexus-1.4.3.1.jar:/home/jenkins/jenkins-slave/maven-repositories/0/org/sonatype/sisu/sisu-inject-bean/1.4.3.1/sisu-inject-bean-1.4.3.1.jar:/home/jenkins/jenkins-slave/maven-repositories/0/org/sonatype/sisu/sisu-guice/2.9.1/sisu-guice-2.9.1-noaop.jar:/home/jenkins/jenkins-slave/maven-repositories/0/org/apache/maven/maven-core/3.0.1/maven-core-3.0.1.jar:/home/jenkins/jenkins-slave/maven-repositories/0/org/apache/maven/maven-settings/3.0.1/maven-settings-3.0.1.jar:/home/jenkins/jenkins-slave/maven-repositories/0/org/apache/maven/maven-settings-builder/3.0.1/maven-settings-builder-3.0.1.jar:/home/jenkins/jenkins-slave/maven-repositories/0/org/apache/maven/maven-repository-metadata/3.0.1/maven-repository-metadata-3.0.1.jar:/home/jenkins/jenkins-slave/maven-repositories/0/org/apache/maven/maven-model-builder/3.0.1/maven-model-builder-3.0.1.jar:/home/jenkins/jenkins-slave/maven-repositories/0/org/apache/maven/maven-aether-provider/3.0.1/maven-aether-provider-3.0.1.jar:/home/jenkins/jenkins-slave/maven-repositories/0/org/sonatype/aether/aether-spi/1.8/aether-spi-1.8.jar:/home/jenkins/jenkins-slave/maven-repositories/0/org/sonatype/aether/aether-impl/1.8/aether-impl-1.8.jar:/home/jenkins/jenkins-slave/maven-repositories/0/org/sonatype/aether/aether-api/1.8/aether-api-1.8.jar:/home/jenkins/jenkins-slave/maven-repositories/0/org/sonatype/aether/aether-util/1.8/aether-util-1.8.jar:/home/jenkins/jenkins-slave/maven-repositories/0/org/codehaus/plexus/plexus-interpolation/1.14/plexus-interpolation-1.14.jar:/home/jenkins/jenkins-slave/maven-repositories/0/org/codehaus/plexus/plexus-utils/2.0.4/plexus-utils-2.0.4.jar:/home/jenkins/jenkins-slave/maven-repositories/0/org/codehaus/plexus/plexus-classworlds/2.4/plexus-classworlds-2.4.jar:/home/jenkins/jenkins-slave/maven-repositories/0/org/codehaus/plexus/plexus-component-annotations/1.5.5/plexus-component-annotations-1.5.5.jar:/home/jenkins/jenkins-slave/maven-repositories/0/org/sonatype/plexus/plexus-sec-dispatcher/1.3/plexus-sec-dispatcher-1.3.jar:/home/jenkins/jenkins-slave/maven-repositories/0/org/sonatype/plexus/plexus-cipher/1.4/plexus-cipher-1.4.jar:<https://builds.apache.org/job/DeltaSpike_TomEE_7.0.3/ws/deltaspike/modules/data/impl/src/test/resources>:<https://builds.apache.org/job/DeltaSpike_TomEE_7.0.3/ws/deltaspike/modules/data/impl/src/test/resources-openejb>:<https://builds.apache.org/job/DeltaSpike_TomEE_7.0.3/ws/deltaspike/modules/data/impl/target/maven-shared-archive-resources>:<https://builds.apache.org/job/DeltaSpike_TomEE_7.0.3/ws/deltaspike/modules/data/impl/target/test-classes>:<https://builds.apache.org/job/DeltaSpike_TomEE_7.0.3/ws/deltaspike/modules/data/impl/target/classes>:/home/jenkins/jenkins-slave/maven-repositories/0/org/apache/geronimo/specs/geronimo-jpa_2.0_spec/1.1/geronimo-jpa_2.0_spec-1.1.jar:/home/jenkins/jenkins-slave/maven-repositories/0/org/apache/geronimo/specs/geronimo-jta_1.1_spec/1.1.1/geronimo-jta_1.1_spec-1.1.1.jar:<https://builds.apache.org/job/DeltaSpike_TomEE_7.0.3/ws/deltaspike/modules/data/api/target/deltaspike-data-module-api-1.8.1-SNAPSHOT.jar>:<https://builds.apache.org/job/DeltaSpike_TomEE_7.0.3/ws/deltaspike/core/api/target/deltaspike-core-api-1.8.1-SNAPSHOT.jar>:<https://builds.apache.org/job/DeltaSpike_TomEE_7.0.3/ws/deltaspike/modules/partial-bean/api/target/deltaspike-partial-bean-module-api-1.8.1-SNAPSHOT.jar>:<https://builds.apache.org/job/DeltaSpike_TomEE_7.0.3/ws/deltaspike/modules/jpa/api/target/deltaspike-jpa-module-api-1.8.1-SNAPSHOT.jar>:<https://builds.apache.org/job/DeltaSpike_TomEE_7.0.3/ws/deltaspike/core/impl/target/deltaspike-core-impl-1.8.1-SNAPSHOT.jar>:<https://builds.apache.org/job/DeltaSpike_TomEE_7.0.3/ws/deltaspike/modules/partial-bean/impl/target/deltaspike-partial-bean-module-impl-1.8.1-SNAPSHOT.jar>:<https://builds.apache.org/job/DeltaSpike_TomEE_7.0.3/ws/deltaspike/modules/proxy/api/target/deltaspike-proxy-module-api-1.8.1-SNAPSHOT.jar>:<https://builds.apache.org/job/DeltaSpike_TomEE_7.0.3/ws/deltaspike/modules/proxy/impl-asm5/target/deltaspike-proxy-module-impl-asm5-1.8.1-SNAPSHOT.jar>:<https://builds.apache.org/job/DeltaSpike_TomEE_7.0.3/ws/deltaspike/modules/jpa/impl/target/deltaspike-jpa-module-impl-1.8.1-SNAPSHOT.jar>:/home/jenkins/jenkins-slave/maven-repositories/0/org/jboss/shrinkwrap/resolver/shrinkwrap-resolver-impl-maven/2.0.0/shrinkwrap-resolver-impl-maven-2.0.0.jar:/home/jenkins/jenkins-slave/maven-repositories/0/org/jboss/shrinkwrap/resolver/shrinkwrap-resolver-api-maven/2.0.0/shrinkwrap-resolver-api-maven-2.0.0.jar:/home/jenkins/jenkins-slave/maven-repositories/0/org/jboss/shrinkwrap/resolver/shrinkwrap-resolver-api/2.0.0/shrinkwrap-resolver-api-2.0.0.jar:/home/jenkins/jenkins-slave/maven-repositories/0/org/jboss/shrinkwrap/resolver/shrinkwrap-resolver-spi-maven/2.0.0/shrinkwrap-resolver-spi-maven-2.0.0.jar:/home/jenkins/jenkins-slave/maven-repositories/0/org/jboss/shrinkwrap/resolver/shrinkwrap-resolver-spi/2.0.0/shrinkwrap-resolver-spi-2.0.0.jar:/home/jenkins/jenkins-slave/maven-repositories/0/org/sonatype/aether/aether-api/1.13.1/aether-api-1.13.1.jar:/home/jenkins/jenkins-slave/maven-repositories/0/org/sonatype/aether/aether-impl/1.13.1/aether-impl-1.13.1.jar:/home/jenkins/jenkins-slave/maven-repositories/0/org/sonatype/aether/aether-spi/1.13.1/aether-spi-1.13.1.jar:/home/jenkins/jenkins-slave/maven-repositories/0/org/sonatype/aether/aether-util/1.13.1/aether-util-1.13.1.jar:/home/jenkins/jenkins-slave/maven-repositories/0/org/sonatype/aether/aether-connector-wagon/1.13.1/aether-connector-wagon-1.13.1.jar:/home/jenkins/jenkins-slave/maven-repositories/0/org/apache/maven/maven-aether-provider/3.0.5/maven-aether-provider-3.0.5.jar:/home/jenkins/jenkins-slave/maven-repositories/0/org/apache/maven/maven-model/3.0.5/maven-model-3.0.5.jar:/home/jenkins/jenkins-slave/maven-repositories/0/org/apache/maven/maven-model-builder/3.0.5/maven-model-builder-3.0.5.jar:/home/jenkins/jenkins-slave/maven-repositories/0/org/apache/maven/maven-repository-metadata/3.0.5/maven-repository-metadata-3.0.5.jar:/home/jenkins/jenkins-slave/maven-repositories/0/org/apache/maven/maven-settings/3.0.5/maven-settings-3.0.5.jar:/home/jenkins/jenkins-slave/maven-repositories/0/org/apache/maven/maven-settings-builder/3.0.5/maven-settings-builder-3.0.5.jar:/home/jenkins/jenkins-slave/maven-repositories/0/org/codehaus/plexus/plexus-utils/2.0.6/plexus-utils-2.0.6.jar:/home/jenkins/jenkins-slave/maven-repositories/0/org/sonatype/plexus/plexus-sec-dispatcher/1.4/plexus-sec-dispatcher-1.4.jar:/home/jenkins/jenkins-slave/maven-repositories/0/org/apache/maven/wagon/wagon-provider-api/2.4/wagon-provider-api-2.4.jar:/home/jenkins/jenkins-slave/maven-repositories/0/org/apache/maven/wagon/wagon-file/2.4/wagon-file-2.4.jar:/home/jenkins/jenkins-slave/maven-repositories/0/org/apache/maven/wagon/wagon-http-lightweight/2.4/wagon-http-lightweight-2.4.jar:/home/jenkins/jenkins-slave/maven-repositories/0/org/apache/maven/wagon/wagon-http-shared4/2.4/wagon-http-shared4-2.4.jar:/home/jenkins/jenkins-slave/maven-repositories/0/org/jsoup/jsoup/1.7.1/jsoup-1.7.1.jar:/home/jenkins/jenkins-slave/maven-repositories/0/org/apache/httpcomponents/httpcore/4.2.3/httpcore-4.2.3.jar:/home/jenkins/jenkins-slave/maven-repositories/0/commons-io/commons-io/2.0.1/commons-io-2.0.1.jar:/home/jenkins/jenkins-slave/maven-repositories/0/org/jboss/shrinkwrap/descriptors/shrinkwrap-descriptors-impl-javaee/2.0.0-alpha-7/shrinkwrap-descriptors-impl-javaee-2.0.0-alpha-7.jar:/home/jenkins/jenkins-slave/maven-repositories/0/org/jboss/shrinkwrap/descriptors/shrinkwrap-descriptors-api-javaee/2.0.0-alpha-7/shrinkwrap-descriptors-api-javaee-2.0.0-alpha-7.jar:/home/jenkins/jenkins-slave/maven-repositories/0/org/jboss/shrinkwrap/descriptors/shrinkwrap-descriptors-impl-base/2.0.0-alpha-7/shrinkwrap-descriptors-impl-base-2.0.0-alpha-7.jar:/home/jenkins/jenkins-slave/maven-repositories/0/org/jboss/shrinkwrap/descriptors/shrinkwrap-descriptors-spi/2.0.0-alpha-7/shrinkwrap-descriptors-spi-2.0.0-alpha-7.jar:<https://builds.apache.org/job/DeltaSpike_TomEE_7.0.3/ws/deltaspike/test-utils/target/test-utils-1.8.1-SNAPSHOT.jar>:/home/jenkins/jenkins-slave/maven-repositories/0/org/jboss/shrinkwrap/shrinkwrap-api/1.2.2/shrinkwrap-api-1.2.2.jar:/home/jenkins/jenkins-slave/maven-repositories/0/org/jboss/arquillian/container/arquillian-container-test-spi/1.1.8.Final/arquillian-container-test-spi-1.1.8.Final.jar:/home/jenkins/jenkins-slave/maven-repositories/0/org/apache/maven/maven-artifact/3.0/maven-artifact-3.0.jar:/home/jenkins/jenkins-slave/maven-repositories/0/org/apache/openejb/javaee-api/6.0-5/javaee-api-6.0-5.jar:/home/jenkins/jenkins-slave/maven-repositories/0/org/apache/tomee/tomee-util/7.0.3/tomee-util-7.0.3.jar:/home/jenkins/jenkins-slave/maven-repositories/0/org/apache/tomee/openejb-client/7.0.3/openejb-client-7.0.3.jar:/home/jenkins/jenkins-slave/maven-repositories/0/org/apache/tomee/javaee-api/7.0-1/javaee-api-7.0-1.jar:/home/jenkins/jenkins-slave/maven-repositories/0/org/apache/tomee/openejb-core/7.0.3/openejb-core-7.0.3.jar:/home/jenkins/jenkins-slave/maven-repositories/0/org/apache/tomee/mbean-annotation-api/7.0.3/mbean-annotation-api-7.0.3.jar:/home/jenkins/jenkins-slave/maven-repositories/0/org/apache/tomee/openejb-jpa-integration/7.0.3/openejb-jpa-integration-7.0.3.jar:/home/jenkins/jenkins-slave/maven-repositories/0/org/apache/commons/commons-lang3/3.5/commons-lang3-3.5.jar:/home/jenkins/jenkins-slave/maven-repositories/0/org/apache/tomee/openejb-api/7.0.3/openejb-api-7.0.3.jar:/home/jenkins/jenkins-slave/maven-repositories/0/org/apache/tomee/openejb-loader/7.0.3/openejb-loader-7.0.3.jar:/home/jenkins/jenkins-slave/maven-repositories/0/org/apache/tomee/openejb-javaagent/7.0.3/openejb-javaagent-7.0.3.jar:/home/jenkins/jenkins-slave/maven-repositories/0/org/apache/tomee/openejb-jee/7.0.3/openejb-jee-7.0.3.jar:/home/jenkins/jenkins-slave/maven-repositories/0/org/apache/tomee/openejb-jee-accessors/7.0.3/openejb-jee-accessors-7.0.3.jar:/home/jenkins/jenkins-slave/maven-repositories/0/org/metatype/sxc/sxc-jaxb-core/0.8/sxc-jaxb-core-0.8.jar:/home/jenkins/jenkins-slave/maven-repositories/0/org/metatype/sxc/sxc-runtime/0.8/sxc-runtime-0.8.jar:/home/jenkins/jenkins-slave/maven-repositories/0/commons-cli/commons-cli/1.2/commons-cli-1.2.jar:/home/jenkins/jenkins-slave/maven-repositories/0/commons-collections/commons-collections/3.2.2/commons-collections-3.2.2.jar:/home/jenkins/jenkins-slave/maven-repositories/0/org/apache/activemq/activemq-ra/5.14.3/activemq-ra-5.14.3.jar:/home/jenkins/jenkins-slave/maven-repositories/0/org/apache/activemq/activemq-kahadb-store/5.14.3/activemq-kahadb-store-5.14.3.jar:/home/jenkins/jenkins-slave/maven-repositories/0/org/apache/activemq/protobuf/activemq-protobuf/1.1/activemq-protobuf-1.1.jar:/home/jenkins/jenkins-slave/maven-repositories/0/org/apache/activemq/activemq-broker/5.14.3/activemq-broker-5.14.3.jar:/home/jenkins/jenkins-slave/maven-repositories/0/org/apache/activemq/activemq-client/5.14.3/activemq-client-5.14.3.jar:/home/jenkins/jenkins-slave/maven-repositories/0/org/fusesource/hawtbuf/hawtbuf/1.11/hawtbuf-1.11.jar:/home/jenkins/jenkins-slave/maven-repositories/0/org/apache/activemq/activemq-openwire-legacy/5.14.3/activemq-openwire-legacy-5.14.3.jar:/home/jenkins/jenkins-slave/maven-repositories/0/org/apache/activemq/activemq-jdbc-store/5.14.3/activemq-jdbc-store-5.14.3.jar:/home/jenkins/jenkins-slave/maven-repositories/0/org/apache/geronimo/components/geronimo-connector/3.1.4/geronimo-connector-3.1.4.jar:/home/jenkins/jenkins-slave/maven-repositories/0/org/apache/geronimo/specs/geronimo-j2ee-connector_1.6_spec/1.0/geronimo-j2ee-connector_1.6_spec-1.0.jar:/home/jenkins/jenkins-slave/maven-repositories/0/org/apache/geronimo/components/geronimo-transaction/3.1.4/geronimo-transaction-3.1.4.jar:/home/jenkins/jenkins-slave/maven-repositories/0/org/objectweb/howl/howl/1.0.1-1/howl-1.0.1-1.jar:/home/jenkins/jenkins-slave/maven-repositories/0/org/apache/geronimo/javamail/geronimo-javamail_1.4_mail/1.9.0-alpha-2/geronimo-javamail_1.4_mail-1.9.0-alpha-2.jar:/home/jenkins/jenkins-slave/maven-repositories/0/org/apache/xbean/xbean-asm5-shaded/4.5/xbean-asm5-shaded-4.5.jar:/home/jenkins/jenkins-slave/maven-repositories/0/org/apache/xbean/xbean-finder-shaded/4.5/xbean-finder-shaded-4.5.jar:/home/jenkins/jenkins-slave/maven-repositories/0/org/apache/xbean/xbean-reflect/4.5/xbean-reflect-4.5.jar:/home/jenkins/jenkins-slave/maven-repositories/0/org/apache/xbean/xbean-naming/4.5/xbean-naming-4.5.jar:/home/jenkins/jenkins-slave/maven-repositories/0/org/apache/xbean/xbean-bundleutils/4.5/xbean-bundleutils-4.5.jar:/home/jenkins/jenkins-slave/maven-repositories/0/org/hsqldb/hsqldb/2.3.2/hsqldb-2.3.2.jar:/home/jenkins/jenkins-slave/maven-repositories/0/org/apache/commons/commons-dbcp2/2.1/commons-dbcp2-2.1.jar:/home/jenkins/jenkins-slave/maven-repositories/0/org/apache/commons/commons-pool2/2.3/commons-pool2-2.3.jar:/home/jenkins/jenkins-slave/maven-repositories/0/org/codehaus/swizzle/swizzle-stream/1.6.2/swizzle-stream-1.6.2.jar:/home/jenkins/jenkins-slave/maven-repositories/0/org/apache/openejb/shade/quartz-openejb-shade/2.2.1/quartz-openejb-shade-2.2.1.jar:/home/jenkins/jenkins-slave/maven-repositories/0/org/slf4j/slf4j-jdk14/1.7.21/slf4j-jdk14-1.7.21.jar:/home/jenkins/jenkins-slave/maven-repositories/0/org/slf4j/slf4j-api/1.7.21/slf4j-api-1.7.21.jar:/home/jenkins/jenkins-slave/maven-repositories/0/org/apache/openwebbeans/openwebbeans-impl/1.2.7/openwebbeans-impl-1.2.7.jar:/home/jenkins/jenkins-slave/maven-repositories/0/org/apache/openwebbeans/openwebbeans-spi/1.2.7/openwebbeans-spi-1.2.7.jar:/home/jenkins/jenkins-slave/maven-repositories/0/org/apache/openwebbeans/openwebbeans-ejb/1.7.2/openwebbeans-ejb-1.7.2.jar:/home/jenkins/jenkins-slave/maven-repositories/0/org/apache/openwebbeans/openwebbeans-ee/1.7.2/openwebbeans-ee-1.7.2.jar:/home/jenkins/jenkins-slave/maven-repositories/0/org/apache/openwebbeans/openwebbeans-ee-common/1.7.2/openwebbeans-ee-common-1.7.2.jar:/home/jenkins/jenkins-slave/maven-repositories/0/org/apache/openwebbeans/openwebbeans-web/1.2.7/openwebbeans-web-1.2.7.jar:/home/jenkins/jenkins-slave/maven-repositories/0/org/apache/openwebbeans/openwebbeans-el22/1.2.7/openwebbeans-el22-1.2.7.jar:/home/jenkins/jenkins-slave/maven-repositories/0/org/apache/openjpa/openjpa/2.4.2/openjpa-2.4.2.jar:/home/jenkins/jenkins-slave/maven-repositories/0/commons-lang/commons-lang/2.6/commons-lang-2.6.jar:/home/jenkins/jenkins-slave/maven-repositories/0/net/sourceforge/serp/serp/1.15.1/serp-1.15.1.jar:/home/jenkins/jenkins-slave/maven-repositories/0/org/apache/bval/bval-core/1.1.2/bval-core-1.1.2.jar:/home/jenkins/jenkins-slave/maven-repositories/0/org/apache/bval/bval-jsr/1.1.2/bval-jsr-1.1.2.jar:/home/jenkins/jenkins-slave/maven-repositories/0/org/jboss/arquillian/testenricher/arquillian-testenricher-cdi/1.1.8.Final/arquillian-testenricher-cdi-1.1.8.Final.jar:/home/jenkins/jenkins-slave/maven-repositories/0/org/jboss/arquillian/test/arquillian-test-spi/1.1.8.Final/arquillian-test-spi-1.1.8.Final.jar:/home/jenkins/jenkins-slave/maven-repositories/0/org/jboss/arquillian/core/arquillian-core-spi/1.1.8.Final/arquillian-core-spi-1.1.8.Final.jar:/home/jenkins/jenkins-slave/maven-repositories/0/org/apache/tomee/arquillian-tomee-remote/7.0.3/arquillian-tomee-remote-7.0.3.jar:/home/jenkins/jenkins-slave/maven-repositories/0/org/apache/tomee/arquillian-openejb-transaction-provider/7.0.3/arquillian-openejb-transaction-provider-7.0.3.jar:/home/jenkins/jenkins-slave/maven-repositories/0/org/jboss/arquillian/extension/arquillian-transaction-impl-base/1.0.1.Final/arquillian-transaction-impl-base-1.0.1.Final.jar:/home/jenkins/jenkins-slave/maven-repositories/0/org/jboss/arquillian/extension/arquillian-transaction-api/1.0.1.Final/arquillian-transaction-api-1.0.1.Final.jar:/home/jenkins/jenkins-slave/maven-repositories/0/org/jboss/arquillian/extension/arquillian-transaction-spi/1.0.1.Final/arquillian-transaction-spi-1.0.1.Final.jar:/home/jenkins/jenkins-slave/maven-repositories/0/org/jboss/arquillian/container/arquillian-container-spi/1.1.8.Final/arquillian-container-spi-1.1.8.Final.jar:/home/jenkins/jenkins-slave/maven-repositories/0/org/jboss/arquillian/config/arquillian-config-api/1.1.8.Final/arquillian-config-api-1.1.8.Final.jar:/home/jenkins/jenkins-slave/maven-repositories/0/org/jboss/arquillian/config/arquillian-config-impl-base/1.1.8.Final/arquillian-config-impl-base-1.1.8.Final.jar:/home/jenkins/jenkins-slave/maven-repositories/0/org/jboss/arquillian/protocol/arquillian-protocol-servlet/1.1.8.Final/arquillian-protocol-servlet-1.1.8.Final.jar:/home/jenkins/jenkins-slave/maven-repositories/0/org/apache/geronimo/specs/geronimo-j2ee-deployment_1.1_spec/1.1/geronimo-j2ee-deployment_1.1_spec-1.1.jar:/home/jenkins/jenkins-slave/maven-repositories/0/org/apache/tomee/arquillian-tomee-common/7.0.3/arquillian-tomee-common-7.0.3.jar:/home/jenkins/jenkins-slave/maven-repositories/0/org/apache/tomee/tomee-common/7.0.3/tomee-common-7.0.3.jar:/home/jenkins/jenkins-slave/maven-repositories/0/org/jboss/shrinkwrap/descriptors/shrinkwrap-descriptors-api-base/2.0.0-alpha-7/shrinkwrap-descriptors-api-base-2.0.0-alpha-7.jar:/home/jenkins/jenkins-slave/maven-repositories/0/org/apache/tomee/arquillian-common/7.0.3/arquillian-common-7.0.3.jar:/home/jenkins/jenkins-slave/maven-repositories/0/commons-logging/commons-logging/1.1.1/commons-logging-1.1.1.jar:/home/jenkins/jenkins-slave/maven-repositories/0/junit/junit/4.10/junit-4.10.jar:/home/jenkins/jenkins-slave/maven-repositories/0/org/hamcrest/hamcrest-core/1.1/hamcrest-core-1.1.jar:/home/jenkins/jenkins-slave/maven-repositories/0/org/jboss/arquillian/junit/arquillian-junit-container/1.1.8.Final/arquillian-junit-container-1.1.8.Final.jar:/home/jenkins/jenkins-slave/maven-repositories/0/org/jboss/arquillian/junit/arquillian-junit-core/1.1.8.Final/arquillian-junit-core-1.1.8.Final.jar:/home/jenkins/jenkins-slave/maven-repositories/0/org/jboss/arquillian/test/arquillian-test-api/1.1.8.Final/arquillian-test-api-1.1.8.Final.jar:/home/jenkins/jenkins-slave/maven-repositories/0/org/jboss/arquillian/core/arquillian-core-api/1.1.8.Final/arquillian-core-api-1.1.8.Final.jar:/home/jenkins/jenkins-slave/maven-repositories/0/org/jboss/arquillian/container/arquillian-container-test-api/1.1.8.Final/arquillian-container-test-api-1.1.8.Final.jar:/home/jenkins/jenkins-slave/maven-repositories/0/org/jboss/arquillian/core/arquillian-core-impl-base/1.1.8.Final/arquillian-core-impl-base-1.1.8.Final.jar:/home/jenkins/jenkins-slave/maven-repositories/0/org/jboss/arquillian/test/arquillian-test-impl-base/1.1.8.Final/arquillian-test-impl-base-1.1.8.Final.jar:/home/jenkins/jenkins-slave/maven-repositories/0/org/jboss/arquillian/container/arquillian-container-impl-base/1.1.8.Final/arquillian-container-impl-base-1.1.8.Final.jar:/home/jenkins/jenkins-slave/maven-repositories/0/org/jboss/arquillian/container/arquillian-container-test-impl-base/1.1.8.Final/arquillian-container-test-impl-base-1.1.8.Final.jar:/home/jenkins/jenkins-slave/maven-repositories/0/org/jboss/shrinkwrap/shrinkwrap-impl-base/1.2.2/shrinkwrap-impl-base-1.2.2.jar:/home/jenkins/jenkins-slave/maven-repositories/0/org/jboss/shrinkwrap/shrinkwrap-spi/1.2.2/shrinkwrap-spi-1.2.2.jar:
[INFO] javac option: -proc:only
[INFO] javac option: -processor
[INFO] javac option: org.hibernate.jpamodelgen.JPAMetaModelEntityProcessor
[INFO] javac option: -d
[INFO] javac option: <https://builds.apache.org/job/DeltaSpike_TomEE_7.0.3/ws/deltaspike/modules/data/impl/target/test-classes>
[INFO] javac option: -s
[INFO] javac option: <https://builds.apache.org/job/DeltaSpike_TomEE_7.0.3/ws/deltaspike/modules/data/impl/target/generated-sources/apt-test>
[INFO] diagnostic Note: Hibernate JPA 2 Static-Metamodel Generator 1.2.0.Final
[INFO] diagnostic <https://builds.apache.org/job/DeltaSpike_TomEE_7.0.3/ws/deltaspike/modules/data/impl/src/test/java/org/apache/deltaspike/data/test/TransactionalTestCase.java>:24: error: cannot find symbol
import javax.transaction.UserTransaction;
                        ^
  symbol:   class UserTransaction
  location: package javax.transaction
[INFO] diagnostic <https://builds.apache.org/job/DeltaSpike_TomEE_7.0.3/ws/deltaspike/modules/data/impl/src/test/java/org/apache/deltaspike/data/test/TransactionalTestCase.java>:37: error: cannot find symbol
    protected UserTransaction ut;
              ^
  symbol:   class UserTransaction
  location: class org.apache.deltaspike.data.test.TransactionalTestCase
[INFO] diagnostic Note: Some input files use or override a deprecated API.
[INFO] diagnostic Note: Recompile with -Xlint:deprecation for details.
[INFO] diagnostic Note: Some input files use unchecked or unsafe operations.
[INFO] diagnostic Note: Recompile with -Xlint:unchecked for details.
[ERROR] error on execute: error during compilation
[INFO] ------------------------------------------------------------------------
[INFO] Reactor Summary:
[INFO] 
[INFO] Apache DeltaSpike .................................. SUCCESS [  4.955 s]
[INFO] Apache DeltaSpike Sources .......................... SUCCESS [  1.010 s]
[INFO] Apache DeltaSpike CheckStyle-rules ................. SUCCESS [  4.435 s]
[INFO] Apache DeltaSpike Parent ........................... SUCCESS [  5.807 s]
[INFO] Apache DeltaSpike Test-Utils ....................... SUCCESS [  7.232 s]
[INFO] Apache DeltaSpike Code Parent ...................... SUCCESS [01:04 min]
[INFO] Apache DeltaSpike Core ............................. SUCCESS [  3.353 s]
[INFO] Apache DeltaSpike Core-API ......................... SUCCESS [01:05 min]
[INFO] Apache DeltaSpike Core-Implementation .............. SUCCESS [01:53 min]
[INFO] Apache DeltaSpike ContainerControl parent .......... SUCCESS [  3.472 s]
[INFO] Apache DeltaSpike CDI ContainerControl API ......... SUCCESS [  4.679 s]
[INFO] Apache DeltaSpike CDI ContainerControl TCK ......... SUCCESS [  5.457 s]
[INFO] Apache DeltaSpike CDI OpenEJB-ContainerControl ..... SUCCESS [ 14.608 s]
[INFO] Apache DeltaSpike Modules .......................... SUCCESS [  3.263 s]
[INFO] Apache DeltaSpike Proxy-Module ..................... SUCCESS [  3.331 s]
[INFO] Apache DeltaSpike Proxy-Module API ................. SUCCESS [  4.998 s]
[INFO] Apache DeltaSpike Proxy-Module Impl ASM5 ........... SUCCESS [02:01 min]
[INFO] Apache DeltaSpike Security-Module .................. SUCCESS [  3.397 s]
[INFO] Apache DeltaSpike Security-Module API .............. SUCCESS [  4.901 s]
[INFO] Apache DeltaSpike Security-Module Impl ............. SUCCESS [01:48 min]
[INFO] Apache DeltaSpike JPA-Module ....................... SUCCESS [  3.493 s]
[INFO] Apache DeltaSpike JPA-Module API ................... SUCCESS [  5.485 s]
[INFO] Apache DeltaSpike JPA-Module Impl .................. SUCCESS [  9.932 s]
[INFO] Apache DeltaSpike Servlet-Module ................... SUCCESS [  3.863 s]
[INFO] Apache DeltaSpike Servlet-Module API ............... SUCCESS [  4.625 s]
[INFO] Apache DeltaSpike Servlet-Module Impl .............. SUCCESS [02:00 min]
[INFO] Apache DeltaSpike JSF-Module ....................... SUCCESS [  3.257 s]
[INFO] Apache DeltaSpike JSF-Module API ................... SUCCESS [  6.977 s]
[INFO] Apache DeltaSpike JSF-Module Impl .................. SUCCESS [01:57 min]
[INFO] Apache DeltaSpike JSF-Module Impl (EE6 only) ....... SUCCESS [  6.902 s]
[INFO] Apache DeltaSpike Partial-Bean-Module .............. SUCCESS [  3.307 s]
[INFO] Apache DeltaSpike Partial-Bean-Module API .......... SUCCESS [  4.624 s]
[INFO] Apache DeltaSpike Partial-Bean-Module Impl ......... SUCCESS [01:48 min]
[INFO] Apache DeltaSpike BeanValidation-Module ............ SUCCESS [  3.142 s]
[INFO] Apache DeltaSpike BeanValidation-Module API ........ SUCCESS [  4.479 s]
[INFO] Apache DeltaSpike BeanValidation-Module Impl ....... SUCCESS [01:48 min]
[INFO] Apache DeltaSpike Data-Module ...................... SUCCESS [  3.084 s]
[INFO] Apache DeltaSpike Data-Module API .................. SUCCESS [  6.904 s]
[INFO] Apache DeltaSpike Data-Module Impl ................. FAILURE [  7.014 s]
[INFO] Apache DeltaSpike Scheduler-Module ................. SKIPPED
[INFO] Apache DeltaSpike Scheduler-Module API ............. SKIPPED
[INFO] Apache DeltaSpike Scheduler-Module Impl ............ SKIPPED
[INFO] Apache DeltaSpike Test-Control-Module .............. SKIPPED
[INFO] Apache DeltaSpike Test-Control-Module API .......... SKIPPED
[INFO] Apache DeltaSpike Test-Control-Module Impl ......... SKIPPED
[INFO] Apache DeltaSpike Examples ......................... SKIPPED
[INFO] Apache DeltaSpike Java-SE Examples ................. SKIPPED
[INFO] Apache DeltaSpike JSF Examples ..................... SKIPPED
[INFO] Apache DeltaSpike JSF Playground ................... SKIPPED
[INFO] Apache DeltaSpike Security Example CDI ............. SKIPPED
[INFO] Apache DeltaSpike Security Example PicketLink ...... SKIPPED
[INFO] Apache DeltaSpike Java-SE Scheduler Examples ....... SKIPPED
[INFO] Apache DeltaSpike JPA Examples ..................... SKIPPED
[INFO] Apache DeltaSpike Data Examples .................... SKIPPED
[INFO] Apache DeltaSpike Distribution ..................... SKIPPED
[INFO] Apache DeltaSpike Distribution Bill of Materials ... SKIPPED
[INFO] Apache DeltaSpike Full Distribution ................ SKIPPED
[INFO] Apache DeltaSpike Documentation .................... SKIPPED
[INFO] Apache DeltaSpike Site ............................. SKIPPED
[INFO] ------------------------------------------------------------------------
[INFO] BUILD FAILURE
[INFO] ------------------------------------------------------------------------
[INFO] Total time: 20:22 min
[INFO] Finished at: 2017-11-29T10:17:54Z
[INFO] Final Memory: 85M/284M
[INFO] ------------------------------------------------------------------------
[ERROR] Failed to execute goal org.bsc.maven:maven-processor-plugin:2.0.7:process-test (process-test) on project deltaspike-data-module-impl: Error executing: error during compilation -> [Help 1]
[ERROR] 
[ERROR] To see the full stack trace of the errors, re-run Maven with the -e switch.
[ERROR] Re-run Maven using the -X switch to enable full debug logging.
[ERROR] 
[ERROR] For more information about the errors and possible solutions, please read the following articles:
[ERROR] [Help 1] http://cwiki.apache.org/confluence/display/MAVEN/MojoExecutionException
[ERROR] 
[ERROR] After correcting the problems, you can resume the build with the command
[ERROR]   mvn <goals> -rf :deltaspike-data-module-impl
Waiting for Jenkins to finish collecting data
[JENKINS] Archiving <https://builds.apache.org/job/DeltaSpike_TomEE_7.0.3/ws/deltaspike/cdictrl/tck/pom.xml> to org.apache.deltaspike.test/deltaspike-cdictrl-tck/1.8.1-SNAPSHOT/deltaspike-cdictrl-tck-1.8.1-SNAPSHOT.pom
[JENKINS] Archiving <https://builds.apache.org/job/DeltaSpike_TomEE_7.0.3/ws/deltaspike/cdictrl/tck/target/deltaspike-cdictrl-tck-1.8.1-SNAPSHOT.jar> to org.apache.deltaspike.test/deltaspike-cdictrl-tck/1.8.1-SNAPSHOT/deltaspike-cdictrl-tck-1.8.1-SNAPSHOT.jar
[JENKINS] Archiving <https://builds.apache.org/job/DeltaSpike_TomEE_7.0.3/ws/deltaspike/cdictrl/tck/target/deltaspike-cdictrl-tck-1.8.1-SNAPSHOT-tests.jar> to org.apache.deltaspike.test/deltaspike-cdictrl-tck/1.8.1-SNAPSHOT/deltaspike-cdictrl-tck-1.8.1-SNAPSHOT-tests.jar
[JENKINS] Archiving <https://builds.apache.org/job/DeltaSpike_TomEE_7.0.3/ws/deltaspike/cdictrl/tck/target/deltaspike-cdictrl-tck-1.8.1-SNAPSHOT-sources.jar> to org.apache.deltaspike.test/deltaspike-cdictrl-tck/1.8.1-SNAPSHOT/deltaspike-cdictrl-tck-1.8.1-SNAPSHOT-sources.jar
[JENKINS] Archiving <https://builds.apache.org/job/DeltaSpike_TomEE_7.0.3/ws/deltaspike/dist/pom.xml> to org.apache.deltaspike.distribution/distributions-project/1.8.1-SNAPSHOT/distributions-project-1.8.1-SNAPSHOT.pom
[JENKINS] Archiving <https://builds.apache.org/job/DeltaSpike_TomEE_7.0.3/ws/deltaspike/modules/jsf/impl/pom.xml> to org.apache.deltaspike.modules/deltaspike-jsf-module-impl/1.8.1-SNAPSHOT/deltaspike-jsf-module-impl-1.8.1-SNAPSHOT.pom
[JENKINS] Archiving <https://builds.apache.org/job/DeltaSpike_TomEE_7.0.3/ws/deltaspike/modules/jsf/impl/target/deltaspike-jsf-module-impl-1.8.1-SNAPSHOT.jar> to org.apache.deltaspike.modules/deltaspike-jsf-module-impl/1.8.1-SNAPSHOT/deltaspike-jsf-module-impl-1.8.1-SNAPSHOT.jar
[JENKINS] Archiving <https://builds.apache.org/job/DeltaSpike_TomEE_7.0.3/ws/deltaspike/modules/jsf/impl/target/deltaspike-jsf-module-impl-1.8.1-SNAPSHOT-tests.jar> to org.apache.deltaspike.modules/deltaspike-jsf-module-impl/1.8.1-SNAPSHOT/deltaspike-jsf-module-impl-1.8.1-SNAPSHOT-tests.jar
[JENKINS] Archiving <https://builds.apache.org/job/DeltaSpike_TomEE_7.0.3/ws/deltaspike/modules/jsf/impl/target/deltaspike-jsf-module-impl-1.8.1-SNAPSHOT-sources.jar> to org.apache.deltaspike.modules/deltaspike-jsf-module-impl/1.8.1-SNAPSHOT/deltaspike-jsf-module-impl-1.8.1-SNAPSHOT-sources.jar
[JENKINS] Archiving <https://builds.apache.org/job/DeltaSpike_TomEE_7.0.3/ws/deltaspike/modules/data/impl/pom.xml> to org.apache.deltaspike.modules/deltaspike-data-module-impl/1.8.1-SNAPSHOT/deltaspike-data-module-impl-1.8.1-SNAPSHOT.pom
[JENKINS] Archiving <https://builds.apache.org/job/DeltaSpike_TomEE_7.0.3/ws/deltaspike/modules/jsf/pom.xml> to org.apache.deltaspike.modules/jsf-module-project/1.8.1-SNAPSHOT/jsf-module-project-1.8.1-SNAPSHOT.pom
[JENKINS] Archiving <https://builds.apache.org/job/DeltaSpike_TomEE_7.0.3/ws/deltaspike/modules/jsf/target/jsf-module-project-1.8.1-SNAPSHOT-tests.jar> to org.apache.deltaspike.modules/jsf-module-project/1.8.1-SNAPSHOT/jsf-module-project-1.8.1-SNAPSHOT-tests.jar
[JENKINS] Archiving <https://builds.apache.org/job/DeltaSpike_TomEE_7.0.3/ws/deltaspike/modules/bean-validation/impl/pom.xml> to org.apache.deltaspike.modules/deltaspike-bean-validation-module-impl/1.8.1-SNAPSHOT/deltaspike-bean-validation-module-impl-1.8.1-SNAPSHOT.pom
[JENKINS] Archiving <https://builds.apache.org/job/DeltaSpike_TomEE_7.0.3/ws/deltaspike/modules/bean-validation/impl/target/deltaspike-bean-validation-module-impl-1.8.1-SNAPSHOT.jar> to org.apache.deltaspike.modules/deltaspike-bean-validation-module-impl/1.8.1-SNAPSHOT/deltaspike-bean-validation-module-impl-1.8.1-SNAPSHOT.jar
[JENKINS] Archiving <https://builds.apache.org/job/DeltaSpike_TomEE_7.0.3/ws/deltaspike/modules/bean-validation/impl/target/deltaspike-bean-validation-module-impl-1.8.1-SNAPSHOT-tests.jar> to org.apache.deltaspike.modules/deltaspike-bean-validation-module-impl/1.8.1-SNAPSHOT/deltaspike-bean-validation-module-impl-1.8.1-SNAPSHOT-tests.jar
[JENKINS] Archiving <https://builds.apache.org/job/DeltaSpike_TomEE_7.0.3/ws/deltaspike/modules/bean-validation/impl/target/deltaspike-bean-validation-module-impl-1.8.1-SNAPSHOT-sources.jar> to org.apache.deltaspike.modules/deltaspike-bean-validation-module-impl/1.8.1-SNAPSHOT/deltaspike-bean-validation-module-impl-1.8.1-SNAPSHOT-sources.jar
[JENKINS] Archiving <https://builds.apache.org/job/DeltaSpike_TomEE_7.0.3/ws/deltaspike/examples/jpa-examples/pom.xml> to org.apache.deltaspike.examples/deltaspike-jpa-examples/1.8.1-SNAPSHOT/deltaspike-jpa-examples-1.8.1-SNAPSHOT.pom
[JENKINS] Archiving <https://builds.apache.org/job/DeltaSpike_TomEE_7.0.3/ws/deltaspike/cdictrl/pom.xml> to org.apache.deltaspike.cdictrl/cdictrl-project/1.8.1-SNAPSHOT/cdictrl-project-1.8.1-SNAPSHOT.pom
[JENKINS] Archiving <https://builds.apache.org/job/DeltaSpike_TomEE_7.0.3/ws/deltaspike/cdictrl/target/cdictrl-project-1.8.1-SNAPSHOT-tests.jar> to org.apache.deltaspike.cdictrl/cdictrl-project/1.8.1-SNAPSHOT/cdictrl-project-1.8.1-SNAPSHOT-tests.jar
[JENKINS] Archiving <https://builds.apache.org/job/DeltaSpike_TomEE_7.0.3/ws/deltaspike/modules/partial-bean/api/pom.xml> to org.apache.deltaspike.modules/deltaspike-partial-bean-module-api/1.8.1-SNAPSHOT/deltaspike-partial-bean-module-api-1.8.1-SNAPSHOT.pom
[JENKINS] Archiving <https://builds.apache.org/job/DeltaSpike_TomEE_7.0.3/ws/deltaspike/modules/partial-bean/api/target/deltaspike-partial-bean-module-api-1.8.1-SNAPSHOT.jar> to org.apache.deltaspike.modules/deltaspike-partial-bean-module-api/1.8.1-SNAPSHOT/deltaspike-partial-bean-module-api-1.8.1-SNAPSHOT.jar
[JENKINS] Archiving <https://builds.apache.org/job/DeltaSpike_TomEE_7.0.3/ws/deltaspike/modules/partial-bean/api/target/deltaspike-partial-bean-module-api-1.8.1-SNAPSHOT-tests.jar> to org.apache.deltaspike.modules/deltaspike-partial-bean-module-api/1.8.1-SNAPSHOT/deltaspike-partial-bean-module-api-1.8.1-SNAPSHOT-tests.jar
[JENKINS] Archiving <https://builds.apache.org/job/DeltaSpike_TomEE_7.0.3/ws/deltaspike/modules/partial-bean/api/target/deltaspike-partial-bean-module-api-1.8.1-SNAPSHOT-sources.jar> to org.apache.deltaspike.modules/deltaspike-partial-bean-module-api/1.8.1-SNAPSHOT/deltaspike-partial-bean-module-api-1.8.1-SNAPSHOT-sources.jar
[JENKINS] Archiving <https://builds.apache.org/job/DeltaSpike_TomEE_7.0.3/ws/deltaspike/cdictrl/api/pom.xml> to org.apache.deltaspike.cdictrl/deltaspike-cdictrl-api/1.8.1-SNAPSHOT/deltaspike-cdictrl-api-1.8.1-SNAPSHOT.pom
[JENKINS] Archiving <https://builds.apache.org/job/DeltaSpike_TomEE_7.0.3/ws/deltaspike/cdictrl/api/target/deltaspike-cdictrl-api-1.8.1-SNAPSHOT.jar> to org.apache.deltaspike.cdictrl/deltaspike-cdictrl-api/1.8.1-SNAPSHOT/deltaspike-cdictrl-api-1.8.1-SNAPSHOT.jar
[JENKINS] Archiving <https://builds.apache.org/job/DeltaSpike_TomEE_7.0.3/ws/deltaspike/cdictrl/api/target/deltaspike-cdictrl-api-1.8.1-SNAPSHOT-tests.jar> to org.apache.deltaspike.cdictrl/deltaspike-cdictrl-api/1.8.1-SNAPSHOT/deltaspike-cdictrl-api-1.8.1-SNAPSHOT-tests.jar
[JENKINS] Archiving <https://builds.apache.org/job/DeltaSpike_TomEE_7.0.3/ws/deltaspike/cdictrl/api/target/deltaspike-cdictrl-api-1.8.1-SNAPSHOT-sources.jar> to org.apache.deltaspike.cdictrl/deltaspike-cdictrl-api/1.8.1-SNAPSHOT/deltaspike-cdictrl-api-1.8.1-SNAPSHOT-sources.jar
[JENKINS] Archiving <https://builds.apache.org/job/DeltaSpike_TomEE_7.0.3/ws/deltaspike/modules/security/api/pom.xml> to org.apache.deltaspike.modules/deltaspike-security-module-api/1.8.1-SNAPSHOT/deltaspike-security-module-api-1.8.1-SNAPSHOT.pom
[JENKINS] Archiving <https://builds.apache.org/job/DeltaSpike_TomEE_7.0.3/ws/deltaspike/modules/security/api/target/deltaspike-security-module-api-1.8.1-SNAPSHOT.jar> to org.apache.deltaspike.modules/deltaspike-security-module-api/1.8.1-SNAPSHOT/deltaspike-security-module-api-1.8.1-SNAPSHOT.jar
[JENKINS] Archiving <https://builds.apache.org/job/DeltaSpike_TomEE_7.0.3/ws/deltaspike/modules/security/api/target/deltaspike-security-module-api-1.8.1-SNAPSHOT-tests.jar> to org.apache.deltaspike.modules/deltaspike-security-module-api/1.8.1-SNAPSHOT/deltaspike-security-module-api-1.8.1-SNAPSHOT-tests.jar
[JENKINS] Archiving <https://builds.apache.org/job/DeltaSpike_TomEE_7.0.3/ws/deltaspike/modules/security/api/target/deltaspike-security-module-api-1.8.1-SNAPSHOT-sources.jar> to org.apache.deltaspike.modules/deltaspike-security-module-api/1.8.1-SNAPSHOT/deltaspike-security-module-api-1.8.1-SNAPSHOT-sources.jar
[JENKINS] Archiving <https://builds.apache.org/job/DeltaSpike_TomEE_7.0.3/ws/deltaspike/modules/data/api/pom.xml> to org.apache.deltaspike.modules/deltaspike-data-module-api/1.8.1-SNAPSHOT/deltaspike-data-module-api-1.8.1-SNAPSHOT.pom
[JENKINS] Archiving <https://builds.apache.org/job/DeltaSpike_TomEE_7.0.3/ws/deltaspike/modules/data/api/target/deltaspike-data-module-api-1.8.1-SNAPSHOT.jar> to org.apache.deltaspike.modules/deltaspike-data-module-api/1.8.1-SNAPSHOT/deltaspike-data-module-api-1.8.1-SNAPSHOT.jar
[JENKINS] Archiving <https://builds.apache.org/job/DeltaSpike_TomEE_7.0.3/ws/deltaspike/modules/data/api/target/deltaspike-data-module-api-1.8.1-SNAPSHOT-tests.jar> to org.apache.deltaspike.modules/deltaspike-data-module-api/1.8.1-SNAPSHOT/deltaspike-data-module-api-1.8.1-SNAPSHOT-tests.jar
[JENKINS] Archiving <https://builds.apache.org/job/DeltaSpike_TomEE_7.0.3/ws/deltaspike/modules/data/api/target/deltaspike-data-module-api-1.8.1-SNAPSHOT-sources.jar> to org.apache.deltaspike.modules/deltaspike-data-module-api/1.8.1-SNAPSHOT/deltaspike-data-module-api-1.8.1-SNAPSHOT-sources.jar
[JENKINS] Archiving <https://builds.apache.org/job/DeltaSpike_TomEE_7.0.3/ws/documentation/pom.xml> to org.apache.deltaspike/deltaspike-documentation/1.8.1-SNAPSHOT/deltaspike-documentation-1.8.1-SNAPSHOT.pom
[JENKINS] Archiving <https://builds.apache.org/job/DeltaSpike_TomEE_7.0.3/ws/deltaspike/examples/jse-examples/pom.xml> to org.apache.deltaspike.examples/deltaspike-jse-example/1.8.1-SNAPSHOT/deltaspike-jse-example-1.8.1-SNAPSHOT.pom
[JENKINS] Archiving <https://builds.apache.org/job/DeltaSpike_TomEE_7.0.3/ws/deltaspike/examples/pom.xml> to org.apache.deltaspike.examples/examples-project/1.8.1-SNAPSHOT/examples-project-1.8.1-SNAPSHOT.pom
[JENKINS] Archiving <https://builds.apache.org/job/DeltaSpike_TomEE_7.0.3/ws/deltaspike/modules/jpa/pom.xml> to org.apache.deltaspike.modules/jpa-module-project/1.8.1-SNAPSHOT/jpa-module-project-1.8.1-SNAPSHOT.pom
[JENKINS] Archiving <https://builds.apache.org/job/DeltaSpike_TomEE_7.0.3/ws/deltaspike/modules/jpa/target/jpa-module-project-1.8.1-SNAPSHOT-tests.jar> to org.apache.deltaspike.modules/jpa-module-project/1.8.1-SNAPSHOT/jpa-module-project-1.8.1-SNAPSHOT-tests.jar
[JENKINS] Archiving <https://builds.apache.org/job/DeltaSpike_TomEE_7.0.3/ws/deltaspike/modules/servlet/pom.xml> to org.apache.deltaspike.modules/servlet-module-project/1.8.1-SNAPSHOT/servlet-module-project-1.8.1-SNAPSHOT.pom
[JENKINS] Archiving <https://builds.apache.org/job/DeltaSpike_TomEE_7.0.3/ws/deltaspike/modules/servlet/target/servlet-module-project-1.8.1-SNAPSHOT-tests.jar> to org.apache.deltaspike.modules/servlet-module-project/1.8.1-SNAPSHOT/servlet-module-project-1.8.1-SNAPSHOT-tests.jar
[JENKINS] Archiving <https://builds.apache.org/job/DeltaSpike_TomEE_7.0.3/ws/deltaspike/pom.xml> to org.apache.deltaspike/deltaspike-project/1.8.1-SNAPSHOT/deltaspike-project-1.8.1-SNAPSHOT.pom
[JENKINS] Archiving <https://builds.apache.org/job/DeltaSpike_TomEE_7.0.3/ws/pom.xml> to org.apache.deltaspike/deltaspike/1.8.1-SNAPSHOT/deltaspike-1.8.1-SNAPSHOT.pom
[JENKINS] Archiving <https://builds.apache.org/job/DeltaSpike_TomEE_7.0.3/ws/deltaspike/core/impl/pom.xml> to org.apache.deltaspike.core/deltaspike-core-impl/1.8.1-SNAPSHOT/deltaspike-core-impl-1.8.1-SNAPSHOT.pom
[JENKINS] Archiving <https://builds.apache.org/job/DeltaSpike_TomEE_7.0.3/ws/deltaspike/core/impl/target/deltaspike-core-impl-1.8.1-SNAPSHOT.jar> to org.apache.deltaspike.core/deltaspike-core-impl/1.8.1-SNAPSHOT/deltaspike-core-impl-1.8.1-SNAPSHOT.jar
[JENKINS] Archiving <https://builds.apache.org/job/DeltaSpike_TomEE_7.0.3/ws/deltaspike/core/impl/target/deltaspike-core-impl-1.8.1-SNAPSHOT-tests.jar> to org.apache.deltaspike.core/deltaspike-core-impl/1.8.1-SNAPSHOT/deltaspike-core-impl-1.8.1-SNAPSHOT-tests.jar
[JENKINS] Archiving <https://builds.apache.org/job/DeltaSpike_TomEE_7.0.3/ws/deltaspike/core/impl/target/deltaspike-core-impl-1.8.1-SNAPSHOT-sources.jar> to org.apache.deltaspike.core/deltaspike-core-impl/1.8.1-SNAPSHOT/deltaspike-core-impl-1.8.1-SNAPSHOT-sources.jar
[JENKINS] Archiving <https://builds.apache.org/job/DeltaSpike_TomEE_7.0.3/ws/deltaspike/modules/partial-bean/pom.xml> to org.apache.deltaspike.modules/partial-bean-module-project/1.8.1-SNAPSHOT/partial-bean-module-project-1.8.1-SNAPSHOT.pom
[JENKINS] Archiving <https://builds.apache.org/job/DeltaSpike_TomEE_7.0.3/ws/deltaspike/modules/partial-bean/target/partial-bean-module-project-1.8.1-SNAPSHOT-tests.jar> to org.apache.deltaspike.modules/partial-bean-module-project/1.8.1-SNAPSHOT/partial-bean-module-project-1.8.1-SNAPSHOT-tests.jar
[JENKINS] Archiving <https://builds.apache.org/job/DeltaSpike_TomEE_7.0.3/ws/deltaspike/modules/proxy/pom.xml> to org.apache.deltaspike.modules/proxy-module-project/1.8.1-SNAPSHOT/proxy-module-project-1.8.1-SNAPSHOT.pom
[JENKINS] Archiving <https://builds.apache.org/job/DeltaSpike_TomEE_7.0.3/ws/deltaspike/modules/proxy/target/proxy-module-project-1.8.1-SNAPSHOT-tests.jar> to org.apache.deltaspike.modules/proxy-module-project/1.8.1-SNAPSHOT/proxy-module-project-1.8.1-SNAPSHOT-tests.jar
[JENKINS] Archiving <https://builds.apache.org/job/DeltaSpike_TomEE_7.0.3/ws/deltaspike/parent/pom.xml> to org.apache.deltaspike/parent/1.8.1-SNAPSHOT/parent-1.8.1-SNAPSHOT.pom
[Fast Archiver] Compressed 41.32 KB of artifacts by 77.4% relative to #88
[JENKINS] Archiving <https://builds.apache.org/job/DeltaSpike_TomEE_7.0.3/ws/deltaspike/modules/security/impl/pom.xml> to org.apache.deltaspike.modules/deltaspike-security-module-impl/1.8.1-SNAPSHOT/deltaspike-security-module-impl-1.8.1-SNAPSHOT.pom
[JENKINS] Archiving <https://builds.apache.org/job/DeltaSpike_TomEE_7.0.3/ws/deltaspike/modules/security/impl/target/deltaspike-security-module-impl-1.8.1-SNAPSHOT.jar> to org.apache.deltaspike.modules/deltaspike-security-module-impl/1.8.1-SNAPSHOT/deltaspike-security-module-impl-1.8.1-SNAPSHOT.jar
[JENKINS] Archiving <https://builds.apache.org/job/DeltaSpike_TomEE_7.0.3/ws/deltaspike/modules/security/impl/target/deltaspike-security-module-impl-1.8.1-SNAPSHOT-tests.jar> to org.apache.deltaspike.modules/deltaspike-security-module-impl/1.8.1-SNAPSHOT/deltaspike-security-module-impl-1.8.1-SNAPSHOT-tests.jar
[JENKINS] Archiving <https://builds.apache.org/job/DeltaSpike_TomEE_7.0.3/ws/deltaspike/modules/security/impl/target/deltaspike-security-module-impl-1.8.1-SNAPSHOT-sources.jar> to org.apache.deltaspike.modules/deltaspike-security-module-impl/1.8.1-SNAPSHOT/deltaspike-security-module-impl-1.8.1-SNAPSHOT-sources.jar
[JENKINS] Archiving <https://builds.apache.org/job/DeltaSpike_TomEE_7.0.3/ws/deltaspike/modules/jpa/api/pom.xml> to org.apache.deltaspike.modules/deltaspike-jpa-module-api/1.8.1-SNAPSHOT/deltaspike-jpa-module-api-1.8.1-SNAPSHOT.pom
[JENKINS] Archiving <https://builds.apache.org/job/DeltaSpike_TomEE_7.0.3/ws/deltaspike/modules/jpa/api/target/deltaspike-jpa-module-api-1.8.1-SNAPSHOT.jar> to org.apache.deltaspike.modules/deltaspike-jpa-module-api/1.8.1-SNAPSHOT/deltaspike-jpa-module-api-1.8.1-SNAPSHOT.jar
[JENKINS] Archiving <https://builds.apache.org/job/DeltaSpike_TomEE_7.0.3/ws/deltaspike/modules/jpa/api/target/deltaspike-jpa-module-api-1.8.1-SNAPSHOT-tests.jar> to org.apache.deltaspike.modules/deltaspike-jpa-module-api/1.8.1-SNAPSHOT/deltaspike-jpa-module-api-1.8.1-SNAPSHOT-tests.jar
[JENKINS] Archiving <https://builds.apache.org/job/DeltaSpike_TomEE_7.0.3/ws/deltaspike/modules/jpa/api/target/deltaspike-jpa-module-api-1.8.1-SNAPSHOT-sources.jar> to org.apache.deltaspike.modules/deltaspike-jpa-module-api/1.8.1-SNAPSHOT/deltaspike-jpa-module-api-1.8.1-SNAPSHOT-sources.jar
[JENKINS] Archiving <https://builds.apache.org/job/DeltaSpike_TomEE_7.0.3/ws/deltaspike/modules/proxy/impl-asm5/pom.xml> to org.apache.deltaspike.modules/deltaspike-proxy-module-impl-asm5/1.8.1-SNAPSHOT/deltaspike-proxy-module-impl-asm5-1.8.1-SNAPSHOT.pom
[JENKINS] Archiving <https://builds.apache.org/job/DeltaSpike_TomEE_7.0.3/ws/deltaspike/modules/proxy/impl-asm5/target/deltaspike-proxy-module-impl-asm5-1.8.1-SNAPSHOT.jar> to org.apache.deltaspike.modules/deltaspike-proxy-module-impl-asm5/1.8.1-SNAPSHOT/deltaspike-proxy-module-impl-asm5-1.8.1-SNAPSHOT.jar
[JENKINS] Archiving <https://builds.apache.org/job/DeltaSpike_TomEE_7.0.3/ws/deltaspike/modules/proxy/impl-asm5/target/deltaspike-proxy-module-impl-asm5-1.8.1-SNAPSHOT-tests.jar> to org.apache.deltaspike.modules/deltaspike-proxy-module-impl-asm5/1.8.1-SNAPSHOT/deltaspike-proxy-module-impl-asm5-1.8.1-SNAPSHOT-tests.jar
[JENKINS] Archiving <https://builds.apache.org/job/DeltaSpike_TomEE_7.0.3/ws/deltaspike/modules/proxy/impl-asm5/target/deltaspike-proxy-module-impl-asm5-1.8.1-SNAPSHOT-sources.jar> to org.apache.deltaspike.modules/deltaspike-proxy-module-impl-asm5/1.8.1-SNAPSHOT/deltaspike-proxy-module-impl-asm5-1.8.1-SNAPSHOT-sources.jar
[JENKINS] Archiving <https://builds.apache.org/job/DeltaSpike_TomEE_7.0.3/ws/deltaspike/dist/bom/pom.xml> to org.apache.deltaspike.distribution/distributions-bom/1.8.1-SNAPSHOT/distributions-bom-1.8.1-SNAPSHOT.pom
[JENKINS] Archiving <https://builds.apache.org/job/DeltaSpike_TomEE_7.0.3/ws/deltaspike/modules/bean-validation/pom.xml> to org.apache.deltaspike.modules/bean-validation-module-project/1.8.1-SNAPSHOT/bean-validation-module-project-1.8.1-SNAPSHOT.pom
[JENKINS] Archiving <https://builds.apache.org/job/DeltaSpike_TomEE_7.0.3/ws/deltaspike/modules/bean-validation/target/bean-validation-module-project-1.8.1-SNAPSHOT-tests.jar> to org.apache.deltaspike.modules/bean-validation-module-project/1.8.1-SNAPSHOT/bean-validation-module-project-1.8.1-SNAPSHOT-tests.jar
[JENKINS] Archiving <https://builds.apache.org/job/DeltaSpike_TomEE_7.0.3/ws/deltaspike/parent/code/pom.xml> to org.apache.deltaspike/parent-code/1.8.1-SNAPSHOT/parent-code-1.8.1-SNAPSHOT.pom
[JENKINS] Archiving <https://builds.apache.org/job/DeltaSpike_TomEE_7.0.3/ws/deltaspike/parent/code/target/parent-code-1.8.1-SNAPSHOT-tests.jar> to org.apache.deltaspike/parent-code/1.8.1-SNAPSHOT/parent-code-1.8.1-SNAPSHOT-tests.jar
[Fast Archiver] Compressed 102.91 KB of artifacts by 62.2% relative to #88
[JENKINS] Archiving <https://builds.apache.org/job/DeltaSpike_TomEE_7.0.3/ws/deltaspike/modules/jpa/impl/pom.xml> to org.apache.deltaspike.modules/deltaspike-jpa-module-impl/1.8.1-SNAPSHOT/deltaspike-jpa-module-impl-1.8.1-SNAPSHOT.pom
[JENKINS] Archiving <https://builds.apache.org/job/DeltaSpike_TomEE_7.0.3/ws/deltaspike/modules/jpa/impl/target/deltaspike-jpa-module-impl-1.8.1-SNAPSHOT.jar> to org.apache.deltaspike.modules/deltaspike-jpa-module-impl/1.8.1-SNAPSHOT/deltaspike-jpa-module-impl-1.8.1-SNAPSHOT.jar
[JENKINS] Archiving <https://builds.apache.org/job/DeltaSpike_TomEE_7.0.3/ws/deltaspike/modules/jpa/impl/target/deltaspike-jpa-module-impl-1.8.1-SNAPSHOT-tests.jar> to org.apache.deltaspike.modules/deltaspike-jpa-module-impl/1.8.1-SNAPSHOT/deltaspike-jpa-module-impl-1.8.1-SNAPSHOT-tests.jar
[JENKINS] Archiving <https://builds.apache.org/job/DeltaSpike_TomEE_7.0.3/ws/deltaspike/modules/jpa/impl/target/deltaspike-jpa-module-impl-1.8.1-SNAPSHOT-sources.jar> to org.apache.deltaspike.modules/deltaspike-jpa-module-impl/1.8.1-SNAPSHOT/deltaspike-jpa-module-impl-1.8.1-SNAPSHOT-sources.jar
[JENKINS] Archiving <https://builds.apache.org/job/DeltaSpike_TomEE_7.0.3/ws/deltaspike/modules/partial-bean/impl/pom.xml> to org.apache.deltaspike.modules/deltaspike-partial-bean-module-impl/1.8.1-SNAPSHOT/deltaspike-partial-bean-module-impl-1.8.1-SNAPSHOT.pom
[JENKINS] Archiving <https://builds.apache.org/job/DeltaSpike_TomEE_7.0.3/ws/deltaspike/modules/partial-bean/impl/target/deltaspike-partial-bean-module-impl-1.8.1-SNAPSHOT.jar> to org.apache.deltaspike.modules/deltaspike-partial-bean-module-impl/1.8.1-SNAPSHOT/deltaspike-partial-bean-module-impl-1.8.1-SNAPSHOT.jar
[JENKINS] Archiving <https://builds.apache.org/job/DeltaSpike_TomEE_7.0.3/ws/deltaspike/modules/partial-bean/impl/target/deltaspike-partial-bean-module-impl-1.8.1-SNAPSHOT-tests.jar> to org.apache.deltaspike.modules/deltaspike-partial-bean-module-impl/1.8.1-SNAPSHOT/deltaspike-partial-bean-module-impl-1.8.1-SNAPSHOT-tests.jar
[JENKINS] Archiving <https://builds.apache.org/job/DeltaSpike_TomEE_7.0.3/ws/deltaspike/modules/partial-bean/impl/target/deltaspike-partial-bean-module-impl-1.8.1-SNAPSHOT-sources.jar> to org.apache.deltaspike.modules/deltaspike-partial-bean-module-impl/1.8.1-SNAPSHOT/deltaspike-partial-bean-module-impl-1.8.1-SNAPSHOT-sources.jar
[JENKINS] Archiving <https://builds.apache.org/job/DeltaSpike_TomEE_7.0.3/ws/deltaspike/modules/scheduler/api/pom.xml> to org.apache.deltaspike.modules/deltaspike-scheduler-module-api/1.8.1-SNAPSHOT/deltaspike-scheduler-module-api-1.8.1-SNAPSHOT.pom
[JENKINS] Archiving <https://builds.apache.org/job/DeltaSpike_TomEE_7.0.3/ws/deltaspike/modules/test-control/pom.xml> to org.apache.deltaspike.modules/test-control-module-project/1.8.1-SNAPSHOT/test-control-module-project-1.8.1-SNAPSHOT.pom
[JENKINS] Archiving <https://builds.apache.org/job/DeltaSpike_TomEE_7.0.3/ws/deltaspike/modules/scheduler/impl/pom.xml> to org.apache.deltaspike.modules/deltaspike-scheduler-module-impl/1.8.1-SNAPSHOT/deltaspike-scheduler-module-impl-1.8.1-SNAPSHOT.pom
[JENKINS] Archiving <https://builds.apache.org/job/DeltaSpike_TomEE_7.0.3/ws/deltaspike/examples/jsf-playground/pom.xml> to org.apache.deltaspike.examples/deltaspike-jsf-playground/1.8.1-SNAPSHOT/deltaspike-jsf-playground-1.8.1-SNAPSHOT.pom
[JENKINS] Archiving <https://builds.apache.org/job/DeltaSpike_TomEE_7.0.3/ws/deltaspike/modules/test-control/impl/pom.xml> to org.apache.deltaspike.modules/deltaspike-test-control-module-impl/1.8.1-SNAPSHOT/deltaspike-test-control-module-impl-1.8.1-SNAPSHOT.pom
[JENKINS] Archiving <https://builds.apache.org/job/DeltaSpike_TomEE_7.0.3/ws/deltaspike/checkstyle-rules/pom.xml> to org.apache.deltaspike/checkstyle-rules/1.8.1-SNAPSHOT/checkstyle-rules-1.8.1-SNAPSHOT.pom
[JENKINS] Archiving <https://builds.apache.org/job/DeltaSpike_TomEE_7.0.3/ws/deltaspike/checkstyle-rules/target/checkstyle-rules-1.8.1-SNAPSHOT.jar> to org.apache.deltaspike/checkstyle-rules/1.8.1-SNAPSHOT/checkstyle-rules-1.8.1-SNAPSHOT.jar
[JENKINS] Archiving <https://builds.apache.org/job/DeltaSpike_TomEE_7.0.3/ws/deltaspike/modules/proxy/api/pom.xml> to org.apache.deltaspike.modules/deltaspike-proxy-module-api/1.8.1-SNAPSHOT/deltaspike-proxy-module-api-1.8.1-SNAPSHOT.pom
[JENKINS] Archiving <https://builds.apache.org/job/DeltaSpike_TomEE_7.0.3/ws/deltaspike/modules/proxy/api/target/deltaspike-proxy-module-api-1.8.1-SNAPSHOT.jar> to org.apache.deltaspike.modules/deltaspike-proxy-module-api/1.8.1-SNAPSHOT/deltaspike-proxy-module-api-1.8.1-SNAPSHOT.jar
[JENKINS] Archiving <https://builds.apache.org/job/DeltaSpike_TomEE_7.0.3/ws/deltaspike/modules/proxy/api/target/deltaspike-proxy-module-api-1.8.1-SNAPSHOT-tests.jar> to org.apache.deltaspike.modules/deltaspike-proxy-module-api/1.8.1-SNAPSHOT/deltaspike-proxy-module-api-1.8.1-SNAPSHOT-tests.jar
[JENKINS] Archiving <https://builds.apache.org/job/DeltaSpike_TomEE_7.0.3/ws/deltaspike/modules/proxy/api/target/deltaspike-proxy-module-api-1.8.1-SNAPSHOT-sources.jar> to org.apache.deltaspike.modules/deltaspike-proxy-module-api/1.8.1-SNAPSHOT/deltaspike-proxy-module-api-1.8.1-SNAPSHOT-sources.jar
[JENKINS] Archiving <https://builds.apache.org/job/DeltaSpike_TomEE_7.0.3/ws/deltaspike/modules/servlet/api/pom.xml> to org.apache.deltaspike.modules/deltaspike-servlet-module-api/1.8.1-SNAPSHOT/deltaspike-servlet-module-api-1.8.1-SNAPSHOT.pom
[JENKINS] Archiving <https://builds.apache.org/job/DeltaSpike_TomEE_7.0.3/ws/deltaspike/modules/servlet/api/target/deltaspike-servlet-module-api-1.8.1-SNAPSHOT.jar> to org.apache.deltaspike.modules/deltaspike-servlet-module-api/1.8.1-SNAPSHOT/deltaspike-servlet-module-api-1.8.1-SNAPSHOT.jar
[JENKINS] Archiving <https://builds.apache.org/job/DeltaSpike_TomEE_7.0.3/ws/deltaspike/modules/servlet/api/target/deltaspike-servlet-module-api-1.8.1-SNAPSHOT-tests.jar> to org.apache.deltaspike.modules/deltaspike-servlet-module-api/1.8.1-SNAPSHOT/deltaspike-servlet-module-api-1.8.1-SNAPSHOT-tests.jar
[JENKINS] Archiving <https://builds.apache.org/job/DeltaSpike_TomEE_7.0.3/ws/deltaspike/modules/servlet/api/target/deltaspike-servlet-module-api-1.8.1-SNAPSHOT-sources.jar> to org.apache.deltaspike.modules/deltaspike-servlet-module-api/1.8.1-SNAPSHOT/deltaspike-servlet-module-api-1.8.1-SNAPSHOT-sources.jar
[JENKINS] Archiving <https://builds.apache.org/job/DeltaSpike_TomEE_7.0.3/ws/deltaspike/examples/data-examples/pom.xml> to org.apache.deltaspike.examples/deltaspike-data-examples/1.8.1-SNAPSHOT/deltaspike-data-examples-1.8.1-SNAPSHOT.pom
[JENKINS] Archiving <https://builds.apache.org/job/DeltaSpike_TomEE_7.0.3/ws/deltaspike/core/api/pom.xml> to org.apache.deltaspike.core/deltaspike-core-api/1.8.1-SNAPSHOT/deltaspike-core-api-1.8.1-SNAPSHOT.pom
[JENKINS] Archiving <https://builds.apache.org/job/DeltaSpike_TomEE_7.0.3/ws/deltaspike/core/api/target/deltaspike-core-api-1.8.1-SNAPSHOT.jar> to org.apache.deltaspike.core/deltaspike-core-api/1.8.1-SNAPSHOT/deltaspike-core-api-1.8.1-SNAPSHOT.jar
[JENKINS] Archiving <https://builds.apache.org/job/DeltaSpike_TomEE_7.0.3/ws/deltaspike/core/api/target/deltaspike-core-api-1.8.1-SNAPSHOT-tests.jar> to org.apache.deltaspike.core/deltaspike-core-api/1.8.1-SNAPSHOT/deltaspike-core-api-1.8.1-SNAPSHOT-tests.jar
[JENKINS] Archiving <https://builds.apache.org/job/DeltaSpike_TomEE_7.0.3/ws/deltaspike/core/api/target/deltaspike-core-api-1.8.1-SNAPSHOT-sources.jar> to org.apache.deltaspike.core/deltaspike-core-api/1.8.1-SNAPSHOT/deltaspike-core-api-1.8.1-SNAPSHOT-sources.jar
[JENKINS] Archiving <https://builds.apache.org/job/DeltaSpike_TomEE_7.0.3/ws/deltaspike/examples/security-requested-page-after-login-picketlink/pom.xml> to org.apache.deltaspike.examples/deltaspike-security-requested-page-after-login-picketlink/1.8.1-SNAPSHOT/deltaspike-security-requested-page-after-login-picketlink-1.8.1-SNAPSHOT.pom
[JENKINS] Archiving <https://builds.apache.org/job/DeltaSpike_TomEE_7.0.3/ws/deltaspike/modules/bean-validation/api/pom.xml> to org.apache.deltaspike.modules/deltaspike-bean-validation-module-api/1.8.1-SNAPSHOT/deltaspike-bean-validation-module-api-1.8.1-SNAPSHOT.pom
[JENKINS] Archiving <https://builds.apache.org/job/DeltaSpike_TomEE_7.0.3/ws/deltaspike/modules/bean-validation/api/target/deltaspike-bean-validation-module-api-1.8.1-SNAPSHOT.jar> to org.apache.deltaspike.modules/deltaspike-bean-validation-module-api/1.8.1-SNAPSHOT/deltaspike-bean-validation-module-api-1.8.1-SNAPSHOT.jar
[JENKINS] Archiving <https://builds.apache.org/job/DeltaSpike_TomEE_7.0.3/ws/deltaspike/modules/bean-validation/api/target/deltaspike-bean-validation-module-api-1.8.1-SNAPSHOT-tests.jar> to org.apache.deltaspike.modules/deltaspike-bean-validation-module-api/1.8.1-SNAPSHOT/deltaspike-bean-validation-module-api-1.8.1-SNAPSHOT-tests.jar
[JENKINS] Archiving <https://builds.apache.org/job/DeltaSpike_TomEE_7.0.3/ws/deltaspike/modules/bean-validation/api/target/deltaspike-bean-validation-module-api-1.8.1-SNAPSHOT-sources.jar> to org.apache.deltaspike.modules/deltaspike-bean-validation-module-api/1.8.1-SNAPSHOT/deltaspike-bean-validation-module-api-1.8.1-SNAPSHOT-sources.jar
[JENKINS] Archiving <https://builds.apache.org/job/DeltaSpike_TomEE_7.0.3/ws/deltaspike/examples/scheduler-playground/pom.xml> to org.apache.deltaspike.examples/deltaspike-scheduler-example/1.8.1-SNAPSHOT/deltaspike-scheduler-example-1.8.1-SNAPSHOT.pom
[JENKINS] Archiving <https://builds.apache.org/job/DeltaSpike_TomEE_7.0.3/ws/deltaspike/modules/pom.xml> to org.apache.deltaspike.modules/modules-project/1.8.1-SNAPSHOT/modules-project-1.8.1-SNAPSHOT.pom
[JENKINS] Archiving <https://builds.apache.org/job/DeltaSpike_TomEE_7.0.3/ws/deltaspike/modules/target/modules-project-1.8.1-SNAPSHOT-tests.jar> to org.apache.deltaspike.modules/modules-project/1.8.1-SNAPSHOT/modules-project-1.8.1-SNAPSHOT-tests.jar
[JENKINS] Archiving <https://builds.apache.org/job/DeltaSpike_TomEE_7.0.3/ws/deltaspike/modules/scheduler/pom.xml> to org.apache.deltaspike.modules/scheduler-module-project/1.8.1-SNAPSHOT/scheduler-module-project-1.8.1-SNAPSHOT.pom
[JENKINS] Archiving <https://builds.apache.org/job/DeltaSpike_TomEE_7.0.3/ws/deltaspike/test-utils/pom.xml> to org.apache.deltaspike.test/test-utils/1.8.1-SNAPSHOT/test-utils-1.8.1-SNAPSHOT.pom
[JENKINS] Archiving <https://builds.apache.org/job/DeltaSpike_TomEE_7.0.3/ws/deltaspike/test-utils/target/test-utils-1.8.1-SNAPSHOT.jar> to org.apache.deltaspike.test/test-utils/1.8.1-SNAPSHOT/test-utils-1.8.1-SNAPSHOT.jar
[JENKINS] Archiving <https://builds.apache.org/job/DeltaSpike_TomEE_7.0.3/ws/deltaspike/test-utils/target/test-utils-1.8.1-SNAPSHOT-sources.jar> to org.apache.deltaspike.test/test-utils/1.8.1-SNAPSHOT/test-utils-1.8.1-SNAPSHOT-sources.jar
[JENKINS] Archiving <https://builds.apache.org/job/DeltaSpike_TomEE_7.0.3/ws/deltaspike/modules/security/pom.xml> to org.apache.deltaspike.modules/security-module-project/1.8.1-SNAPSHOT/security-module-project-1.8.1-SNAPSHOT.pom
[JENKINS] Archiving <https://builds.apache.org/job/DeltaSpike_TomEE_7.0.3/ws/deltaspike/modules/security/target/security-module-project-1.8.1-SNAPSHOT-tests.jar> to org.apache.deltaspike.modules/security-module-project/1.8.1-SNAPSHOT/security-module-project-1.8.1-SNAPSHOT-tests.jar
[JENKINS] Archiving <https://builds.apache.org/job/DeltaSpike_TomEE_7.0.3/ws/deltaspike/modules/jsf/api/pom.xml> to org.apache.deltaspike.modules/deltaspike-jsf-module-api/1.8.1-SNAPSHOT/deltaspike-jsf-module-api-1.8.1-SNAPSHOT.pom
[JENKINS] Archiving <https://builds.apache.org/job/DeltaSpike_TomEE_7.0.3/ws/deltaspike/modules/jsf/api/target/deltaspike-jsf-module-api-1.8.1-SNAPSHOT.jar> to org.apache.deltaspike.modules/deltaspike-jsf-module-api/1.8.1-SNAPSHOT/deltaspike-jsf-module-api-1.8.1-SNAPSHOT.jar
[JENKINS] Archiving <https://builds.apache.org/job/DeltaSpike_TomEE_7.0.3/ws/deltaspike/modules/jsf/api/target/deltaspike-jsf-module-api-1.8.1-SNAPSHOT-tests.jar> to org.apache.deltaspike.modules/deltaspike-jsf-module-api/1.8.1-SNAPSHOT/deltaspike-jsf-module-api-1.8.1-SNAPSHOT-tests.jar
[JENKINS] Archiving <https://builds.apache.org/job/DeltaSpike_TomEE_7.0.3/ws/deltaspike/modules/jsf/api/target/deltaspike-jsf-module-api-1.8.1-SNAPSHOT-sources.jar> to org.apache.deltaspike.modules/deltaspike-jsf-module-api/1.8.1-SNAPSHOT/deltaspike-jsf-module-api-1.8.1-SNAPSHOT-sources.jar
[JENKINS] Archiving <https://builds.apache.org/job/DeltaSpike_TomEE_7.0.3/ws/deltaspike/modules/data/pom.xml> to org.apache.deltaspike.modules/data-module-project/1.8.1-SNAPSHOT/data-module-project-1.8.1-SNAPSHOT.pom
[JENKINS] Archiving <https://builds.apache.org/job/DeltaSpike_TomEE_7.0.3/ws/deltaspike/modules/data/target/data-module-project-1.8.1-SNAPSHOT-tests.jar> to org.apache.deltaspike.modules/data-module-project/1.8.1-SNAPSHOT/data-module-project-1.8.1-SNAPSHOT-tests.jar
[JENKINS] Archiving <https://builds.apache.org/job/DeltaSpike_TomEE_7.0.3/ws/deltaspike/modules/servlet/impl/pom.xml> to org.apache.deltaspike.modules/deltaspike-servlet-module-impl/1.8.1-SNAPSHOT/deltaspike-servlet-module-impl-1.8.1-SNAPSHOT.pom
[JENKINS] Archiving <https://builds.apache.org/job/DeltaSpike_TomEE_7.0.3/ws/deltaspike/modules/servlet/impl/target/deltaspike-servlet-module-impl-1.8.1-SNAPSHOT.jar> to org.apache.deltaspike.modules/deltaspike-servlet-module-impl/1.8.1-SNAPSHOT/deltaspike-servlet-module-impl-1.8.1-SNAPSHOT.jar
[JENKINS] Archiving <https://builds.apache.org/job/DeltaSpike_TomEE_7.0.3/ws/deltaspike/modules/servlet/impl/target/deltaspike-servlet-module-impl-1.8.1-SNAPSHOT-tests.jar> to org.apache.deltaspike.modules/deltaspike-servlet-module-impl/1.8.1-SNAPSHOT/deltaspike-servlet-module-impl-1.8.1-SNAPSHOT-tests.jar
[JENKINS] Archiving <https://builds.apache.org/job/DeltaSpike_TomEE_7.0.3/ws/deltaspike/modules/servlet/impl/target/deltaspike-servlet-module-impl-1.8.1-SNAPSHOT-sources.jar> to org.apache.deltaspike.modules/deltaspike-servlet-module-impl/1.8.1-SNAPSHOT/deltaspike-servlet-module-impl-1.8.1-SNAPSHOT-sources.jar
[JENKINS] Archiving <https://builds.apache.org/job/DeltaSpike_TomEE_7.0.3/ws/deltaspike/modules/test-control/api/pom.xml> to org.apache.deltaspike.modules/deltaspike-test-control-module-api/1.8.1-SNAPSHOT/deltaspike-test-control-module-api-1.8.1-SNAPSHOT.pom
[JENKINS] Archiving <https://builds.apache.org/job/DeltaSpike_TomEE_7.0.3/ws/deltaspike/cdictrl/impl-openejb/pom.xml> to org.apache.deltaspike.cdictrl/deltaspike-cdictrl-openejb/1.8.1-SNAPSHOT/deltaspike-cdictrl-openejb-1.8.1-SNAPSHOT.pom
[JENKINS] Archiving <https://builds.apache.org/job/DeltaSpike_TomEE_7.0.3/ws/deltaspike/cdictrl/impl-openejb/target/deltaspike-cdictrl-openejb-1.8.1-SNAPSHOT.jar> to org.apache.deltaspike.cdictrl/deltaspike-cdictrl-openejb/1.8.1-SNAPSHOT/deltaspike-cdictrl-openejb-1.8.1-SNAPSHOT.jar
[JENKINS] Archiving <https://builds.apache.org/job/DeltaSpike_TomEE_7.0.3/ws/deltaspike/cdictrl/impl-openejb/target/deltaspike-cdictrl-openejb-1.8.1-SNAPSHOT-tests.jar> to org.apache.deltaspike.cdictrl/deltaspike-cdictrl-openejb/1.8.1-SNAPSHOT/deltaspike-cdictrl-openejb-1.8.1-SNAPSHOT-tests.jar
[JENKINS] Archiving <https://builds.apache.org/job/DeltaSpike_TomEE_7.0.3/ws/deltaspike/cdictrl/impl-openejb/target/deltaspike-cdictrl-openejb-1.8.1-SNAPSHOT-sources.jar> to org.apache.deltaspike.cdictrl/deltaspike-cdictrl-openejb/1.8.1-SNAPSHOT/deltaspike-cdictrl-openejb-1.8.1-SNAPSHOT-sources.jar
[JENKINS] Archiving <https://builds.apache.org/job/DeltaSpike_TomEE_7.0.3/ws/deltaspike/examples/jsf-examples/pom.xml> to org.apache.deltaspike.examples/deltaspike-jsf-example/1.8.1-SNAPSHOT/deltaspike-jsf-example-1.8.1-SNAPSHOT.pom
[JENKINS] Archiving <https://builds.apache.org/job/DeltaSpike_TomEE_7.0.3/ws/deltaspike/modules/jsf/impl-ee6/pom.xml> to org.apache.deltaspike.modules/deltaspike-jsf-module-impl-ee6/1.8.1-SNAPSHOT/deltaspike-jsf-module-impl-ee6-1.8.1-SNAPSHOT.pom
[JENKINS] Archiving <https://builds.apache.org/job/DeltaSpike_TomEE_7.0.3/ws/deltaspike/modules/jsf/impl-ee6/target/deltaspike-jsf-module-impl-ee6-1.8.1-SNAPSHOT.jar> to org.apache.deltaspike.modules/deltaspike-jsf-module-impl-ee6/1.8.1-SNAPSHOT/deltaspike-jsf-module-impl-ee6-1.8.1-SNAPSHOT.jar
[JENKINS] Archiving <https://builds.apache.org/job/DeltaSpike_TomEE_7.0.3/ws/deltaspike/modules/jsf/impl-ee6/target/deltaspike-jsf-module-impl-ee6-1.8.1-SNAPSHOT-tests.jar> to org.apache.deltaspike.modules/deltaspike-jsf-module-impl-ee6/1.8.1-SNAPSHOT/deltaspike-jsf-module-impl-ee6-1.8.1-SNAPSHOT-tests.jar
[JENKINS] Archiving <https://builds.apache.org/job/DeltaSpike_TomEE_7.0.3/ws/deltaspike/modules/jsf/impl-ee6/target/deltaspike-jsf-module-impl-ee6-1.8.1-SNAPSHOT-sources.jar> to org.apache.deltaspike.modules/deltaspike-jsf-module-impl-ee6/1.8.1-SNAPSHOT/deltaspike-jsf-module-impl-ee6-1.8.1-SNAPSHOT-sources.jar
[JENKINS] Archiving <https://builds.apache.org/job/DeltaSpike_TomEE_7.0.3/ws/deltaspike/examples/security-requested-page-after-login-cdi/pom.xml> to org.apache.deltaspike.examples/deltaspike-security-requested-page-after-login-cdi/1.8.1-SNAPSHOT/deltaspike-security-requested-page-after-login-cdi-1.8.1-SNAPSHOT.pom
[JENKINS] Archiving <https://builds.apache.org/job/DeltaSpike_TomEE_7.0.3/ws/deltaspike/core/pom.xml> to org.apache.deltaspike.core/core-project/1.8.1-SNAPSHOT/core-project-1.8.1-SNAPSHOT.pom
[JENKINS] Archiving <https://builds.apache.org/job/DeltaSpike_TomEE_7.0.3/ws/deltaspike/core/target/core-project-1.8.1-SNAPSHOT-tests.jar> to org.apache.deltaspike.core/core-project/1.8.1-SNAPSHOT/core-project-1.8.1-SNAPSHOT-tests.jar
[JENKINS] Archiving <https://builds.apache.org/job/DeltaSpike_TomEE_7.0.3/ws/deltaspike/dist/full/pom.xml> to org.apache.deltaspike.distribution/distribution-full/1.8.1-SNAPSHOT/distribution-full-1.8.1-SNAPSHOT.pom
[JENKINS] Archiving <https://builds.apache.org/job/DeltaSpike_TomEE_7.0.3/ws/site/pom.xml> to org.apache.deltaspike/deltaspike-site/1.8.1-SNAPSHOT/deltaspike-site-1.8.1-SNAPSHOT.pom
channel stopped

Mime
View raw message