deltaspike-commits mailing list archives

Site index · List index
Message view « Date » · « Thread »
Top « Date » · « Thread »
From Apache Jenkins Server <jenk...@builds.apache.org>
Subject Build failed in Jenkins: DeltaSpike Weld 3.0.0 #82
Date Wed, 29 Nov 2017 10:19:02 GMT
See <https://builds.apache.org/job/DeltaSpike%20Weld%203.0.0/82/display/redirect?page=changes>

Changes:

[rmannibucau] DELTASPIKE-1296 fixing configuration extension lifecycle

------------------------------------------
[...truncated 59.73 KB...]
Running org.apache.deltaspike.test.api.util.StringUtilsTest
Tests run: 1, Failures: 0, Errors: 0, Skipped: 0, Time elapsed: 0 sec - in org.apache.deltaspike.test.api.util.StringUtilsTest
Running org.apache.deltaspike.test.api.util.ExceptionUtilsTest
Tests run: 4, Failures: 0, Errors: 0, Skipped: 0, Time elapsed: 0.001 sec - in org.apache.deltaspike.test.api.util.ExceptionUtilsTest
Running org.apache.deltaspike.test.api.util.metadata.AnnotationInstanceProviderTest
Tests run: 19, Failures: 0, Errors: 0, Skipped: 0, Time elapsed: 0.028 sec - in org.apache.deltaspike.test.api.util.metadata.AnnotationInstanceProviderTest

Results :

Tests run: 76, Failures: 0, Errors: 0, Skipped: 0

[JENKINS] Recording test results
[INFO] 
[INFO] --- maven-bundle-plugin:2.3.7:bundle (default-bundle) @ deltaspike-core-api ---
[WARNING] Bundle org.apache.deltaspike.core:deltaspike-core-api:bundle:1.8.1-SNAPSHOT : Did
not find matching referal for !org.apache.deltaspike.core.*
[INFO] 
[INFO] --- maven-site-plugin:3.5.1:attach-descriptor (attach-descriptor) @ deltaspike-core-api
---
[INFO] 
[INFO] --- maven-jar-plugin:2.4:test-jar (default) @ deltaspike-core-api ---
[INFO] Building jar: <https://builds.apache.org/job/DeltaSpike%20Weld%203.0.0/ws/deltaspike/core/api/target/deltaspike-core-api-1.8.1-SNAPSHOT-tests.jar>
[INFO] 
[INFO] >>> maven-source-plugin:3.0.0:jar (attach-sources) > generate-sources @
deltaspike-core-api >>>
[INFO] 
[INFO] --- maven-bundle-plugin:2.3.7:cleanVersions (versions) @ deltaspike-core-api ---
[INFO] 
[INFO] --- maven-antrun-plugin:1.8:run (javadoc.resources) @ deltaspike-core-api ---
[WARNING] Parameter tasks is deprecated, use target instead
[INFO] Executing tasks

main:
[INFO] Executed tasks
[INFO] 
[INFO] <<< maven-source-plugin:3.0.0:jar (attach-sources) < generate-sources @
deltaspike-core-api <<<
[INFO] 
[INFO] 
[INFO] --- maven-source-plugin:3.0.0:jar (attach-sources) @ deltaspike-core-api ---
[INFO] Building jar: <https://builds.apache.org/job/DeltaSpike%20Weld%203.0.0/ws/deltaspike/core/api/target/deltaspike-core-api-1.8.1-SNAPSHOT-sources.jar>
[INFO] 
[INFO] --- maven-checkstyle-plugin:2.9.1:check (verify-style) @ deltaspike-core-api ---
[INFO] Starting audit...
Audit done.

[INFO] 
[INFO] --- maven-install-plugin:2.5.2:install (default-install) @ deltaspike-core-api ---
[INFO] Installing <https://builds.apache.org/job/DeltaSpike%20Weld%203.0.0/ws/deltaspike/core/api/target/deltaspike-core-api-1.8.1-SNAPSHOT.jar>
to /home/jenkins/jenkins-slave/maven-repositories/1/org/apache/deltaspike/core/deltaspike-core-api/1.8.1-SNAPSHOT/deltaspike-core-api-1.8.1-SNAPSHOT.jar
[INFO] Installing <https://builds.apache.org/job/DeltaSpike%20Weld%203.0.0/ws/deltaspike/core/api/pom.xml>
to /home/jenkins/jenkins-slave/maven-repositories/1/org/apache/deltaspike/core/deltaspike-core-api/1.8.1-SNAPSHOT/deltaspike-core-api-1.8.1-SNAPSHOT.pom
[INFO] Installing <https://builds.apache.org/job/DeltaSpike%20Weld%203.0.0/ws/deltaspike/core/api/target/deltaspike-core-api-1.8.1-SNAPSHOT-tests.jar>
to /home/jenkins/jenkins-slave/maven-repositories/1/org/apache/deltaspike/core/deltaspike-core-api/1.8.1-SNAPSHOT/deltaspike-core-api-1.8.1-SNAPSHOT-tests.jar
[INFO] Installing <https://builds.apache.org/job/DeltaSpike%20Weld%203.0.0/ws/deltaspike/core/api/target/deltaspike-core-api-1.8.1-SNAPSHOT-sources.jar>
to /home/jenkins/jenkins-slave/maven-repositories/1/org/apache/deltaspike/core/deltaspike-core-api/1.8.1-SNAPSHOT/deltaspike-core-api-1.8.1-SNAPSHOT-sources.jar
[INFO] 
[INFO] --- maven-bundle-plugin:2.3.7:install (default-install) @ deltaspike-core-api ---
[INFO] Installing org/apache/deltaspike/core/deltaspike-core-api/1.8.1-SNAPSHOT/deltaspike-core-api-1.8.1-SNAPSHOT.jar
[INFO] Writing OBR metadata
[INFO] 
[INFO] ------------------------------------------------------------------------
[INFO] Building Apache DeltaSpike Core-Implementation 1.8.1-SNAPSHOT
[INFO] ------------------------------------------------------------------------
[INFO] 
[INFO] --- maven-clean-plugin:3.0.0:clean (default-clean) @ deltaspike-core-impl ---
[INFO] Deleting <https://builds.apache.org/job/DeltaSpike%20Weld%203.0.0/ws/deltaspike/core/impl/target>
[INFO] 
[INFO] --- maven-bundle-plugin:2.3.7:cleanVersions (versions) @ deltaspike-core-impl ---
[INFO] 
[INFO] --- maven-antrun-plugin:1.8:run (javadoc.resources) @ deltaspike-core-impl ---
[WARNING] Parameter tasks is deprecated, use target instead
[INFO] Executing tasks

main:
[INFO] Executed tasks
[INFO] 
[INFO] --- maven-remote-resources-plugin:1.5:process (process-resource-bundles) @ deltaspike-core-impl
---
[INFO] 
[INFO] --- maven-resources-plugin:2.7:resources (default-resources) @ deltaspike-core-impl
---
[INFO] Using 'UTF-8' encoding to copy filtered resources.
[INFO] Copying 4 resources
[INFO] Copying 3 resources
[INFO] 
[INFO] --- maven-compiler-plugin:2.5:compile (default-compile) @ deltaspike-core-impl ---
[INFO] Compiling 87 source files to <https://builds.apache.org/job/DeltaSpike%20Weld%203.0.0/ws/deltaspike/core/impl/target/classes>
[INFO] -------------------------------------------------------------
[ERROR] COMPILATION ERROR : 
[INFO] -------------------------------------------------------------
[ERROR] <https://builds.apache.org/job/DeltaSpike%20Weld%203.0.0/ws/deltaspike/core/impl/src/main/java/org/apache/deltaspike/core/impl/config/ConfigurationExtension.java>:[307,25]
error: no suitable method found for add(ConfigSource)
[ERROR]     method Collection.add(ConfigSource) is not applicable
      (argument mismatch; Object cannot be converted to ConfigSource)
    method List.add(ConfigSource) is not applicable
      (argument mismatch; Object cannot be converted to ConfigSource)
<https://builds.apache.org/job/DeltaSpike%20Weld%203.0.0/ws/deltaspike/core/impl/src/main/java/org/apache/deltaspike/core/impl/config/ConfigurationExtension.java>:[313,78]
error: incompatible types: Object cannot be converted to ConfigFilter
[INFO] 2 errors 
[INFO] -------------------------------------------------------------
[INFO] ------------------------------------------------------------------------
[INFO] Reactor Summary:
[INFO] 
[INFO] Apache DeltaSpike .................................. SUCCESS [  4.718 s]
[INFO] Apache DeltaSpike Sources .......................... SUCCESS [  1.241 s]
[INFO] Apache DeltaSpike CheckStyle-rules ................. SUCCESS [  4.218 s]
[INFO] Apache DeltaSpike Parent ........................... SUCCESS [  5.055 s]
[INFO] Apache DeltaSpike Test-Utils ....................... SUCCESS [  6.615 s]
[INFO] Apache DeltaSpike Code Parent ...................... SUCCESS [ 24.711 s]
[INFO] Apache DeltaSpike Core ............................. SUCCESS [  3.421 s]
[INFO] Apache DeltaSpike Core-API ......................... SUCCESS [01:10 min]
[INFO] Apache DeltaSpike Core-Implementation .............. FAILURE [  3.486 s]
[INFO] Apache DeltaSpike ContainerControl parent .......... SKIPPED
[INFO] Apache DeltaSpike CDI ContainerControl API ......... SKIPPED
[INFO] Apache DeltaSpike CDI Weld-ContainerControl ........ SKIPPED
[INFO] Apache DeltaSpike CDI Servlet-ContainerControl ..... SKIPPED
[INFO] Apache DeltaSpike CDI ContainerControl TCK ......... SKIPPED
[INFO] Apache DeltaSpike Modules .......................... SKIPPED
[INFO] Apache DeltaSpike Proxy-Module ..................... SKIPPED
[INFO] Apache DeltaSpike Proxy-Module API ................. SKIPPED
[INFO] Apache DeltaSpike Proxy-Module Impl ASM5 ........... SKIPPED
[INFO] Apache DeltaSpike Security-Module .................. SKIPPED
[INFO] Apache DeltaSpike Security-Module API .............. SKIPPED
[INFO] Apache DeltaSpike Security-Module Impl ............. SKIPPED
[INFO] Apache DeltaSpike JPA-Module ....................... SKIPPED
[INFO] Apache DeltaSpike JPA-Module API ................... SKIPPED
[INFO] Apache DeltaSpike JPA-Module Impl .................. SKIPPED
[INFO] Apache DeltaSpike Servlet-Module ................... SKIPPED
[INFO] Apache DeltaSpike Servlet-Module API ............... SKIPPED
[INFO] Apache DeltaSpike Servlet-Module Impl .............. SKIPPED
[INFO] Apache DeltaSpike JSF-Module ....................... SKIPPED
[INFO] Apache DeltaSpike JSF-Module API ................... SKIPPED
[INFO] Apache DeltaSpike JSF-Module Impl .................. SKIPPED
[INFO] Apache DeltaSpike JSF-Module Impl (EE6 only) ....... SKIPPED
[INFO] Apache DeltaSpike Partial-Bean-Module .............. SKIPPED
[INFO] Apache DeltaSpike Partial-Bean-Module API .......... SKIPPED
[INFO] Apache DeltaSpike Partial-Bean-Module Impl ......... SKIPPED
[INFO] Apache DeltaSpike BeanValidation-Module ............ SKIPPED
[INFO] Apache DeltaSpike BeanValidation-Module API ........ SKIPPED
[INFO] Apache DeltaSpike BeanValidation-Module Impl ....... SKIPPED
[INFO] Apache DeltaSpike Data-Module ...................... SKIPPED
[INFO] Apache DeltaSpike Data-Module API .................. SKIPPED
[INFO] Apache DeltaSpike Data-Module Impl ................. SKIPPED
[INFO] Apache DeltaSpike Scheduler-Module ................. SKIPPED
[INFO] Apache DeltaSpike Scheduler-Module API ............. SKIPPED
[INFO] Apache DeltaSpike Scheduler-Module Impl ............ SKIPPED
[INFO] Apache DeltaSpike Test-Control-Module .............. SKIPPED
[INFO] Apache DeltaSpike Test-Control-Module API .......... SKIPPED
[INFO] Apache DeltaSpike Test-Control-Module Impl ......... SKIPPED
[INFO] Apache DeltaSpike Examples ......................... SKIPPED
[INFO] Apache DeltaSpike Java-SE Examples ................. SKIPPED
[INFO] Apache DeltaSpike JSF Examples ..................... SKIPPED
[INFO] Apache DeltaSpike JSF Playground ................... SKIPPED
[INFO] Apache DeltaSpike Security Example CDI ............. SKIPPED
[INFO] Apache DeltaSpike Security Example PicketLink ...... SKIPPED
[INFO] Apache DeltaSpike Java-SE Scheduler Examples ....... SKIPPED
[INFO] Apache DeltaSpike JPA Examples ..................... SKIPPED
[INFO] Apache DeltaSpike Data Examples .................... SKIPPED
[INFO] Apache DeltaSpike Distribution ..................... SKIPPED
[INFO] Apache DeltaSpike Distribution Bill of Materials ... SKIPPED
[INFO] Apache DeltaSpike Full Distribution ................ SKIPPED
[INFO] Apache DeltaSpike Documentation .................... SKIPPED
[INFO] Apache DeltaSpike Site ............................. SKIPPED
[INFO] ------------------------------------------------------------------------
[INFO] BUILD FAILURE
[INFO] ------------------------------------------------------------------------
[INFO] Total time: 03:10 min
[INFO] Finished at: 2017-11-29T10:16:48Z
[INFO] Final Memory: 62M/256M
[INFO] ------------------------------------------------------------------------
[ERROR] Failed to execute goal org.apache.maven.plugins:maven-compiler-plugin:2.5:compile
(default-compile) on project deltaspike-core-impl: Compilation failure: Compilation failure:
[ERROR] <https://builds.apache.org/job/DeltaSpike%20Weld%203.0.0/ws/deltaspike/core/impl/src/main/java/org/apache/deltaspike/core/impl/config/ConfigurationExtension.java>:[307,25]
error: no suitable method found for add(ConfigSource)
[ERROR] method Collection.add(ConfigSource) is not applicable
[ERROR] (argument mismatch; Object cannot be converted to ConfigSource)
[ERROR] method List.add(ConfigSource) is not applicable
[ERROR] (argument mismatch; Object cannot be converted to ConfigSource)
[ERROR] <https://builds.apache.org/job/DeltaSpike%20Weld%203.0.0/ws/deltaspike/core/impl/src/main/java/org/apache/deltaspike/core/impl/config/ConfigurationExtension.java>:[313,78]
error: incompatible types: Object cannot be converted to ConfigFilter
[ERROR] -> [Help 1]
[ERROR] 
[ERROR] To see the full stack trace of the errors, re-run Maven with the -e switch.
[ERROR] Re-run Maven using the -X switch to enable full debug logging.
[ERROR] 
[ERROR] For more information about the errors and possible solutions, please read the following
articles:
[ERROR] [Help 1] http://cwiki.apache.org/confluence/display/MAVEN/MojoFailureException
[ERROR] 
[ERROR] After correcting the problems, you can resume the build with the command
[ERROR]   mvn <goals> -rf :deltaspike-core-impl
[JENKINS] Archiving <https://builds.apache.org/job/DeltaSpike%20Weld%203.0.0/ws/deltaspike/cdictrl/tck/pom.xml>
to org.apache.deltaspike.test/deltaspike-cdictrl-tck/1.8.1-SNAPSHOT/deltaspike-cdictrl-tck-1.8.1-SNAPSHOT.pom
[JENKINS] Archiving <https://builds.apache.org/job/DeltaSpike%20Weld%203.0.0/ws/deltaspike/dist/pom.xml>
to org.apache.deltaspike.distribution/distributions-project/1.8.1-SNAPSHOT/distributions-project-1.8.1-SNAPSHOT.pom
[JENKINS] Archiving <https://builds.apache.org/job/DeltaSpike%20Weld%203.0.0/ws/deltaspike/modules/jsf/impl/pom.xml>
to org.apache.deltaspike.modules/deltaspike-jsf-module-impl/1.8.1-SNAPSHOT/deltaspike-jsf-module-impl-1.8.1-SNAPSHOT.pom
[JENKINS] Archiving <https://builds.apache.org/job/DeltaSpike%20Weld%203.0.0/ws/deltaspike/modules/data/impl/pom.xml>
to org.apache.deltaspike.modules/deltaspike-data-module-impl/1.8.1-SNAPSHOT/deltaspike-data-module-impl-1.8.1-SNAPSHOT.pom
[JENKINS] Archiving <https://builds.apache.org/job/DeltaSpike%20Weld%203.0.0/ws/deltaspike/modules/jsf/pom.xml>
to org.apache.deltaspike.modules/jsf-module-project/1.8.1-SNAPSHOT/jsf-module-project-1.8.1-SNAPSHOT.pom
[JENKINS] Archiving <https://builds.apache.org/job/DeltaSpike%20Weld%203.0.0/ws/deltaspike/modules/bean-validation/impl/pom.xml>
to org.apache.deltaspike.modules/deltaspike-bean-validation-module-impl/1.8.1-SNAPSHOT/deltaspike-bean-validation-module-impl-1.8.1-SNAPSHOT.pom
[JENKINS] Archiving <https://builds.apache.org/job/DeltaSpike%20Weld%203.0.0/ws/deltaspike/examples/jpa-examples/pom.xml>
to org.apache.deltaspike.examples/deltaspike-jpa-examples/1.8.1-SNAPSHOT/deltaspike-jpa-examples-1.8.1-SNAPSHOT.pom
[JENKINS] Archiving <https://builds.apache.org/job/DeltaSpike%20Weld%203.0.0/ws/deltaspike/cdictrl/pom.xml>
to org.apache.deltaspike.cdictrl/cdictrl-project/1.8.1-SNAPSHOT/cdictrl-project-1.8.1-SNAPSHOT.pom
[JENKINS] Archiving <https://builds.apache.org/job/DeltaSpike%20Weld%203.0.0/ws/deltaspike/modules/partial-bean/api/pom.xml>
to org.apache.deltaspike.modules/deltaspike-partial-bean-module-api/1.8.1-SNAPSHOT/deltaspike-partial-bean-module-api-1.8.1-SNAPSHOT.pom
[JENKINS] Archiving <https://builds.apache.org/job/DeltaSpike%20Weld%203.0.0/ws/deltaspike/cdictrl/api/pom.xml>
to org.apache.deltaspike.cdictrl/deltaspike-cdictrl-api/1.8.1-SNAPSHOT/deltaspike-cdictrl-api-1.8.1-SNAPSHOT.pom
[JENKINS] Archiving <https://builds.apache.org/job/DeltaSpike%20Weld%203.0.0/ws/deltaspike/modules/security/api/pom.xml>
to org.apache.deltaspike.modules/deltaspike-security-module-api/1.8.1-SNAPSHOT/deltaspike-security-module-api-1.8.1-SNAPSHOT.pom
[JENKINS] Archiving <https://builds.apache.org/job/DeltaSpike%20Weld%203.0.0/ws/deltaspike/modules/data/api/pom.xml>
to org.apache.deltaspike.modules/deltaspike-data-module-api/1.8.1-SNAPSHOT/deltaspike-data-module-api-1.8.1-SNAPSHOT.pom
[JENKINS] Archiving <https://builds.apache.org/job/DeltaSpike%20Weld%203.0.0/ws/documentation/pom.xml>
to org.apache.deltaspike/deltaspike-documentation/1.8.1-SNAPSHOT/deltaspike-documentation-1.8.1-SNAPSHOT.pom
[JENKINS] Archiving <https://builds.apache.org/job/DeltaSpike%20Weld%203.0.0/ws/deltaspike/examples/jse-examples/pom.xml>
to org.apache.deltaspike.examples/deltaspike-jse-example/1.8.1-SNAPSHOT/deltaspike-jse-example-1.8.1-SNAPSHOT.pom
[JENKINS] Archiving <https://builds.apache.org/job/DeltaSpike%20Weld%203.0.0/ws/deltaspike/examples/pom.xml>
to org.apache.deltaspike.examples/examples-project/1.8.1-SNAPSHOT/examples-project-1.8.1-SNAPSHOT.pom
[JENKINS] Archiving <https://builds.apache.org/job/DeltaSpike%20Weld%203.0.0/ws/deltaspike/modules/jpa/pom.xml>
to org.apache.deltaspike.modules/jpa-module-project/1.8.1-SNAPSHOT/jpa-module-project-1.8.1-SNAPSHOT.pom
[JENKINS] Archiving <https://builds.apache.org/job/DeltaSpike%20Weld%203.0.0/ws/deltaspike/modules/servlet/pom.xml>
to org.apache.deltaspike.modules/servlet-module-project/1.8.1-SNAPSHOT/servlet-module-project-1.8.1-SNAPSHOT.pom
[JENKINS] Archiving <https://builds.apache.org/job/DeltaSpike%20Weld%203.0.0/ws/deltaspike/pom.xml>
to org.apache.deltaspike/deltaspike-project/1.8.1-SNAPSHOT/deltaspike-project-1.8.1-SNAPSHOT.pom
[JENKINS] Archiving <https://builds.apache.org/job/DeltaSpike%20Weld%203.0.0/ws/pom.xml>
to org.apache.deltaspike/deltaspike/1.8.1-SNAPSHOT/deltaspike-1.8.1-SNAPSHOT.pom
[JENKINS] Archiving <https://builds.apache.org/job/DeltaSpike%20Weld%203.0.0/ws/deltaspike/core/impl/pom.xml>
to org.apache.deltaspike.core/deltaspike-core-impl/1.8.1-SNAPSHOT/deltaspike-core-impl-1.8.1-SNAPSHOT.pom
[JENKINS] Archiving <https://builds.apache.org/job/DeltaSpike%20Weld%203.0.0/ws/deltaspike/modules/partial-bean/pom.xml>
to org.apache.deltaspike.modules/partial-bean-module-project/1.8.1-SNAPSHOT/partial-bean-module-project-1.8.1-SNAPSHOT.pom
[JENKINS] Archiving <https://builds.apache.org/job/DeltaSpike%20Weld%203.0.0/ws/deltaspike/cdictrl/impl-weld/pom.xml>
to org.apache.deltaspike.cdictrl/deltaspike-cdictrl-weld/1.8.1-SNAPSHOT/deltaspike-cdictrl-weld-1.8.1-SNAPSHOT.pom
[JENKINS] Archiving <https://builds.apache.org/job/DeltaSpike%20Weld%203.0.0/ws/deltaspike/modules/proxy/pom.xml>
to org.apache.deltaspike.modules/proxy-module-project/1.8.1-SNAPSHOT/proxy-module-project-1.8.1-SNAPSHOT.pom
[JENKINS] Archiving <https://builds.apache.org/job/DeltaSpike%20Weld%203.0.0/ws/deltaspike/parent/pom.xml>
to org.apache.deltaspike/parent/1.8.1-SNAPSHOT/parent-1.8.1-SNAPSHOT.pom
[Fast Archiver] Compressed 41.32 KB of artifacts by 77.4% relative to #81
[JENKINS] Archiving <https://builds.apache.org/job/DeltaSpike%20Weld%203.0.0/ws/deltaspike/modules/security/impl/pom.xml>
to org.apache.deltaspike.modules/deltaspike-security-module-impl/1.8.1-SNAPSHOT/deltaspike-security-module-impl-1.8.1-SNAPSHOT.pom
[JENKINS] Archiving <https://builds.apache.org/job/DeltaSpike%20Weld%203.0.0/ws/deltaspike/modules/jpa/api/pom.xml>
to org.apache.deltaspike.modules/deltaspike-jpa-module-api/1.8.1-SNAPSHOT/deltaspike-jpa-module-api-1.8.1-SNAPSHOT.pom
[JENKINS] Archiving <https://builds.apache.org/job/DeltaSpike%20Weld%203.0.0/ws/deltaspike/modules/proxy/impl-asm5/pom.xml>
to org.apache.deltaspike.modules/deltaspike-proxy-module-impl-asm5/1.8.1-SNAPSHOT/deltaspike-proxy-module-impl-asm5-1.8.1-SNAPSHOT.pom
[JENKINS] Archiving <https://builds.apache.org/job/DeltaSpike%20Weld%203.0.0/ws/deltaspike/dist/bom/pom.xml>
to org.apache.deltaspike.distribution/distributions-bom/1.8.1-SNAPSHOT/distributions-bom-1.8.1-SNAPSHOT.pom
[JENKINS] Archiving <https://builds.apache.org/job/DeltaSpike%20Weld%203.0.0/ws/deltaspike/modules/bean-validation/pom.xml>
to org.apache.deltaspike.modules/bean-validation-module-project/1.8.1-SNAPSHOT/bean-validation-module-project-1.8.1-SNAPSHOT.pom
[JENKINS] Archiving <https://builds.apache.org/job/DeltaSpike%20Weld%203.0.0/ws/deltaspike/parent/code/pom.xml>
to org.apache.deltaspike/parent-code/1.8.1-SNAPSHOT/parent-code-1.8.1-SNAPSHOT.pom
[JENKINS] Archiving <https://builds.apache.org/job/DeltaSpike%20Weld%203.0.0/ws/deltaspike/parent/code/target/parent-code-1.8.1-SNAPSHOT-tests.jar>
to org.apache.deltaspike/parent-code/1.8.1-SNAPSHOT/parent-code-1.8.1-SNAPSHOT-tests.jar
[Fast Archiver] Compressed 102.91 KB of artifacts by 62.2% relative to #81
[JENKINS] Archiving <https://builds.apache.org/job/DeltaSpike%20Weld%203.0.0/ws/deltaspike/modules/jpa/impl/pom.xml>
to org.apache.deltaspike.modules/deltaspike-jpa-module-impl/1.8.1-SNAPSHOT/deltaspike-jpa-module-impl-1.8.1-SNAPSHOT.pom
[JENKINS] Archiving <https://builds.apache.org/job/DeltaSpike%20Weld%203.0.0/ws/deltaspike/modules/partial-bean/impl/pom.xml>
to org.apache.deltaspike.modules/deltaspike-partial-bean-module-impl/1.8.1-SNAPSHOT/deltaspike-partial-bean-module-impl-1.8.1-SNAPSHOT.pom
[JENKINS] Archiving <https://builds.apache.org/job/DeltaSpike%20Weld%203.0.0/ws/deltaspike/cdictrl/servlet/pom.xml>
to org.apache.deltaspike.cdictrl/deltaspike-cdictrl-servlet/1.8.1-SNAPSHOT/deltaspike-cdictrl-servlet-1.8.1-SNAPSHOT.pom
[JENKINS] Archiving <https://builds.apache.org/job/DeltaSpike%20Weld%203.0.0/ws/deltaspike/modules/scheduler/api/pom.xml>
to org.apache.deltaspike.modules/deltaspike-scheduler-module-api/1.8.1-SNAPSHOT/deltaspike-scheduler-module-api-1.8.1-SNAPSHOT.pom
[JENKINS] Archiving <https://builds.apache.org/job/DeltaSpike%20Weld%203.0.0/ws/deltaspike/modules/test-control/pom.xml>
to org.apache.deltaspike.modules/test-control-module-project/1.8.1-SNAPSHOT/test-control-module-project-1.8.1-SNAPSHOT.pom
[JENKINS] Archiving <https://builds.apache.org/job/DeltaSpike%20Weld%203.0.0/ws/deltaspike/modules/scheduler/impl/pom.xml>
to org.apache.deltaspike.modules/deltaspike-scheduler-module-impl/1.8.1-SNAPSHOT/deltaspike-scheduler-module-impl-1.8.1-SNAPSHOT.pom
[JENKINS] Archiving <https://builds.apache.org/job/DeltaSpike%20Weld%203.0.0/ws/deltaspike/examples/jsf-playground/pom.xml>
to org.apache.deltaspike.examples/deltaspike-jsf-playground/1.8.1-SNAPSHOT/deltaspike-jsf-playground-1.8.1-SNAPSHOT.pom
[JENKINS] Archiving <https://builds.apache.org/job/DeltaSpike%20Weld%203.0.0/ws/deltaspike/modules/test-control/impl/pom.xml>
to org.apache.deltaspike.modules/deltaspike-test-control-module-impl/1.8.1-SNAPSHOT/deltaspike-test-control-module-impl-1.8.1-SNAPSHOT.pom
[JENKINS] Archiving <https://builds.apache.org/job/DeltaSpike%20Weld%203.0.0/ws/deltaspike/checkstyle-rules/pom.xml>
to org.apache.deltaspike/checkstyle-rules/1.8.1-SNAPSHOT/checkstyle-rules-1.8.1-SNAPSHOT.pom
[JENKINS] Archiving <https://builds.apache.org/job/DeltaSpike%20Weld%203.0.0/ws/deltaspike/checkstyle-rules/target/checkstyle-rules-1.8.1-SNAPSHOT.jar>
to org.apache.deltaspike/checkstyle-rules/1.8.1-SNAPSHOT/checkstyle-rules-1.8.1-SNAPSHOT.jar
[JENKINS] Archiving <https://builds.apache.org/job/DeltaSpike%20Weld%203.0.0/ws/deltaspike/modules/proxy/api/pom.xml>
to org.apache.deltaspike.modules/deltaspike-proxy-module-api/1.8.1-SNAPSHOT/deltaspike-proxy-module-api-1.8.1-SNAPSHOT.pom
[JENKINS] Archiving <https://builds.apache.org/job/DeltaSpike%20Weld%203.0.0/ws/deltaspike/modules/servlet/api/pom.xml>
to org.apache.deltaspike.modules/deltaspike-servlet-module-api/1.8.1-SNAPSHOT/deltaspike-servlet-module-api-1.8.1-SNAPSHOT.pom
[JENKINS] Archiving <https://builds.apache.org/job/DeltaSpike%20Weld%203.0.0/ws/deltaspike/examples/data-examples/pom.xml>
to org.apache.deltaspike.examples/deltaspike-data-examples/1.8.1-SNAPSHOT/deltaspike-data-examples-1.8.1-SNAPSHOT.pom
[JENKINS] Archiving <https://builds.apache.org/job/DeltaSpike%20Weld%203.0.0/ws/deltaspike/core/api/pom.xml>
to org.apache.deltaspike.core/deltaspike-core-api/1.8.1-SNAPSHOT/deltaspike-core-api-1.8.1-SNAPSHOT.pom
[JENKINS] Archiving <https://builds.apache.org/job/DeltaSpike%20Weld%203.0.0/ws/deltaspike/core/api/target/deltaspike-core-api-1.8.1-SNAPSHOT.jar>
to org.apache.deltaspike.core/deltaspike-core-api/1.8.1-SNAPSHOT/deltaspike-core-api-1.8.1-SNAPSHOT.jar
[JENKINS] Archiving <https://builds.apache.org/job/DeltaSpike%20Weld%203.0.0/ws/deltaspike/core/api/target/deltaspike-core-api-1.8.1-SNAPSHOT-tests.jar>
to org.apache.deltaspike.core/deltaspike-core-api/1.8.1-SNAPSHOT/deltaspike-core-api-1.8.1-SNAPSHOT-tests.jar
[JENKINS] Archiving <https://builds.apache.org/job/DeltaSpike%20Weld%203.0.0/ws/deltaspike/core/api/target/deltaspike-core-api-1.8.1-SNAPSHOT-sources.jar>
to org.apache.deltaspike.core/deltaspike-core-api/1.8.1-SNAPSHOT/deltaspike-core-api-1.8.1-SNAPSHOT-sources.jar
[JENKINS] Archiving <https://builds.apache.org/job/DeltaSpike%20Weld%203.0.0/ws/deltaspike/examples/security-requested-page-after-login-picketlink/pom.xml>
to org.apache.deltaspike.examples/deltaspike-security-requested-page-after-login-picketlink/1.8.1-SNAPSHOT/deltaspike-security-requested-page-after-login-picketlink-1.8.1-SNAPSHOT.pom
[JENKINS] Archiving <https://builds.apache.org/job/DeltaSpike%20Weld%203.0.0/ws/deltaspike/modules/bean-validation/api/pom.xml>
to org.apache.deltaspike.modules/deltaspike-bean-validation-module-api/1.8.1-SNAPSHOT/deltaspike-bean-validation-module-api-1.8.1-SNAPSHOT.pom
[JENKINS] Archiving <https://builds.apache.org/job/DeltaSpike%20Weld%203.0.0/ws/deltaspike/examples/scheduler-playground/pom.xml>
to org.apache.deltaspike.examples/deltaspike-scheduler-example/1.8.1-SNAPSHOT/deltaspike-scheduler-example-1.8.1-SNAPSHOT.pom
[JENKINS] Archiving <https://builds.apache.org/job/DeltaSpike%20Weld%203.0.0/ws/deltaspike/modules/pom.xml>
to org.apache.deltaspike.modules/modules-project/1.8.1-SNAPSHOT/modules-project-1.8.1-SNAPSHOT.pom
[JENKINS] Archiving <https://builds.apache.org/job/DeltaSpike%20Weld%203.0.0/ws/deltaspike/modules/scheduler/pom.xml>
to org.apache.deltaspike.modules/scheduler-module-project/1.8.1-SNAPSHOT/scheduler-module-project-1.8.1-SNAPSHOT.pom
[JENKINS] Archiving <https://builds.apache.org/job/DeltaSpike%20Weld%203.0.0/ws/deltaspike/test-utils/pom.xml>
to org.apache.deltaspike.test/test-utils/1.8.1-SNAPSHOT/test-utils-1.8.1-SNAPSHOT.pom
[JENKINS] Archiving <https://builds.apache.org/job/DeltaSpike%20Weld%203.0.0/ws/deltaspike/test-utils/target/test-utils-1.8.1-SNAPSHOT.jar>
to org.apache.deltaspike.test/test-utils/1.8.1-SNAPSHOT/test-utils-1.8.1-SNAPSHOT.jar
[JENKINS] Archiving <https://builds.apache.org/job/DeltaSpike%20Weld%203.0.0/ws/deltaspike/test-utils/target/test-utils-1.8.1-SNAPSHOT-sources.jar>
to org.apache.deltaspike.test/test-utils/1.8.1-SNAPSHOT/test-utils-1.8.1-SNAPSHOT-sources.jar
[JENKINS] Archiving <https://builds.apache.org/job/DeltaSpike%20Weld%203.0.0/ws/deltaspike/modules/security/pom.xml>
to org.apache.deltaspike.modules/security-module-project/1.8.1-SNAPSHOT/security-module-project-1.8.1-SNAPSHOT.pom
[JENKINS] Archiving <https://builds.apache.org/job/DeltaSpike%20Weld%203.0.0/ws/deltaspike/modules/jsf/api/pom.xml>
to org.apache.deltaspike.modules/deltaspike-jsf-module-api/1.8.1-SNAPSHOT/deltaspike-jsf-module-api-1.8.1-SNAPSHOT.pom
[JENKINS] Archiving <https://builds.apache.org/job/DeltaSpike%20Weld%203.0.0/ws/deltaspike/modules/data/pom.xml>
to org.apache.deltaspike.modules/data-module-project/1.8.1-SNAPSHOT/data-module-project-1.8.1-SNAPSHOT.pom
[JENKINS] Archiving <https://builds.apache.org/job/DeltaSpike%20Weld%203.0.0/ws/deltaspike/modules/servlet/impl/pom.xml>
to org.apache.deltaspike.modules/deltaspike-servlet-module-impl/1.8.1-SNAPSHOT/deltaspike-servlet-module-impl-1.8.1-SNAPSHOT.pom
[JENKINS] Archiving <https://builds.apache.org/job/DeltaSpike%20Weld%203.0.0/ws/deltaspike/modules/test-control/api/pom.xml>
to org.apache.deltaspike.modules/deltaspike-test-control-module-api/1.8.1-SNAPSHOT/deltaspike-test-control-module-api-1.8.1-SNAPSHOT.pom
[JENKINS] Archiving <https://builds.apache.org/job/DeltaSpike%20Weld%203.0.0/ws/deltaspike/examples/jsf-examples/pom.xml>
to org.apache.deltaspike.examples/deltaspike-jsf-example/1.8.1-SNAPSHOT/deltaspike-jsf-example-1.8.1-SNAPSHOT.pom
[JENKINS] Archiving <https://builds.apache.org/job/DeltaSpike%20Weld%203.0.0/ws/deltaspike/modules/jsf/impl-ee6/pom.xml>
to org.apache.deltaspike.modules/deltaspike-jsf-module-impl-ee6/1.8.1-SNAPSHOT/deltaspike-jsf-module-impl-ee6-1.8.1-SNAPSHOT.pom
[JENKINS] Archiving <https://builds.apache.org/job/DeltaSpike%20Weld%203.0.0/ws/deltaspike/examples/security-requested-page-after-login-cdi/pom.xml>
to org.apache.deltaspike.examples/deltaspike-security-requested-page-after-login-cdi/1.8.1-SNAPSHOT/deltaspike-security-requested-page-after-login-cdi-1.8.1-SNAPSHOT.pom
[JENKINS] Archiving <https://builds.apache.org/job/DeltaSpike%20Weld%203.0.0/ws/deltaspike/core/pom.xml>
to org.apache.deltaspike.core/core-project/1.8.1-SNAPSHOT/core-project-1.8.1-SNAPSHOT.pom
[JENKINS] Archiving <https://builds.apache.org/job/DeltaSpike%20Weld%203.0.0/ws/deltaspike/core/target/core-project-1.8.1-SNAPSHOT-tests.jar>
to org.apache.deltaspike.core/core-project/1.8.1-SNAPSHOT/core-project-1.8.1-SNAPSHOT-tests.jar
[JENKINS] Archiving <https://builds.apache.org/job/DeltaSpike%20Weld%203.0.0/ws/deltaspike/dist/full/pom.xml>
to org.apache.deltaspike.distribution/distribution-full/1.8.1-SNAPSHOT/distribution-full-1.8.1-SNAPSHOT.pom
[JENKINS] Archiving <https://builds.apache.org/job/DeltaSpike%20Weld%203.0.0/ws/site/pom.xml>
to org.apache.deltaspike/deltaspike-site/1.8.1-SNAPSHOT/deltaspike-site-1.8.1-SNAPSHOT.pom
channel stopped
No JDK named ?JDK 1.8.0_102? found
No JDK named ?JDK 1.8.0_102? found

Mime
View raw message