deltaspike-commits mailing list archives

Site index · List index
Message view « Date » · « Thread »
Top « Date » · « Thread »
From Apache Jenkins Server <jenk...@builds.apache.org>
Subject Build failed in Jenkins: DeltaSpike Examples #1709
Date Sat, 09 Sep 2017 14:06:27 GMT
See <https://builds.apache.org/job/DeltaSpike%20Examples/1709/display/redirect>

------------------------------------------
[...truncated 652.69 KB...]
[INFO] 
[INFO] --- maven-resources-plugin:2.7:testResources (default-testResources) @ deltaspike-data-module-test-java8
---
[INFO] Using 'UTF-8' encoding to copy filtered resources.
[INFO] skip non existing resourceDirectory <https://builds.apache.org/job/DeltaSpike%20Examples/ws/deltaspike/modules/data/test-java8/src/test/resources>
[INFO] Copying 3 resources
[INFO] 
[INFO] --- maven-compiler-plugin:2.3.2:testCompile (default-testCompile) @ deltaspike-data-module-test-java8
---
[INFO] Compiling 7 source files to <https://builds.apache.org/job/DeltaSpike%20Examples/ws/deltaspike/modules/data/test-java8/target/test-classes>
[INFO] -------------------------------------------------------------
[ERROR] COMPILATION ERROR : 
[INFO] -------------------------------------------------------------
[ERROR] Failure executing javac,  but could not parse the error:
javac: invalid target release: 1.8
Usage: javac <options> <source files>
use -help for a list of possible options

[INFO] 1 error
[INFO] -------------------------------------------------------------
[INFO] ------------------------------------------------------------------------
[INFO] Reactor Summary:
[INFO] 
[INFO] Apache DeltaSpike Sources .......................... SUCCESS [  5.507 s]
[INFO] Apache DeltaSpike CheckStyle-rules ................. SUCCESS [  4.019 s]
[INFO] Apache DeltaSpike Parent ........................... SUCCESS [  6.084 s]
[INFO] Apache DeltaSpike Test-Utils ....................... SUCCESS [  6.711 s]
[INFO] Apache DeltaSpike Code Parent ...................... SUCCESS [  3.952 s]
[INFO] Apache DeltaSpike Core ............................. SUCCESS [  3.265 s]
[INFO] Apache DeltaSpike Core-API ......................... SUCCESS [ 25.366 s]
[INFO] Apache DeltaSpike Core-Implementation .............. SUCCESS [ 44.630 s]
[INFO] Apache DeltaSpike ContainerControl parent .......... SUCCESS [  2.886 s]
[INFO] Apache DeltaSpike CDI ContainerControl API ......... SUCCESS [  5.340 s]
[INFO] Apache DeltaSpike CDI ContainerControl TCK ......... SUCCESS [  5.673 s]
[INFO] Apache DeltaSpike CDI OWB-ContainerControl ......... SUCCESS [  9.183 s]
[INFO] Apache DeltaSpike CDI Servlet-ContainerControl ..... SUCCESS [ 10.802 s]
[INFO] Apache DeltaSpike Modules .......................... SUCCESS [  2.878 s]
[INFO] Apache DeltaSpike Proxy-Module ..................... SUCCESS [  3.594 s]
[INFO] Apache DeltaSpike Proxy-Module API ................. SUCCESS [  6.989 s]
[INFO] Apache DeltaSpike Proxy-Module Impl ASM5 ........... SUCCESS [ 11.462 s]
[INFO] Apache DeltaSpike Security-Module .................. SUCCESS [  2.879 s]
[INFO] Apache DeltaSpike Security-Module API .............. SUCCESS [  6.707 s]
[INFO] Apache DeltaSpike Security-Module Impl ............. SUCCESS [ 13.314 s]
[INFO] Apache DeltaSpike JPA-Module ....................... SUCCESS [  2.908 s]
[INFO] Apache DeltaSpike JPA-Module API ................... SUCCESS [  7.588 s]
[INFO] Apache DeltaSpike JPA-Module Impl .................. SUCCESS [ 19.561 s]
[INFO] Apache DeltaSpike Servlet-Module ................... SUCCESS [  2.872 s]
[INFO] Apache DeltaSpike Servlet-Module API ............... SUCCESS [  5.114 s]
[INFO] Apache DeltaSpike Servlet-Module Impl .............. SUCCESS [  8.160 s]
[INFO] Apache DeltaSpike JSF-Module ....................... SUCCESS [  3.175 s]
[INFO] Apache DeltaSpike JSF-Module API ................... SUCCESS [  8.607 s]
[INFO] Apache DeltaSpike JSF-Module Impl .................. SUCCESS [ 26.860 s]
[INFO] Apache DeltaSpike JSF-Module Impl (EE6 only) ....... SUCCESS [  7.893 s]
[INFO] Apache DeltaSpike Partial-Bean-Module .............. SUCCESS [  2.829 s]
[INFO] Apache DeltaSpike Partial-Bean-Module API .......... SUCCESS [  6.667 s]
[INFO] Apache DeltaSpike Partial-Bean-Module Impl ......... SUCCESS [ 13.770 s]
[INFO] Apache DeltaSpike BeanValidation-Module ............ SUCCESS [  2.856 s]
[INFO] Apache DeltaSpike BeanValidation-Module API ........ SUCCESS [  4.113 s]
[INFO] Apache DeltaSpike BeanValidation-Module Impl ....... SUCCESS [ 10.928 s]
[INFO] Apache DeltaSpike Data-Module ...................... SUCCESS [  2.854 s]
[INFO] Apache DeltaSpike Data-Module API .................. SUCCESS [  8.998 s]
[INFO] Apache DeltaSpike Data-Module Impl ................. SUCCESS [ 16.438 s]
[INFO] Apache DeltaSpike Data-Module Tests with Java 8 .... FAILURE [  3.154 s]
[INFO] Apache DeltaSpike Scheduler-Module ................. SKIPPED
[INFO] Apache DeltaSpike Scheduler-Module API ............. SKIPPED
[INFO] Apache DeltaSpike Scheduler-Module Impl ............ SKIPPED
[INFO] Apache DeltaSpike Test-Control-Module .............. SKIPPED
[INFO] Apache DeltaSpike Test-Control-Module API .......... SKIPPED
[INFO] Apache DeltaSpike Test-Control-Module Impl ......... SKIPPED
[INFO] Apache DeltaSpike Examples ......................... SKIPPED
[INFO] Apache DeltaSpike Java-SE Examples ................. SKIPPED
[INFO] Apache DeltaSpike JSF Examples ..................... SKIPPED
[INFO] Apache DeltaSpike JSF Playground ................... SKIPPED
[INFO] Apache DeltaSpike Security Example CDI ............. SKIPPED
[INFO] Apache DeltaSpike Security Example PicketLink ...... SKIPPED
[INFO] Apache DeltaSpike Java-SE Scheduler Examples ....... SKIPPED
[INFO] Apache DeltaSpike JPA Examples ..................... SKIPPED
[INFO] Apache DeltaSpike Data Examples .................... SKIPPED
[INFO] Apache DeltaSpike Distribution ..................... SKIPPED
[INFO] Apache DeltaSpike Distribution Bill of Materials ... SKIPPED
[INFO] Apache DeltaSpike Full Distribution ................ SKIPPED
[INFO] ------------------------------------------------------------------------
[INFO] BUILD FAILURE
[INFO] ------------------------------------------------------------------------
[INFO] Total time: 08:14 min
[INFO] Finished at: 2017-09-09T14:05:23Z
[INFO] Final Memory: 84M/898M
[INFO] ------------------------------------------------------------------------
[WARNING] The requested profile "examples" could not be activated because it does not exist.
[ERROR] Failed to execute goal org.apache.maven.plugins:maven-compiler-plugin:2.3.2:testCompile
(default-testCompile) on project deltaspike-data-module-test-java8: Compilation failure
[ERROR] Failure executing javac,  but could not parse the error:
[ERROR] javac: invalid target release: 1.8
[ERROR] Usage: javac <options> <source files>
[ERROR] use -help for a list of possible options
[ERROR] -> [Help 1]
[ERROR] 
[ERROR] To see the full stack trace of the errors, re-run Maven with the -e switch.
[ERROR] Re-run Maven using the -X switch to enable full debug logging.
[ERROR] 
[ERROR] For more information about the errors and possible solutions, please read the following
articles:
[ERROR] [Help 1] http://cwiki.apache.org/confluence/display/MAVEN/MojoFailureException
[ERROR] 
[ERROR] After correcting the problems, you can resume the build with the command
[ERROR]   mvn <goals> -rf :deltaspike-data-module-test-java8
[JENKINS] Archiving <https://builds.apache.org/job/DeltaSpike%20Examples/ws/deltaspike/cdictrl/tck/pom.xml>
to org.apache.deltaspike.test/deltaspike-cdictrl-tck/1.8.1-SNAPSHOT/deltaspike-cdictrl-tck-1.8.1-SNAPSHOT.pom
[JENKINS] Archiving <https://builds.apache.org/job/DeltaSpike%20Examples/ws/deltaspike/cdictrl/tck/target/deltaspike-cdictrl-tck-1.8.1-SNAPSHOT.jar>
to org.apache.deltaspike.test/deltaspike-cdictrl-tck/1.8.1-SNAPSHOT/deltaspike-cdictrl-tck-1.8.1-SNAPSHOT.jar
[JENKINS] Archiving <https://builds.apache.org/job/DeltaSpike%20Examples/ws/deltaspike/cdictrl/tck/target/deltaspike-cdictrl-tck-1.8.1-SNAPSHOT-tests.jar>
to org.apache.deltaspike.test/deltaspike-cdictrl-tck/1.8.1-SNAPSHOT/deltaspike-cdictrl-tck-1.8.1-SNAPSHOT-tests.jar
[JENKINS] Archiving <https://builds.apache.org/job/DeltaSpike%20Examples/ws/deltaspike/cdictrl/tck/target/deltaspike-cdictrl-tck-1.8.1-SNAPSHOT-sources.jar>
to org.apache.deltaspike.test/deltaspike-cdictrl-tck/1.8.1-SNAPSHOT/deltaspike-cdictrl-tck-1.8.1-SNAPSHOT-sources.jar
[JENKINS] Archiving <https://builds.apache.org/job/DeltaSpike%20Examples/ws/deltaspike/dist/pom.xml>
to org.apache.deltaspike.distribution/distributions-project/1.8.1-SNAPSHOT/distributions-project-1.8.1-SNAPSHOT.pom
[JENKINS] Archiving <https://builds.apache.org/job/DeltaSpike%20Examples/ws/deltaspike/modules/jsf/impl/pom.xml>
to org.apache.deltaspike.modules/deltaspike-jsf-module-impl/1.8.1-SNAPSHOT/deltaspike-jsf-module-impl-1.8.1-SNAPSHOT.pom
[JENKINS] Archiving <https://builds.apache.org/job/DeltaSpike%20Examples/ws/deltaspike/modules/jsf/impl/target/deltaspike-jsf-module-impl-1.8.1-SNAPSHOT.jar>
to org.apache.deltaspike.modules/deltaspike-jsf-module-impl/1.8.1-SNAPSHOT/deltaspike-jsf-module-impl-1.8.1-SNAPSHOT.jar
[JENKINS] Archiving <https://builds.apache.org/job/DeltaSpike%20Examples/ws/deltaspike/modules/jsf/impl/target/deltaspike-jsf-module-impl-1.8.1-SNAPSHOT-tests.jar>
to org.apache.deltaspike.modules/deltaspike-jsf-module-impl/1.8.1-SNAPSHOT/deltaspike-jsf-module-impl-1.8.1-SNAPSHOT-tests.jar
[JENKINS] Archiving <https://builds.apache.org/job/DeltaSpike%20Examples/ws/deltaspike/modules/jsf/impl/target/deltaspike-jsf-module-impl-1.8.1-SNAPSHOT-sources.jar>
to org.apache.deltaspike.modules/deltaspike-jsf-module-impl/1.8.1-SNAPSHOT/deltaspike-jsf-module-impl-1.8.1-SNAPSHOT-sources.jar
[JENKINS] Archiving <https://builds.apache.org/job/DeltaSpike%20Examples/ws/deltaspike/modules/data/impl/pom.xml>
to org.apache.deltaspike.modules/deltaspike-data-module-impl/1.8.1-SNAPSHOT/deltaspike-data-module-impl-1.8.1-SNAPSHOT.pom
[JENKINS] Archiving <https://builds.apache.org/job/DeltaSpike%20Examples/ws/deltaspike/modules/data/impl/target/deltaspike-data-module-impl-1.8.1-SNAPSHOT.jar>
to org.apache.deltaspike.modules/deltaspike-data-module-impl/1.8.1-SNAPSHOT/deltaspike-data-module-impl-1.8.1-SNAPSHOT.jar
[JENKINS] Archiving <https://builds.apache.org/job/DeltaSpike%20Examples/ws/deltaspike/modules/data/impl/target/deltaspike-data-module-impl-1.8.1-SNAPSHOT-tests.jar>
to org.apache.deltaspike.modules/deltaspike-data-module-impl/1.8.1-SNAPSHOT/deltaspike-data-module-impl-1.8.1-SNAPSHOT-tests.jar
[JENKINS] Archiving <https://builds.apache.org/job/DeltaSpike%20Examples/ws/deltaspike/modules/data/impl/target/deltaspike-data-module-impl-1.8.1-SNAPSHOT-sources.jar>
to org.apache.deltaspike.modules/deltaspike-data-module-impl/1.8.1-SNAPSHOT/deltaspike-data-module-impl-1.8.1-SNAPSHOT-sources.jar
[JENKINS] Archiving <https://builds.apache.org/job/DeltaSpike%20Examples/ws/deltaspike/modules/jsf/pom.xml>
to org.apache.deltaspike.modules/jsf-module-project/1.8.1-SNAPSHOT/jsf-module-project-1.8.1-SNAPSHOT.pom
[JENKINS] Archiving <https://builds.apache.org/job/DeltaSpike%20Examples/ws/deltaspike/modules/jsf/target/jsf-module-project-1.8.1-SNAPSHOT-tests.jar>
to org.apache.deltaspike.modules/jsf-module-project/1.8.1-SNAPSHOT/jsf-module-project-1.8.1-SNAPSHOT-tests.jar
[JENKINS] Archiving <https://builds.apache.org/job/DeltaSpike%20Examples/ws/deltaspike/modules/bean-validation/impl/pom.xml>
to org.apache.deltaspike.modules/deltaspike-bean-validation-module-impl/1.8.1-SNAPSHOT/deltaspike-bean-validation-module-impl-1.8.1-SNAPSHOT.pom
[JENKINS] Archiving <https://builds.apache.org/job/DeltaSpike%20Examples/ws/deltaspike/modules/bean-validation/impl/target/deltaspike-bean-validation-module-impl-1.8.1-SNAPSHOT.jar>
to org.apache.deltaspike.modules/deltaspike-bean-validation-module-impl/1.8.1-SNAPSHOT/deltaspike-bean-validation-module-impl-1.8.1-SNAPSHOT.jar
[JENKINS] Archiving <https://builds.apache.org/job/DeltaSpike%20Examples/ws/deltaspike/modules/bean-validation/impl/target/deltaspike-bean-validation-module-impl-1.8.1-SNAPSHOT-tests.jar>
to org.apache.deltaspike.modules/deltaspike-bean-validation-module-impl/1.8.1-SNAPSHOT/deltaspike-bean-validation-module-impl-1.8.1-SNAPSHOT-tests.jar
[JENKINS] Archiving <https://builds.apache.org/job/DeltaSpike%20Examples/ws/deltaspike/modules/bean-validation/impl/target/deltaspike-bean-validation-module-impl-1.8.1-SNAPSHOT-sources.jar>
to org.apache.deltaspike.modules/deltaspike-bean-validation-module-impl/1.8.1-SNAPSHOT/deltaspike-bean-validation-module-impl-1.8.1-SNAPSHOT-sources.jar
[JENKINS] Archiving <https://builds.apache.org/job/DeltaSpike%20Examples/ws/deltaspike/examples/jpa-examples/pom.xml>
to org.apache.deltaspike.examples/deltaspike-jpa-examples/1.8.1-SNAPSHOT/deltaspike-jpa-examples-1.8.1-SNAPSHOT.pom
[JENKINS] Archiving <https://builds.apache.org/job/DeltaSpike%20Examples/ws/deltaspike/cdictrl/pom.xml>
to org.apache.deltaspike.cdictrl/cdictrl-project/1.8.1-SNAPSHOT/cdictrl-project-1.8.1-SNAPSHOT.pom
[JENKINS] Archiving <https://builds.apache.org/job/DeltaSpike%20Examples/ws/deltaspike/cdictrl/target/cdictrl-project-1.8.1-SNAPSHOT-tests.jar>
to org.apache.deltaspike.cdictrl/cdictrl-project/1.8.1-SNAPSHOT/cdictrl-project-1.8.1-SNAPSHOT-tests.jar
[JENKINS] Archiving <https://builds.apache.org/job/DeltaSpike%20Examples/ws/deltaspike/modules/partial-bean/api/pom.xml>
to org.apache.deltaspike.modules/deltaspike-partial-bean-module-api/1.8.1-SNAPSHOT/deltaspike-partial-bean-module-api-1.8.1-SNAPSHOT.pom
[JENKINS] Archiving <https://builds.apache.org/job/DeltaSpike%20Examples/ws/deltaspike/modules/partial-bean/api/target/deltaspike-partial-bean-module-api-1.8.1-SNAPSHOT.jar>
to org.apache.deltaspike.modules/deltaspike-partial-bean-module-api/1.8.1-SNAPSHOT/deltaspike-partial-bean-module-api-1.8.1-SNAPSHOT.jar
[JENKINS] Archiving <https://builds.apache.org/job/DeltaSpike%20Examples/ws/deltaspike/modules/partial-bean/api/target/deltaspike-partial-bean-module-api-1.8.1-SNAPSHOT-tests.jar>
to org.apache.deltaspike.modules/deltaspike-partial-bean-module-api/1.8.1-SNAPSHOT/deltaspike-partial-bean-module-api-1.8.1-SNAPSHOT-tests.jar
[JENKINS] Archiving <https://builds.apache.org/job/DeltaSpike%20Examples/ws/deltaspike/modules/partial-bean/api/target/deltaspike-partial-bean-module-api-1.8.1-SNAPSHOT-sources.jar>
to org.apache.deltaspike.modules/deltaspike-partial-bean-module-api/1.8.1-SNAPSHOT/deltaspike-partial-bean-module-api-1.8.1-SNAPSHOT-sources.jar
[JENKINS] Archiving <https://builds.apache.org/job/DeltaSpike%20Examples/ws/deltaspike/cdictrl/api/pom.xml>
to org.apache.deltaspike.cdictrl/deltaspike-cdictrl-api/1.8.1-SNAPSHOT/deltaspike-cdictrl-api-1.8.1-SNAPSHOT.pom
[JENKINS] Archiving <https://builds.apache.org/job/DeltaSpike%20Examples/ws/deltaspike/cdictrl/api/target/deltaspike-cdictrl-api-1.8.1-SNAPSHOT.jar>
to org.apache.deltaspike.cdictrl/deltaspike-cdictrl-api/1.8.1-SNAPSHOT/deltaspike-cdictrl-api-1.8.1-SNAPSHOT.jar
[JENKINS] Archiving <https://builds.apache.org/job/DeltaSpike%20Examples/ws/deltaspike/cdictrl/api/target/deltaspike-cdictrl-api-1.8.1-SNAPSHOT-tests.jar>
to org.apache.deltaspike.cdictrl/deltaspike-cdictrl-api/1.8.1-SNAPSHOT/deltaspike-cdictrl-api-1.8.1-SNAPSHOT-tests.jar
[JENKINS] Archiving <https://builds.apache.org/job/DeltaSpike%20Examples/ws/deltaspike/cdictrl/api/target/deltaspike-cdictrl-api-1.8.1-SNAPSHOT-sources.jar>
to org.apache.deltaspike.cdictrl/deltaspike-cdictrl-api/1.8.1-SNAPSHOT/deltaspike-cdictrl-api-1.8.1-SNAPSHOT-sources.jar
[JENKINS] Archiving <https://builds.apache.org/job/DeltaSpike%20Examples/ws/deltaspike/modules/security/api/pom.xml>
to org.apache.deltaspike.modules/deltaspike-security-module-api/1.8.1-SNAPSHOT/deltaspike-security-module-api-1.8.1-SNAPSHOT.pom
[JENKINS] Archiving <https://builds.apache.org/job/DeltaSpike%20Examples/ws/deltaspike/modules/security/api/target/deltaspike-security-module-api-1.8.1-SNAPSHOT.jar>
to org.apache.deltaspike.modules/deltaspike-security-module-api/1.8.1-SNAPSHOT/deltaspike-security-module-api-1.8.1-SNAPSHOT.jar
[JENKINS] Archiving <https://builds.apache.org/job/DeltaSpike%20Examples/ws/deltaspike/modules/security/api/target/deltaspike-security-module-api-1.8.1-SNAPSHOT-tests.jar>
to org.apache.deltaspike.modules/deltaspike-security-module-api/1.8.1-SNAPSHOT/deltaspike-security-module-api-1.8.1-SNAPSHOT-tests.jar
[JENKINS] Archiving <https://builds.apache.org/job/DeltaSpike%20Examples/ws/deltaspike/modules/security/api/target/deltaspike-security-module-api-1.8.1-SNAPSHOT-sources.jar>
to org.apache.deltaspike.modules/deltaspike-security-module-api/1.8.1-SNAPSHOT/deltaspike-security-module-api-1.8.1-SNAPSHOT-sources.jar
[JENKINS] Archiving <https://builds.apache.org/job/DeltaSpike%20Examples/ws/deltaspike/modules/data/api/pom.xml>
to org.apache.deltaspike.modules/deltaspike-data-module-api/1.8.1-SNAPSHOT/deltaspike-data-module-api-1.8.1-SNAPSHOT.pom
[JENKINS] Archiving <https://builds.apache.org/job/DeltaSpike%20Examples/ws/deltaspike/modules/data/api/target/deltaspike-data-module-api-1.8.1-SNAPSHOT.jar>
to org.apache.deltaspike.modules/deltaspike-data-module-api/1.8.1-SNAPSHOT/deltaspike-data-module-api-1.8.1-SNAPSHOT.jar
[JENKINS] Archiving <https://builds.apache.org/job/DeltaSpike%20Examples/ws/deltaspike/modules/data/api/target/deltaspike-data-module-api-1.8.1-SNAPSHOT-tests.jar>
to org.apache.deltaspike.modules/deltaspike-data-module-api/1.8.1-SNAPSHOT/deltaspike-data-module-api-1.8.1-SNAPSHOT-tests.jar
[JENKINS] Archiving <https://builds.apache.org/job/DeltaSpike%20Examples/ws/deltaspike/modules/data/api/target/deltaspike-data-module-api-1.8.1-SNAPSHOT-sources.jar>
to org.apache.deltaspike.modules/deltaspike-data-module-api/1.8.1-SNAPSHOT/deltaspike-data-module-api-1.8.1-SNAPSHOT-sources.jar
[JENKINS] Archiving <https://builds.apache.org/job/DeltaSpike%20Examples/ws/deltaspike/examples/jse-examples/pom.xml>
to org.apache.deltaspike.examples/deltaspike-jse-example/1.8.1-SNAPSHOT/deltaspike-jse-example-1.8.1-SNAPSHOT.pom
[JENKINS] Archiving <https://builds.apache.org/job/DeltaSpike%20Examples/ws/deltaspike/modules/data/test-java8/pom.xml>
to org.apache.deltaspike.modules/deltaspike-data-module-test-java8/1.8.1-SNAPSHOT/deltaspike-data-module-test-java8-1.8.1-SNAPSHOT.pom
[Fast Archiver] No prior successful build to compare, so performing full copy of artifacts
[JENKINS] Archiving <https://builds.apache.org/job/DeltaSpike%20Examples/ws/deltaspike/examples/pom.xml>
to org.apache.deltaspike.examples/examples-project/1.8.1-SNAPSHOT/examples-project-1.8.1-SNAPSHOT.pom
[JENKINS] Archiving <https://builds.apache.org/job/DeltaSpike%20Examples/ws/deltaspike/modules/jpa/pom.xml>
to org.apache.deltaspike.modules/jpa-module-project/1.8.1-SNAPSHOT/jpa-module-project-1.8.1-SNAPSHOT.pom
[JENKINS] Archiving <https://builds.apache.org/job/DeltaSpike%20Examples/ws/deltaspike/modules/jpa/target/jpa-module-project-1.8.1-SNAPSHOT-tests.jar>
to org.apache.deltaspike.modules/jpa-module-project/1.8.1-SNAPSHOT/jpa-module-project-1.8.1-SNAPSHOT-tests.jar
[JENKINS] Archiving <https://builds.apache.org/job/DeltaSpike%20Examples/ws/deltaspike/modules/servlet/pom.xml>
to org.apache.deltaspike.modules/servlet-module-project/1.8.1-SNAPSHOT/servlet-module-project-1.8.1-SNAPSHOT.pom
[JENKINS] Archiving <https://builds.apache.org/job/DeltaSpike%20Examples/ws/deltaspike/modules/servlet/target/servlet-module-project-1.8.1-SNAPSHOT-tests.jar>
to org.apache.deltaspike.modules/servlet-module-project/1.8.1-SNAPSHOT/servlet-module-project-1.8.1-SNAPSHOT-tests.jar
[JENKINS] Archiving <https://builds.apache.org/job/DeltaSpike%20Examples/ws/deltaspike/pom.xml>
to org.apache.deltaspike/deltaspike-project/1.8.1-SNAPSHOT/deltaspike-project-1.8.1-SNAPSHOT.pom
[JENKINS] Archiving <https://builds.apache.org/job/DeltaSpike%20Examples/ws/deltaspike/core/impl/pom.xml>
to org.apache.deltaspike.core/deltaspike-core-impl/1.8.1-SNAPSHOT/deltaspike-core-impl-1.8.1-SNAPSHOT.pom
[JENKINS] Archiving <https://builds.apache.org/job/DeltaSpike%20Examples/ws/deltaspike/core/impl/target/deltaspike-core-impl-1.8.1-SNAPSHOT.jar>
to org.apache.deltaspike.core/deltaspike-core-impl/1.8.1-SNAPSHOT/deltaspike-core-impl-1.8.1-SNAPSHOT.jar
[JENKINS] Archiving <https://builds.apache.org/job/DeltaSpike%20Examples/ws/deltaspike/core/impl/target/deltaspike-core-impl-1.8.1-SNAPSHOT-tests.jar>
to org.apache.deltaspike.core/deltaspike-core-impl/1.8.1-SNAPSHOT/deltaspike-core-impl-1.8.1-SNAPSHOT-tests.jar
[JENKINS] Archiving <https://builds.apache.org/job/DeltaSpike%20Examples/ws/deltaspike/core/impl/target/deltaspike-core-impl-1.8.1-SNAPSHOT-sources.jar>
to org.apache.deltaspike.core/deltaspike-core-impl/1.8.1-SNAPSHOT/deltaspike-core-impl-1.8.1-SNAPSHOT-sources.jar
[JENKINS] Archiving <https://builds.apache.org/job/DeltaSpike%20Examples/ws/deltaspike/modules/partial-bean/pom.xml>
to org.apache.deltaspike.modules/partial-bean-module-project/1.8.1-SNAPSHOT/partial-bean-module-project-1.8.1-SNAPSHOT.pom
[JENKINS] Archiving <https://builds.apache.org/job/DeltaSpike%20Examples/ws/deltaspike/modules/partial-bean/target/partial-bean-module-project-1.8.1-SNAPSHOT-tests.jar>
to org.apache.deltaspike.modules/partial-bean-module-project/1.8.1-SNAPSHOT/partial-bean-module-project-1.8.1-SNAPSHOT-tests.jar
[JENKINS] Archiving <https://builds.apache.org/job/DeltaSpike%20Examples/ws/deltaspike/cdictrl/impl-owb/pom.xml>
to org.apache.deltaspike.cdictrl/deltaspike-cdictrl-owb/1.8.1-SNAPSHOT/deltaspike-cdictrl-owb-1.8.1-SNAPSHOT.pom
[JENKINS] Archiving <https://builds.apache.org/job/DeltaSpike%20Examples/ws/deltaspike/cdictrl/impl-owb/target/deltaspike-cdictrl-owb-1.8.1-SNAPSHOT.jar>
to org.apache.deltaspike.cdictrl/deltaspike-cdictrl-owb/1.8.1-SNAPSHOT/deltaspike-cdictrl-owb-1.8.1-SNAPSHOT.jar
[JENKINS] Archiving <https://builds.apache.org/job/DeltaSpike%20Examples/ws/deltaspike/cdictrl/impl-owb/target/deltaspike-cdictrl-owb-1.8.1-SNAPSHOT-tests.jar>
to org.apache.deltaspike.cdictrl/deltaspike-cdictrl-owb/1.8.1-SNAPSHOT/deltaspike-cdictrl-owb-1.8.1-SNAPSHOT-tests.jar
[JENKINS] Archiving <https://builds.apache.org/job/DeltaSpike%20Examples/ws/deltaspike/cdictrl/impl-owb/target/deltaspike-cdictrl-owb-1.8.1-SNAPSHOT-sources.jar>
to org.apache.deltaspike.cdictrl/deltaspike-cdictrl-owb/1.8.1-SNAPSHOT/deltaspike-cdictrl-owb-1.8.1-SNAPSHOT-sources.jar
[JENKINS] Archiving <https://builds.apache.org/job/DeltaSpike%20Examples/ws/deltaspike/modules/proxy/pom.xml>
to org.apache.deltaspike.modules/proxy-module-project/1.8.1-SNAPSHOT/proxy-module-project-1.8.1-SNAPSHOT.pom
[JENKINS] Archiving <https://builds.apache.org/job/DeltaSpike%20Examples/ws/deltaspike/modules/proxy/target/proxy-module-project-1.8.1-SNAPSHOT-tests.jar>
to org.apache.deltaspike.modules/proxy-module-project/1.8.1-SNAPSHOT/proxy-module-project-1.8.1-SNAPSHOT-tests.jar
[JENKINS] Archiving <https://builds.apache.org/job/DeltaSpike%20Examples/ws/deltaspike/parent/pom.xml>
to org.apache.deltaspike/parent/1.8.1-SNAPSHOT/parent-1.8.1-SNAPSHOT.pom
[Fast Archiver] Compressed 41.32 KB of artifacts by 77.4% relative to #1708
[JENKINS] Archiving <https://builds.apache.org/job/DeltaSpike%20Examples/ws/deltaspike/modules/security/impl/pom.xml>
to org.apache.deltaspike.modules/deltaspike-security-module-impl/1.8.1-SNAPSHOT/deltaspike-security-module-impl-1.8.1-SNAPSHOT.pom
[JENKINS] Archiving <https://builds.apache.org/job/DeltaSpike%20Examples/ws/deltaspike/modules/security/impl/target/deltaspike-security-module-impl-1.8.1-SNAPSHOT.jar>
to org.apache.deltaspike.modules/deltaspike-security-module-impl/1.8.1-SNAPSHOT/deltaspike-security-module-impl-1.8.1-SNAPSHOT.jar
[JENKINS] Archiving <https://builds.apache.org/job/DeltaSpike%20Examples/ws/deltaspike/modules/security/impl/target/deltaspike-security-module-impl-1.8.1-SNAPSHOT-tests.jar>
to org.apache.deltaspike.modules/deltaspike-security-module-impl/1.8.1-SNAPSHOT/deltaspike-security-module-impl-1.8.1-SNAPSHOT-tests.jar
[JENKINS] Archiving <https://builds.apache.org/job/DeltaSpike%20Examples/ws/deltaspike/modules/security/impl/target/deltaspike-security-module-impl-1.8.1-SNAPSHOT-sources.jar>
to org.apache.deltaspike.modules/deltaspike-security-module-impl/1.8.1-SNAPSHOT/deltaspike-security-module-impl-1.8.1-SNAPSHOT-sources.jar
[JENKINS] Archiving <https://builds.apache.org/job/DeltaSpike%20Examples/ws/deltaspike/modules/jpa/api/pom.xml>
to org.apache.deltaspike.modules/deltaspike-jpa-module-api/1.8.1-SNAPSHOT/deltaspike-jpa-module-api-1.8.1-SNAPSHOT.pom
[JENKINS] Archiving <https://builds.apache.org/job/DeltaSpike%20Examples/ws/deltaspike/modules/jpa/api/target/deltaspike-jpa-module-api-1.8.1-SNAPSHOT.jar>
to org.apache.deltaspike.modules/deltaspike-jpa-module-api/1.8.1-SNAPSHOT/deltaspike-jpa-module-api-1.8.1-SNAPSHOT.jar
[JENKINS] Archiving <https://builds.apache.org/job/DeltaSpike%20Examples/ws/deltaspike/modules/jpa/api/target/deltaspike-jpa-module-api-1.8.1-SNAPSHOT-tests.jar>
to org.apache.deltaspike.modules/deltaspike-jpa-module-api/1.8.1-SNAPSHOT/deltaspike-jpa-module-api-1.8.1-SNAPSHOT-tests.jar
[JENKINS] Archiving <https://builds.apache.org/job/DeltaSpike%20Examples/ws/deltaspike/modules/jpa/api/target/deltaspike-jpa-module-api-1.8.1-SNAPSHOT-sources.jar>
to org.apache.deltaspike.modules/deltaspike-jpa-module-api/1.8.1-SNAPSHOT/deltaspike-jpa-module-api-1.8.1-SNAPSHOT-sources.jar
[JENKINS] Archiving <https://builds.apache.org/job/DeltaSpike%20Examples/ws/deltaspike/modules/proxy/impl-asm5/pom.xml>
to org.apache.deltaspike.modules/deltaspike-proxy-module-impl-asm5/1.8.1-SNAPSHOT/deltaspike-proxy-module-impl-asm5-1.8.1-SNAPSHOT.pom
[JENKINS] Archiving <https://builds.apache.org/job/DeltaSpike%20Examples/ws/deltaspike/modules/proxy/impl-asm5/target/deltaspike-proxy-module-impl-asm5-1.8.1-SNAPSHOT.jar>
to org.apache.deltaspike.modules/deltaspike-proxy-module-impl-asm5/1.8.1-SNAPSHOT/deltaspike-proxy-module-impl-asm5-1.8.1-SNAPSHOT.jar
[JENKINS] Archiving <https://builds.apache.org/job/DeltaSpike%20Examples/ws/deltaspike/modules/proxy/impl-asm5/target/deltaspike-proxy-module-impl-asm5-1.8.1-SNAPSHOT-tests.jar>
to org.apache.deltaspike.modules/deltaspike-proxy-module-impl-asm5/1.8.1-SNAPSHOT/deltaspike-proxy-module-impl-asm5-1.8.1-SNAPSHOT-tests.jar
[JENKINS] Archiving <https://builds.apache.org/job/DeltaSpike%20Examples/ws/deltaspike/modules/proxy/impl-asm5/target/deltaspike-proxy-module-impl-asm5-1.8.1-SNAPSHOT-sources.jar>
to org.apache.deltaspike.modules/deltaspike-proxy-module-impl-asm5/1.8.1-SNAPSHOT/deltaspike-proxy-module-impl-asm5-1.8.1-SNAPSHOT-sources.jar
[JENKINS] Archiving <https://builds.apache.org/job/DeltaSpike%20Examples/ws/deltaspike/dist/bom/pom.xml>
to org.apache.deltaspike.distribution/distributions-bom/1.8.1-SNAPSHOT/distributions-bom-1.8.1-SNAPSHOT.pom
[JENKINS] Archiving <https://builds.apache.org/job/DeltaSpike%20Examples/ws/deltaspike/modules/bean-validation/pom.xml>
to org.apache.deltaspike.modules/bean-validation-module-project/1.8.1-SNAPSHOT/bean-validation-module-project-1.8.1-SNAPSHOT.pom
[JENKINS] Archiving <https://builds.apache.org/job/DeltaSpike%20Examples/ws/deltaspike/modules/bean-validation/target/bean-validation-module-project-1.8.1-SNAPSHOT-tests.jar>
to org.apache.deltaspike.modules/bean-validation-module-project/1.8.1-SNAPSHOT/bean-validation-module-project-1.8.1-SNAPSHOT-tests.jar
[JENKINS] Archiving <https://builds.apache.org/job/DeltaSpike%20Examples/ws/deltaspike/parent/code/pom.xml>
to org.apache.deltaspike/parent-code/1.8.1-SNAPSHOT/parent-code-1.8.1-SNAPSHOT.pom
[JENKINS] Archiving <https://builds.apache.org/job/DeltaSpike%20Examples/ws/deltaspike/parent/code/target/parent-code-1.8.1-SNAPSHOT-tests.jar>
to org.apache.deltaspike/parent-code/1.8.1-SNAPSHOT/parent-code-1.8.1-SNAPSHOT-tests.jar
[Fast Archiver] Compressed 102.91 KB of artifacts by 62.2% relative to #1708
[JENKINS] Archiving <https://builds.apache.org/job/DeltaSpike%20Examples/ws/deltaspike/modules/jpa/impl/pom.xml>
to org.apache.deltaspike.modules/deltaspike-jpa-module-impl/1.8.1-SNAPSHOT/deltaspike-jpa-module-impl-1.8.1-SNAPSHOT.pom
[JENKINS] Archiving <https://builds.apache.org/job/DeltaSpike%20Examples/ws/deltaspike/modules/jpa/impl/target/deltaspike-jpa-module-impl-1.8.1-SNAPSHOT.jar>
to org.apache.deltaspike.modules/deltaspike-jpa-module-impl/1.8.1-SNAPSHOT/deltaspike-jpa-module-impl-1.8.1-SNAPSHOT.jar
[JENKINS] Archiving <https://builds.apache.org/job/DeltaSpike%20Examples/ws/deltaspike/modules/jpa/impl/target/deltaspike-jpa-module-impl-1.8.1-SNAPSHOT-tests.jar>
to org.apache.deltaspike.modules/deltaspike-jpa-module-impl/1.8.1-SNAPSHOT/deltaspike-jpa-module-impl-1.8.1-SNAPSHOT-tests.jar
[JENKINS] Archiving <https://builds.apache.org/job/DeltaSpike%20Examples/ws/deltaspike/modules/jpa/impl/target/deltaspike-jpa-module-impl-1.8.1-SNAPSHOT-sources.jar>
to org.apache.deltaspike.modules/deltaspike-jpa-module-impl/1.8.1-SNAPSHOT/deltaspike-jpa-module-impl-1.8.1-SNAPSHOT-sources.jar
[JENKINS] Archiving <https://builds.apache.org/job/DeltaSpike%20Examples/ws/deltaspike/modules/partial-bean/impl/pom.xml>
to org.apache.deltaspike.modules/deltaspike-partial-bean-module-impl/1.8.1-SNAPSHOT/deltaspike-partial-bean-module-impl-1.8.1-SNAPSHOT.pom
[JENKINS] Archiving <https://builds.apache.org/job/DeltaSpike%20Examples/ws/deltaspike/modules/partial-bean/impl/target/deltaspike-partial-bean-module-impl-1.8.1-SNAPSHOT.jar>
to org.apache.deltaspike.modules/deltaspike-partial-bean-module-impl/1.8.1-SNAPSHOT/deltaspike-partial-bean-module-impl-1.8.1-SNAPSHOT.jar
[JENKINS] Archiving <https://builds.apache.org/job/DeltaSpike%20Examples/ws/deltaspike/modules/partial-bean/impl/target/deltaspike-partial-bean-module-impl-1.8.1-SNAPSHOT-tests.jar>
to org.apache.deltaspike.modules/deltaspike-partial-bean-module-impl/1.8.1-SNAPSHOT/deltaspike-partial-bean-module-impl-1.8.1-SNAPSHOT-tests.jar
[JENKINS] Archiving <https://builds.apache.org/job/DeltaSpike%20Examples/ws/deltaspike/modules/partial-bean/impl/target/deltaspike-partial-bean-module-impl-1.8.1-SNAPSHOT-sources.jar>
to org.apache.deltaspike.modules/deltaspike-partial-bean-module-impl/1.8.1-SNAPSHOT/deltaspike-partial-bean-module-impl-1.8.1-SNAPSHOT-sources.jar
[JENKINS] Archiving <https://builds.apache.org/job/DeltaSpike%20Examples/ws/deltaspike/cdictrl/servlet/pom.xml>
to org.apache.deltaspike.cdictrl/deltaspike-cdictrl-servlet/1.8.1-SNAPSHOT/deltaspike-cdictrl-servlet-1.8.1-SNAPSHOT.pom
[JENKINS] Archiving <https://builds.apache.org/job/DeltaSpike%20Examples/ws/deltaspike/cdictrl/servlet/target/deltaspike-cdictrl-servlet-1.8.1-SNAPSHOT.jar>
to org.apache.deltaspike.cdictrl/deltaspike-cdictrl-servlet/1.8.1-SNAPSHOT/deltaspike-cdictrl-servlet-1.8.1-SNAPSHOT.jar
[JENKINS] Archiving <https://builds.apache.org/job/DeltaSpike%20Examples/ws/deltaspike/cdictrl/servlet/target/deltaspike-cdictrl-servlet-1.8.1-SNAPSHOT-tests.jar>
to org.apache.deltaspike.cdictrl/deltaspike-cdictrl-servlet/1.8.1-SNAPSHOT/deltaspike-cdictrl-servlet-1.8.1-SNAPSHOT-tests.jar
[JENKINS] Archiving <https://builds.apache.org/job/DeltaSpike%20Examples/ws/deltaspike/cdictrl/servlet/target/deltaspike-cdictrl-servlet-1.8.1-SNAPSHOT-sources.jar>
to org.apache.deltaspike.cdictrl/deltaspike-cdictrl-servlet/1.8.1-SNAPSHOT/deltaspike-cdictrl-servlet-1.8.1-SNAPSHOT-sources.jar
[JENKINS] Archiving <https://builds.apache.org/job/DeltaSpike%20Examples/ws/deltaspike/modules/scheduler/api/pom.xml>
to org.apache.deltaspike.modules/deltaspike-scheduler-module-api/1.8.1-SNAPSHOT/deltaspike-scheduler-module-api-1.8.1-SNAPSHOT.pom
[JENKINS] Archiving <https://builds.apache.org/job/DeltaSpike%20Examples/ws/deltaspike/modules/test-control/pom.xml>
to org.apache.deltaspike.modules/test-control-module-project/1.8.1-SNAPSHOT/test-control-module-project-1.8.1-SNAPSHOT.pom
[JENKINS] Archiving <https://builds.apache.org/job/DeltaSpike%20Examples/ws/deltaspike/modules/scheduler/impl/pom.xml>
to org.apache.deltaspike.modules/deltaspike-scheduler-module-impl/1.8.1-SNAPSHOT/deltaspike-scheduler-module-impl-1.8.1-SNAPSHOT.pom
[JENKINS] Archiving <https://builds.apache.org/job/DeltaSpike%20Examples/ws/deltaspike/examples/jsf-playground/pom.xml>
to org.apache.deltaspike.examples/deltaspike-jsf-playground/1.8.1-SNAPSHOT/deltaspike-jsf-playground-1.8.1-SNAPSHOT.pom
[JENKINS] Archiving <https://builds.apache.org/job/DeltaSpike%20Examples/ws/deltaspike/modules/test-control/impl/pom.xml>
to org.apache.deltaspike.modules/deltaspike-test-control-module-impl/1.8.1-SNAPSHOT/deltaspike-test-control-module-impl-1.8.1-SNAPSHOT.pom
[JENKINS] Archiving <https://builds.apache.org/job/DeltaSpike%20Examples/ws/deltaspike/checkstyle-rules/pom.xml>
to org.apache.deltaspike/checkstyle-rules/1.8.1-SNAPSHOT/checkstyle-rules-1.8.1-SNAPSHOT.pom
[JENKINS] Archiving <https://builds.apache.org/job/DeltaSpike%20Examples/ws/deltaspike/checkstyle-rules/target/checkstyle-rules-1.8.1-SNAPSHOT.jar>
to org.apache.deltaspike/checkstyle-rules/1.8.1-SNAPSHOT/checkstyle-rules-1.8.1-SNAPSHOT.jar
[JENKINS] Archiving <https://builds.apache.org/job/DeltaSpike%20Examples/ws/deltaspike/modules/proxy/api/pom.xml>
to org.apache.deltaspike.modules/deltaspike-proxy-module-api/1.8.1-SNAPSHOT/deltaspike-proxy-module-api-1.8.1-SNAPSHOT.pom
[JENKINS] Archiving <https://builds.apache.org/job/DeltaSpike%20Examples/ws/deltaspike/modules/proxy/api/target/deltaspike-proxy-module-api-1.8.1-SNAPSHOT.jar>
to org.apache.deltaspike.modules/deltaspike-proxy-module-api/1.8.1-SNAPSHOT/deltaspike-proxy-module-api-1.8.1-SNAPSHOT.jar
[JENKINS] Archiving <https://builds.apache.org/job/DeltaSpike%20Examples/ws/deltaspike/modules/proxy/api/target/deltaspike-proxy-module-api-1.8.1-SNAPSHOT-tests.jar>
to org.apache.deltaspike.modules/deltaspike-proxy-module-api/1.8.1-SNAPSHOT/deltaspike-proxy-module-api-1.8.1-SNAPSHOT-tests.jar
[JENKINS] Archiving <https://builds.apache.org/job/DeltaSpike%20Examples/ws/deltaspike/modules/proxy/api/target/deltaspike-proxy-module-api-1.8.1-SNAPSHOT-sources.jar>
to org.apache.deltaspike.modules/deltaspike-proxy-module-api/1.8.1-SNAPSHOT/deltaspike-proxy-module-api-1.8.1-SNAPSHOT-sources.jar
[JENKINS] Archiving <https://builds.apache.org/job/DeltaSpike%20Examples/ws/deltaspike/modules/servlet/api/pom.xml>
to org.apache.deltaspike.modules/deltaspike-servlet-module-api/1.8.1-SNAPSHOT/deltaspike-servlet-module-api-1.8.1-SNAPSHOT.pom
[JENKINS] Archiving <https://builds.apache.org/job/DeltaSpike%20Examples/ws/deltaspike/modules/servlet/api/target/deltaspike-servlet-module-api-1.8.1-SNAPSHOT.jar>
to org.apache.deltaspike.modules/deltaspike-servlet-module-api/1.8.1-SNAPSHOT/deltaspike-servlet-module-api-1.8.1-SNAPSHOT.jar
[JENKINS] Archiving <https://builds.apache.org/job/DeltaSpike%20Examples/ws/deltaspike/modules/servlet/api/target/deltaspike-servlet-module-api-1.8.1-SNAPSHOT-tests.jar>
to org.apache.deltaspike.modules/deltaspike-servlet-module-api/1.8.1-SNAPSHOT/deltaspike-servlet-module-api-1.8.1-SNAPSHOT-tests.jar
[JENKINS] Archiving <https://builds.apache.org/job/DeltaSpike%20Examples/ws/deltaspike/modules/servlet/api/target/deltaspike-servlet-module-api-1.8.1-SNAPSHOT-sources.jar>
to org.apache.deltaspike.modules/deltaspike-servlet-module-api/1.8.1-SNAPSHOT/deltaspike-servlet-module-api-1.8.1-SNAPSHOT-sources.jar
[JENKINS] Archiving <https://builds.apache.org/job/DeltaSpike%20Examples/ws/deltaspike/examples/data-examples/pom.xml>
to org.apache.deltaspike.examples/deltaspike-data-examples/1.8.1-SNAPSHOT/deltaspike-data-examples-1.8.1-SNAPSHOT.pom
[JENKINS] Archiving <https://builds.apache.org/job/DeltaSpike%20Examples/ws/deltaspike/core/api/pom.xml>
to org.apache.deltaspike.core/deltaspike-core-api/1.8.1-SNAPSHOT/deltaspike-core-api-1.8.1-SNAPSHOT.pom
[JENKINS] Archiving <https://builds.apache.org/job/DeltaSpike%20Examples/ws/deltaspike/core/api/target/deltaspike-core-api-1.8.1-SNAPSHOT.jar>
to org.apache.deltaspike.core/deltaspike-core-api/1.8.1-SNAPSHOT/deltaspike-core-api-1.8.1-SNAPSHOT.jar
[JENKINS] Archiving <https://builds.apache.org/job/DeltaSpike%20Examples/ws/deltaspike/core/api/target/deltaspike-core-api-1.8.1-SNAPSHOT-tests.jar>
to org.apache.deltaspike.core/deltaspike-core-api/1.8.1-SNAPSHOT/deltaspike-core-api-1.8.1-SNAPSHOT-tests.jar
[JENKINS] Archiving <https://builds.apache.org/job/DeltaSpike%20Examples/ws/deltaspike/core/api/target/deltaspike-core-api-1.8.1-SNAPSHOT-sources.jar>
to org.apache.deltaspike.core/deltaspike-core-api/1.8.1-SNAPSHOT/deltaspike-core-api-1.8.1-SNAPSHOT-sources.jar
[JENKINS] Archiving <https://builds.apache.org/job/DeltaSpike%20Examples/ws/deltaspike/examples/security-requested-page-after-login-picketlink/pom.xml>
to org.apache.deltaspike.examples/deltaspike-security-requested-page-after-login-picketlink/1.8.1-SNAPSHOT/deltaspike-security-requested-page-after-login-picketlink-1.8.1-SNAPSHOT.pom
[JENKINS] Archiving <https://builds.apache.org/job/DeltaSpike%20Examples/ws/deltaspike/modules/bean-validation/api/pom.xml>
to org.apache.deltaspike.modules/deltaspike-bean-validation-module-api/1.8.1-SNAPSHOT/deltaspike-bean-validation-module-api-1.8.1-SNAPSHOT.pom
[JENKINS] Archiving <https://builds.apache.org/job/DeltaSpike%20Examples/ws/deltaspike/modules/bean-validation/api/target/deltaspike-bean-validation-module-api-1.8.1-SNAPSHOT.jar>
to org.apache.deltaspike.modules/deltaspike-bean-validation-module-api/1.8.1-SNAPSHOT/deltaspike-bean-validation-module-api-1.8.1-SNAPSHOT.jar
[JENKINS] Archiving <https://builds.apache.org/job/DeltaSpike%20Examples/ws/deltaspike/modules/bean-validation/api/target/deltaspike-bean-validation-module-api-1.8.1-SNAPSHOT-tests.jar>
to org.apache.deltaspike.modules/deltaspike-bean-validation-module-api/1.8.1-SNAPSHOT/deltaspike-bean-validation-module-api-1.8.1-SNAPSHOT-tests.jar
[JENKINS] Archiving <https://builds.apache.org/job/DeltaSpike%20Examples/ws/deltaspike/modules/bean-validation/api/target/deltaspike-bean-validation-module-api-1.8.1-SNAPSHOT-sources.jar>
to org.apache.deltaspike.modules/deltaspike-bean-validation-module-api/1.8.1-SNAPSHOT/deltaspike-bean-validation-module-api-1.8.1-SNAPSHOT-sources.jar
[JENKINS] Archiving <https://builds.apache.org/job/DeltaSpike%20Examples/ws/deltaspike/examples/scheduler-playground/pom.xml>
to org.apache.deltaspike.examples/deltaspike-scheduler-example/1.8.1-SNAPSHOT/deltaspike-scheduler-example-1.8.1-SNAPSHOT.pom
[JENKINS] Archiving <https://builds.apache.org/job/DeltaSpike%20Examples/ws/deltaspike/modules/pom.xml>
to org.apache.deltaspike.modules/modules-project/1.8.1-SNAPSHOT/modules-project-1.8.1-SNAPSHOT.pom
[JENKINS] Archiving <https://builds.apache.org/job/DeltaSpike%20Examples/ws/deltaspike/modules/target/modules-project-1.8.1-SNAPSHOT-tests.jar>
to org.apache.deltaspike.modules/modules-project/1.8.1-SNAPSHOT/modules-project-1.8.1-SNAPSHOT-tests.jar
[JENKINS] Archiving <https://builds.apache.org/job/DeltaSpike%20Examples/ws/deltaspike/modules/scheduler/pom.xml>
to org.apache.deltaspike.modules/scheduler-module-project/1.8.1-SNAPSHOT/scheduler-module-project-1.8.1-SNAPSHOT.pom
[JENKINS] Archiving <https://builds.apache.org/job/DeltaSpike%20Examples/ws/deltaspike/test-utils/pom.xml>
to org.apache.deltaspike.test/test-utils/1.8.1-SNAPSHOT/test-utils-1.8.1-SNAPSHOT.pom
[JENKINS] Archiving <https://builds.apache.org/job/DeltaSpike%20Examples/ws/deltaspike/test-utils/target/test-utils-1.8.1-SNAPSHOT.jar>
to org.apache.deltaspike.test/test-utils/1.8.1-SNAPSHOT/test-utils-1.8.1-SNAPSHOT.jar
[JENKINS] Archiving <https://builds.apache.org/job/DeltaSpike%20Examples/ws/deltaspike/test-utils/target/test-utils-1.8.1-SNAPSHOT-sources.jar>
to org.apache.deltaspike.test/test-utils/1.8.1-SNAPSHOT/test-utils-1.8.1-SNAPSHOT-sources.jar
[JENKINS] Archiving <https://builds.apache.org/job/DeltaSpike%20Examples/ws/deltaspike/modules/security/pom.xml>
to org.apache.deltaspike.modules/security-module-project/1.8.1-SNAPSHOT/security-module-project-1.8.1-SNAPSHOT.pom
[JENKINS] Archiving <https://builds.apache.org/job/DeltaSpike%20Examples/ws/deltaspike/modules/security/target/security-module-project-1.8.1-SNAPSHOT-tests.jar>
to org.apache.deltaspike.modules/security-module-project/1.8.1-SNAPSHOT/security-module-project-1.8.1-SNAPSHOT-tests.jar
[JENKINS] Archiving <https://builds.apache.org/job/DeltaSpike%20Examples/ws/deltaspike/modules/jsf/api/pom.xml>
to org.apache.deltaspike.modules/deltaspike-jsf-module-api/1.8.1-SNAPSHOT/deltaspike-jsf-module-api-1.8.1-SNAPSHOT.pom
[JENKINS] Archiving <https://builds.apache.org/job/DeltaSpike%20Examples/ws/deltaspike/modules/jsf/api/target/deltaspike-jsf-module-api-1.8.1-SNAPSHOT.jar>
to org.apache.deltaspike.modules/deltaspike-jsf-module-api/1.8.1-SNAPSHOT/deltaspike-jsf-module-api-1.8.1-SNAPSHOT.jar
[JENKINS] Archiving <https://builds.apache.org/job/DeltaSpike%20Examples/ws/deltaspike/modules/jsf/api/target/deltaspike-jsf-module-api-1.8.1-SNAPSHOT-tests.jar>
to org.apache.deltaspike.modules/deltaspike-jsf-module-api/1.8.1-SNAPSHOT/deltaspike-jsf-module-api-1.8.1-SNAPSHOT-tests.jar
[JENKINS] Archiving <https://builds.apache.org/job/DeltaSpike%20Examples/ws/deltaspike/modules/jsf/api/target/deltaspike-jsf-module-api-1.8.1-SNAPSHOT-sources.jar>
to org.apache.deltaspike.modules/deltaspike-jsf-module-api/1.8.1-SNAPSHOT/deltaspike-jsf-module-api-1.8.1-SNAPSHOT-sources.jar
[JENKINS] Archiving <https://builds.apache.org/job/DeltaSpike%20Examples/ws/deltaspike/modules/data/pom.xml>
to org.apache.deltaspike.modules/data-module-project/1.8.1-SNAPSHOT/data-module-project-1.8.1-SNAPSHOT.pom
[JENKINS] Archiving <https://builds.apache.org/job/DeltaSpike%20Examples/ws/deltaspike/modules/data/target/data-module-project-1.8.1-SNAPSHOT-tests.jar>
to org.apache.deltaspike.modules/data-module-project/1.8.1-SNAPSHOT/data-module-project-1.8.1-SNAPSHOT-tests.jar
[JENKINS] Archiving <https://builds.apache.org/job/DeltaSpike%20Examples/ws/deltaspike/modules/servlet/impl/pom.xml>
to org.apache.deltaspike.modules/deltaspike-servlet-module-impl/1.8.1-SNAPSHOT/deltaspike-servlet-module-impl-1.8.1-SNAPSHOT.pom
[JENKINS] Archiving <https://builds.apache.org/job/DeltaSpike%20Examples/ws/deltaspike/modules/servlet/impl/target/deltaspike-servlet-module-impl-1.8.1-SNAPSHOT.jar>
to org.apache.deltaspike.modules/deltaspike-servlet-module-impl/1.8.1-SNAPSHOT/deltaspike-servlet-module-impl-1.8.1-SNAPSHOT.jar
[JENKINS] Archiving <https://builds.apache.org/job/DeltaSpike%20Examples/ws/deltaspike/modules/servlet/impl/target/deltaspike-servlet-module-impl-1.8.1-SNAPSHOT-tests.jar>
to org.apache.deltaspike.modules/deltaspike-servlet-module-impl/1.8.1-SNAPSHOT/deltaspike-servlet-module-impl-1.8.1-SNAPSHOT-tests.jar
[JENKINS] Archiving <https://builds.apache.org/job/DeltaSpike%20Examples/ws/deltaspike/modules/servlet/impl/target/deltaspike-servlet-module-impl-1.8.1-SNAPSHOT-sources.jar>
to org.apache.deltaspike.modules/deltaspike-servlet-module-impl/1.8.1-SNAPSHOT/deltaspike-servlet-module-impl-1.8.1-SNAPSHOT-sources.jar
[JENKINS] Archiving <https://builds.apache.org/job/DeltaSpike%20Examples/ws/deltaspike/modules/test-control/api/pom.xml>
to org.apache.deltaspike.modules/deltaspike-test-control-module-api/1.8.1-SNAPSHOT/deltaspike-test-control-module-api-1.8.1-SNAPSHOT.pom
[JENKINS] Archiving <https://builds.apache.org/job/DeltaSpike%20Examples/ws/deltaspike/examples/jsf-examples/pom.xml>
to org.apache.deltaspike.examples/deltaspike-jsf-example/1.8.1-SNAPSHOT/deltaspike-jsf-example-1.8.1-SNAPSHOT.pom
[JENKINS] Archiving <https://builds.apache.org/job/DeltaSpike%20Examples/ws/deltaspike/modules/jsf/impl-ee6/pom.xml>
to org.apache.deltaspike.modules/deltaspike-jsf-module-impl-ee6/1.8.1-SNAPSHOT/deltaspike-jsf-module-impl-ee6-1.8.1-SNAPSHOT.pom
[JENKINS] Archiving <https://builds.apache.org/job/DeltaSpike%20Examples/ws/deltaspike/modules/jsf/impl-ee6/target/deltaspike-jsf-module-impl-ee6-1.8.1-SNAPSHOT.jar>
to org.apache.deltaspike.modules/deltaspike-jsf-module-impl-ee6/1.8.1-SNAPSHOT/deltaspike-jsf-module-impl-ee6-1.8.1-SNAPSHOT.jar
[JENKINS] Archiving <https://builds.apache.org/job/DeltaSpike%20Examples/ws/deltaspike/modules/jsf/impl-ee6/target/deltaspike-jsf-module-impl-ee6-1.8.1-SNAPSHOT-tests.jar>
to org.apache.deltaspike.modules/deltaspike-jsf-module-impl-ee6/1.8.1-SNAPSHOT/deltaspike-jsf-module-impl-ee6-1.8.1-SNAPSHOT-tests.jar
[JENKINS] Archiving <https://builds.apache.org/job/DeltaSpike%20Examples/ws/deltaspike/modules/jsf/impl-ee6/target/deltaspike-jsf-module-impl-ee6-1.8.1-SNAPSHOT-sources.jar>
to org.apache.deltaspike.modules/deltaspike-jsf-module-impl-ee6/1.8.1-SNAPSHOT/deltaspike-jsf-module-impl-ee6-1.8.1-SNAPSHOT-sources.jar
[JENKINS] Archiving <https://builds.apache.org/job/DeltaSpike%20Examples/ws/deltaspike/examples/security-requested-page-after-login-cdi/pom.xml>
to org.apache.deltaspike.examples/deltaspike-security-requested-page-after-login-cdi/1.8.1-SNAPSHOT/deltaspike-security-requested-page-after-login-cdi-1.8.1-SNAPSHOT.pom
[JENKINS] Archiving <https://builds.apache.org/job/DeltaSpike%20Examples/ws/deltaspike/core/pom.xml>
to org.apache.deltaspike.core/core-project/1.8.1-SNAPSHOT/core-project-1.8.1-SNAPSHOT.pom
[JENKINS] Archiving <https://builds.apache.org/job/DeltaSpike%20Examples/ws/deltaspike/core/target/core-project-1.8.1-SNAPSHOT-tests.jar>
to org.apache.deltaspike.core/core-project/1.8.1-SNAPSHOT/core-project-1.8.1-SNAPSHOT-tests.jar
[JENKINS] Archiving <https://builds.apache.org/job/DeltaSpike%20Examples/ws/deltaspike/dist/full/pom.xml>
to org.apache.deltaspike.distribution/distribution-full/1.8.1-SNAPSHOT/distribution-full-1.8.1-SNAPSHOT.pom
Sending e-mails to: commits@deltaspike.apache.org
channel stopped

Mime
View raw message