deltaspike-commits mailing list archives

Site index · List index
Message view « Date » · « Thread »
Top « Date » · « Thread »
From Apache Jenkins Server <jenk...@builds.apache.org>
Subject Build failed in Jenkins: DeltaSpike OWB 2.0.0 #13
Date Thu, 06 Jul 2017 15:55:33 GMT
See <https://builds.apache.org/job/DeltaSpike%20OWB%202.0.0/13/display/redirect>

------------------------------------------
[...truncated 26.77 KB...]
[INFO] 
[INFO] --- maven-checkstyle-plugin:2.9.1:check (verify-style) @ test-utils ---
[INFO] Starting audit...
Audit done.

[INFO] 
[INFO] --- maven-install-plugin:2.5.2:install (default-install) @ test-utils ---
[INFO] Installing <https://builds.apache.org/job/DeltaSpike%20OWB%202.0.0/ws/deltaspike/test-utils/target/test-utils-1.8.1-SNAPSHOT.jar>
to /home/jenkins/jenkins-slave/maven-repositories/0/org/apache/deltaspike/test/test-utils/1.8.1-SNAPSHOT/test-utils-1.8.1-SNAPSHOT.jar
[INFO] Installing <https://builds.apache.org/job/DeltaSpike%20OWB%202.0.0/ws/deltaspike/test-utils/pom.xml>
to /home/jenkins/jenkins-slave/maven-repositories/0/org/apache/deltaspike/test/test-utils/1.8.1-SNAPSHOT/test-utils-1.8.1-SNAPSHOT.pom
[INFO] Installing <https://builds.apache.org/job/DeltaSpike%20OWB%202.0.0/ws/deltaspike/test-utils/target/test-utils-1.8.1-SNAPSHOT-sources.jar>
to /home/jenkins/jenkins-slave/maven-repositories/0/org/apache/deltaspike/test/test-utils/1.8.1-SNAPSHOT/test-utils-1.8.1-SNAPSHOT-sources.jar
[INFO] 
[INFO] ------------------------------------------------------------------------
[INFO] Building Apache DeltaSpike Code Parent 1.8.1-SNAPSHOT
[INFO] ------------------------------------------------------------------------
[INFO] Downloading: https://repository.apache.org/content/repositories/releases/org/apache/geronimo/specs/geronimo-annotation_1.3_spec/1.0-SNAPSHOT/maven-metadata.xml
[INFO] Downloading: http://repository.apache.org/snapshots/org/apache/geronimo/specs/geronimo-annotation_1.3_spec/1.0-SNAPSHOT/maven-metadata.xml
[INFO] Downloading: http://repository.apache.org/snapshots/org/apache/geronimo/specs/geronimo-annotation_1.3_spec/1.0-SNAPSHOT/maven-metadata.xml
[INFO] Downloading: https://repository.apache.org/content/repositories/snapshots/org/apache/geronimo/specs/geronimo-annotation_1.3_spec/1.0-SNAPSHOT/maven-metadata.xml
[INFO] Downloading: http://repository.apache.org/snapshots/org/apache/geronimo/specs/geronimo-annotation_1.3_spec/1.0-SNAPSHOT/geronimo-annotation_1.3_spec-1.0-SNAPSHOT.pom
[INFO] Downloading: https://repository.apache.org/content/repositories/releases/org/apache/geronimo/specs/geronimo-annotation_1.3_spec/1.0-SNAPSHOT/geronimo-annotation_1.3_spec-1.0-SNAPSHOT.pom
[INFO] Downloading: https://repository.apache.org/content/repositories/snapshots/org/apache/geronimo/specs/geronimo-annotation_1.3_spec/1.0-SNAPSHOT/geronimo-annotation_1.3_spec-1.0-SNAPSHOT.pom
[INFO] Downloading: http://repository.apache.org/snapshots/org/apache/geronimo/specs/geronimo-annotation_1.3_spec/1.0-SNAPSHOT/geronimo-annotation_1.3_spec-1.0-SNAPSHOT.pom
[WARNING] The POM for org.apache.geronimo.specs:geronimo-annotation_1.3_spec:jar:1.0-SNAPSHOT
is missing, no dependency information available
[INFO] Downloading: https://repository.apache.org/content/repositories/releases/org/apache/geronimo/specs/geronimo-jcdi_2.0_spec/1.0-SNAPSHOT/maven-metadata.xml
[INFO] Downloading: http://repository.apache.org/snapshots/org/apache/geronimo/specs/geronimo-jcdi_2.0_spec/1.0-SNAPSHOT/maven-metadata.xml
[INFO] Downloading: https://repository.apache.org/content/repositories/snapshots/org/apache/geronimo/specs/geronimo-jcdi_2.0_spec/1.0-SNAPSHOT/maven-metadata.xml
[INFO] Downloading: http://repository.apache.org/snapshots/org/apache/geronimo/specs/geronimo-jcdi_2.0_spec/1.0-SNAPSHOT/maven-metadata.xml
[INFO] Downloading: http://repository.apache.org/snapshots/org/apache/geronimo/specs/geronimo-jcdi_2.0_spec/1.0-SNAPSHOT/geronimo-jcdi_2.0_spec-1.0-SNAPSHOT.pom
[INFO] Downloading: https://repository.apache.org/content/repositories/releases/org/apache/geronimo/specs/geronimo-jcdi_2.0_spec/1.0-SNAPSHOT/geronimo-jcdi_2.0_spec-1.0-SNAPSHOT.pom
[INFO] Downloading: https://repository.apache.org/content/repositories/snapshots/org/apache/geronimo/specs/geronimo-jcdi_2.0_spec/1.0-SNAPSHOT/geronimo-jcdi_2.0_spec-1.0-SNAPSHOT.pom
[INFO] Downloading: http://repository.apache.org/snapshots/org/apache/geronimo/specs/geronimo-jcdi_2.0_spec/1.0-SNAPSHOT/geronimo-jcdi_2.0_spec-1.0-SNAPSHOT.pom
[WARNING] The POM for org.apache.geronimo.specs:geronimo-jcdi_2.0_spec:jar:1.0-SNAPSHOT is
missing, no dependency information available
[INFO] Downloading: http://repository.apache.org/snapshots/org/apache/openwebbeans/openwebbeans-impl/2.0.0-SNAPSHOT/maven-metadata.xml
[INFO] Downloading: https://repository.apache.org/content/repositories/releases/org/apache/openwebbeans/openwebbeans-impl/2.0.0-SNAPSHOT/maven-metadata.xml
[INFO] Downloading: https://repository.apache.org/content/repositories/snapshots/org/apache/openwebbeans/openwebbeans-impl/2.0.0-SNAPSHOT/maven-metadata.xml
[INFO] Downloading: http://repository.apache.org/snapshots/org/apache/openwebbeans/openwebbeans-impl/2.0.0-SNAPSHOT/maven-metadata.xml
[INFO] Downloaded: http://repository.apache.org/snapshots/org/apache/openwebbeans/openwebbeans-impl/2.0.0-SNAPSHOT/maven-metadata.xml
(1.2 kB at 3.1 kB/s)
[INFO] Downloaded: http://repository.apache.org/snapshots/org/apache/openwebbeans/openwebbeans-impl/2.0.0-SNAPSHOT/maven-metadata.xml
(1.2 kB at 3.1 kB/s)
[INFO] Downloaded: https://repository.apache.org/content/repositories/snapshots/org/apache/openwebbeans/openwebbeans-impl/2.0.0-SNAPSHOT/maven-metadata.xml
(1.2 kB at 2.1 kB/s)
[INFO] Downloading: http://repository.apache.org/snapshots/org/apache/openwebbeans/openwebbeans-impl/2.0.0-SNAPSHOT/openwebbeans-impl-2.0.0-20170704.083135-44.pom
[INFO] Downloaded: http://repository.apache.org/snapshots/org/apache/openwebbeans/openwebbeans-impl/2.0.0-SNAPSHOT/openwebbeans-impl-2.0.0-20170704.083135-44.pom
(7.0 kB at 18 kB/s)
[INFO] Downloading: http://repository.apache.org/snapshots/org/apache/openwebbeans/openwebbeans/2.0.0-SNAPSHOT/maven-metadata.xml
[INFO] Downloading: https://repository.apache.org/content/repositories/snapshots/org/apache/openwebbeans/openwebbeans/2.0.0-SNAPSHOT/maven-metadata.xml
[INFO] Downloading: https://repository.apache.org/content/repositories/releases/org/apache/openwebbeans/openwebbeans/2.0.0-SNAPSHOT/maven-metadata.xml
[INFO] Downloading: http://repository.apache.org/snapshots/org/apache/openwebbeans/openwebbeans/2.0.0-SNAPSHOT/maven-metadata.xml
[INFO] Downloaded: http://repository.apache.org/snapshots/org/apache/openwebbeans/openwebbeans/2.0.0-SNAPSHOT/maven-metadata.xml
(826 B at 2.2 kB/s)
[INFO] Downloaded: http://repository.apache.org/snapshots/org/apache/openwebbeans/openwebbeans/2.0.0-SNAPSHOT/maven-metadata.xml
(826 B at 2.2 kB/s)
[INFO] Downloaded: https://repository.apache.org/content/repositories/snapshots/org/apache/openwebbeans/openwebbeans/2.0.0-SNAPSHOT/maven-metadata.xml
(826 B at 1.5 kB/s)
[INFO] Downloading: http://repository.apache.org/snapshots/org/apache/openwebbeans/openwebbeans/2.0.0-SNAPSHOT/openwebbeans-2.0.0-20170704.083033-52.pom
[INFO] Downloaded: http://repository.apache.org/snapshots/org/apache/openwebbeans/openwebbeans/2.0.0-SNAPSHOT/openwebbeans-2.0.0-20170704.083033-52.pom
(32 kB at 69 kB/s)
[INFO] Downloading: http://repository.apache.org/snapshots/org/apache/openwebbeans/openwebbeans-spi/2.0.0-SNAPSHOT/maven-metadata.xml
[INFO] Downloading: https://repository.apache.org/content/repositories/snapshots/org/apache/openwebbeans/openwebbeans-spi/2.0.0-SNAPSHOT/maven-metadata.xml
[INFO] Downloading: http://repository.apache.org/snapshots/org/apache/openwebbeans/openwebbeans-spi/2.0.0-SNAPSHOT/maven-metadata.xml
[INFO] Downloading: https://repository.apache.org/content/repositories/releases/org/apache/openwebbeans/openwebbeans-spi/2.0.0-SNAPSHOT/maven-metadata.xml
[INFO] Downloaded: http://repository.apache.org/snapshots/org/apache/openwebbeans/openwebbeans-spi/2.0.0-SNAPSHOT/maven-metadata.xml
(1.0 kB at 2.6 kB/s)
[INFO] Downloaded: http://repository.apache.org/snapshots/org/apache/openwebbeans/openwebbeans-spi/2.0.0-SNAPSHOT/maven-metadata.xml
(1.0 kB at 2.6 kB/s)
[INFO] Downloaded: https://repository.apache.org/content/repositories/snapshots/org/apache/openwebbeans/openwebbeans-spi/2.0.0-SNAPSHOT/maven-metadata.xml
(1.0 kB at 1.8 kB/s)
[INFO] Downloading: http://repository.apache.org/snapshots/org/apache/openwebbeans/openwebbeans-spi/2.0.0-SNAPSHOT/openwebbeans-spi-2.0.0-20170704.083049-51.pom
[INFO] Downloaded: http://repository.apache.org/snapshots/org/apache/openwebbeans/openwebbeans-spi/2.0.0-SNAPSHOT/openwebbeans-spi-2.0.0-20170704.083049-51.pom
(2.9 kB at 7.5 kB/s)
[INFO] Downloading: http://repository.apache.org/snapshots/org/apache/openwebbeans/openwebbeans-resource/2.0.0-SNAPSHOT/maven-metadata.xml
[INFO] Downloading: http://repository.apache.org/snapshots/org/apache/openwebbeans/openwebbeans-resource/2.0.0-SNAPSHOT/maven-metadata.xml
[INFO] Downloading: https://repository.apache.org/content/repositories/snapshots/org/apache/openwebbeans/openwebbeans-resource/2.0.0-SNAPSHOT/maven-metadata.xml
[INFO] Downloading: https://repository.apache.org/content/repositories/releases/org/apache/openwebbeans/openwebbeans-resource/2.0.0-SNAPSHOT/maven-metadata.xml
[INFO] Downloaded: http://repository.apache.org/snapshots/org/apache/openwebbeans/openwebbeans-resource/2.0.0-SNAPSHOT/maven-metadata.xml
(1.0 kB at 2.4 kB/s)
[INFO] Downloaded: http://repository.apache.org/snapshots/org/apache/openwebbeans/openwebbeans-resource/2.0.0-SNAPSHOT/maven-metadata.xml
(1.0 kB at 2.3 kB/s)
[INFO] Downloaded: https://repository.apache.org/content/repositories/snapshots/org/apache/openwebbeans/openwebbeans-resource/2.0.0-SNAPSHOT/maven-metadata.xml
(1.0 kB at 1.8 kB/s)
[INFO] Downloading: http://repository.apache.org/snapshots/org/apache/openwebbeans/openwebbeans-resource/2.0.0-SNAPSHOT/openwebbeans-resource-2.0.0-20170704.083346-43.pom
[INFO] Downloaded: http://repository.apache.org/snapshots/org/apache/openwebbeans/openwebbeans-resource/2.0.0-SNAPSHOT/openwebbeans-resource-2.0.0-20170704.083346-43.pom
(2.5 kB at 6.5 kB/s)
[INFO] Downloading: http://repository.apache.org/snapshots/org/apache/openwebbeans/arquillian/owb-arquillian-standalone/2.0.0-SNAPSHOT/maven-metadata.xml
[INFO] Downloading: https://repository.apache.org/content/repositories/releases/org/apache/openwebbeans/arquillian/owb-arquillian-standalone/2.0.0-SNAPSHOT/maven-metadata.xml
[INFO] Downloading: http://repository.apache.org/snapshots/org/apache/openwebbeans/arquillian/owb-arquillian-standalone/2.0.0-SNAPSHOT/maven-metadata.xml
[INFO] Downloading: https://repository.apache.org/content/repositories/snapshots/org/apache/openwebbeans/arquillian/owb-arquillian-standalone/2.0.0-SNAPSHOT/maven-metadata.xml
[INFO] Downloaded: http://repository.apache.org/snapshots/org/apache/openwebbeans/arquillian/owb-arquillian-standalone/2.0.0-SNAPSHOT/maven-metadata.xml
(1.0 kB at 2.3 kB/s)
[INFO] Downloaded: http://repository.apache.org/snapshots/org/apache/openwebbeans/arquillian/owb-arquillian-standalone/2.0.0-SNAPSHOT/maven-metadata.xml
(1.0 kB at 2.3 kB/s)
[INFO] Downloaded: https://repository.apache.org/content/repositories/snapshots/org/apache/openwebbeans/arquillian/owb-arquillian-standalone/2.0.0-SNAPSHOT/maven-metadata.xml
(1.0 kB at 1.8 kB/s)
[INFO] Downloading: http://repository.apache.org/snapshots/org/apache/openwebbeans/arquillian/owb-arquillian-standalone/2.0.0-SNAPSHOT/owb-arquillian-standalone-2.0.0-20170704.083429-43.pom
[INFO] Downloaded: http://repository.apache.org/snapshots/org/apache/openwebbeans/arquillian/owb-arquillian-standalone/2.0.0-SNAPSHOT/owb-arquillian-standalone-2.0.0-20170704.083429-43.pom
(3.8 kB at 9.7 kB/s)
[INFO] Downloading: http://repository.apache.org/snapshots/org/apache/openwebbeans/arquillian/owb-arquillian-parent/2.0.0-SNAPSHOT/maven-metadata.xml
[INFO] Downloading: http://repository.apache.org/snapshots/org/apache/openwebbeans/arquillian/owb-arquillian-parent/2.0.0-SNAPSHOT/maven-metadata.xml
[INFO] Downloading: https://repository.apache.org/content/repositories/snapshots/org/apache/openwebbeans/arquillian/owb-arquillian-parent/2.0.0-SNAPSHOT/maven-metadata.xml
[INFO] Downloading: https://repository.apache.org/content/repositories/releases/org/apache/openwebbeans/arquillian/owb-arquillian-parent/2.0.0-SNAPSHOT/maven-metadata.xml
[INFO] Downloaded: http://repository.apache.org/snapshots/org/apache/openwebbeans/arquillian/owb-arquillian-parent/2.0.0-SNAPSHOT/maven-metadata.xml
(634 B at 1.5 kB/s)
[INFO] Downloaded: http://repository.apache.org/snapshots/org/apache/openwebbeans/arquillian/owb-arquillian-parent/2.0.0-SNAPSHOT/maven-metadata.xml
(634 B at 1.5 kB/s)
[INFO] Downloaded: https://repository.apache.org/content/repositories/snapshots/org/apache/openwebbeans/arquillian/owb-arquillian-parent/2.0.0-SNAPSHOT/maven-metadata.xml
(634 B at 1.1 kB/s)
[INFO] Downloading: http://repository.apache.org/snapshots/org/apache/openwebbeans/arquillian/owb-arquillian-parent/2.0.0-SNAPSHOT/owb-arquillian-parent-2.0.0-20170704.083420-43.pom
[INFO] Downloaded: http://repository.apache.org/snapshots/org/apache/openwebbeans/arquillian/owb-arquillian-parent/2.0.0-SNAPSHOT/owb-arquillian-parent-2.0.0-20170704.083420-43.pom
(3.0 kB at 8.0 kB/s)
[INFO] Downloading: http://repository.apache.org/snapshots/org/apache/geronimo/specs/geronimo-annotation_1.3_spec/1.0-SNAPSHOT/geronimo-annotation_1.3_spec-1.0-SNAPSHOT.jar
[INFO] Downloading: http://repository.apache.org/snapshots/org/apache/geronimo/specs/geronimo-jcdi_2.0_spec/1.0-SNAPSHOT/geronimo-jcdi_2.0_spec-1.0-SNAPSHOT.jar
[INFO] Downloading: http://repository.apache.org/snapshots/org/apache/openwebbeans/openwebbeans-impl/2.0.0-SNAPSHOT/openwebbeans-impl-2.0.0-20170704.083135-44.jar
[INFO] Downloading: http://repository.apache.org/snapshots/org/apache/openwebbeans/openwebbeans-spi/2.0.0-SNAPSHOT/openwebbeans-spi-2.0.0-20170704.083049-51.jar
[INFO] Downloading: http://repository.apache.org/snapshots/org/apache/openwebbeans/openwebbeans-resource/2.0.0-SNAPSHOT/openwebbeans-resource-2.0.0-20170704.083346-43.jar
[INFO] Downloading: http://repository.apache.org/snapshots/org/apache/openwebbeans/arquillian/owb-arquillian-standalone/2.0.0-SNAPSHOT/owb-arquillian-standalone-2.0.0-20170704.083429-43.jar
[INFO] Downloaded: http://repository.apache.org/snapshots/org/apache/openwebbeans/openwebbeans-spi/2.0.0-SNAPSHOT/openwebbeans-spi-2.0.0-20170704.083049-51.jar
(22 kB at 45 kB/s)
[INFO] Downloaded: http://repository.apache.org/snapshots/org/apache/openwebbeans/openwebbeans-resource/2.0.0-SNAPSHOT/openwebbeans-resource-2.0.0-20170704.083346-43.jar
(15 kB at 32 kB/s)
[INFO] Downloaded: http://repository.apache.org/snapshots/org/apache/openwebbeans/arquillian/owb-arquillian-standalone/2.0.0-SNAPSHOT/owb-arquillian-standalone-2.0.0-20170704.083429-43.jar
(32 kB at 49 kB/s)
[INFO] Downloaded: http://repository.apache.org/snapshots/org/apache/openwebbeans/openwebbeans-impl/2.0.0-SNAPSHOT/openwebbeans-impl-2.0.0-20170704.083135-44.jar
(737 kB at 789 kB/s)
[INFO] Downloading: https://repository.apache.org/content/repositories/releases/org/apache/geronimo/specs/geronimo-annotation_1.3_spec/1.0-SNAPSHOT/geronimo-annotation_1.3_spec-1.0-SNAPSHOT.jar
[INFO] Downloading: https://repository.apache.org/content/repositories/releases/org/apache/geronimo/specs/geronimo-jcdi_2.0_spec/1.0-SNAPSHOT/geronimo-jcdi_2.0_spec-1.0-SNAPSHOT.jar
[INFO] Downloading: https://repository.apache.org/content/repositories/snapshots/org/apache/geronimo/specs/geronimo-annotation_1.3_spec/1.0-SNAPSHOT/geronimo-annotation_1.3_spec-1.0-SNAPSHOT.jar
[INFO] Downloading: https://repository.apache.org/content/repositories/snapshots/org/apache/geronimo/specs/geronimo-jcdi_2.0_spec/1.0-SNAPSHOT/geronimo-jcdi_2.0_spec-1.0-SNAPSHOT.jar
[INFO] Downloading: http://repository.apache.org/snapshots/org/apache/geronimo/specs/geronimo-annotation_1.3_spec/1.0-SNAPSHOT/geronimo-annotation_1.3_spec-1.0-SNAPSHOT.jar
[INFO] Downloading: http://repository.apache.org/snapshots/org/apache/geronimo/specs/geronimo-jcdi_2.0_spec/1.0-SNAPSHOT/geronimo-jcdi_2.0_spec-1.0-SNAPSHOT.jar
[INFO] ------------------------------------------------------------------------
[INFO] Reactor Summary:
[INFO] 
[INFO] Apache DeltaSpike .................................. SUCCESS [  7.426 s]
[INFO] Apache DeltaSpike Sources .......................... SUCCESS [  1.269 s]
[INFO] Apache DeltaSpike CheckStyle-rules ................. SUCCESS [  4.802 s]
[INFO] Apache DeltaSpike Parent ........................... SUCCESS [  7.560 s]
[INFO] Apache DeltaSpike Test-Utils ....................... SUCCESS [  9.594 s]
[INFO] Apache DeltaSpike Code Parent ...................... FAILURE [ 11.303 s]
[INFO] Apache DeltaSpike Core ............................. SKIPPED
[INFO] Apache DeltaSpike Core-API ......................... SKIPPED
[INFO] Apache DeltaSpike Core-Implementation .............. SKIPPED
[INFO] Apache DeltaSpike ContainerControl parent .......... SKIPPED
[INFO] Apache DeltaSpike CDI ContainerControl API ......... SKIPPED
[INFO] Apache DeltaSpike CDI ContainerControl TCK ......... SKIPPED
[INFO] Apache DeltaSpike CDI OWB-ContainerControl ......... SKIPPED
[INFO] Apache DeltaSpike CDI Servlet-ContainerControl ..... SKIPPED
[INFO] Apache DeltaSpike Modules .......................... SKIPPED
[INFO] Apache DeltaSpike Proxy-Module ..................... SKIPPED
[INFO] Apache DeltaSpike Proxy-Module API ................. SKIPPED
[INFO] Apache DeltaSpike Proxy-Module Impl ASM5 ........... SKIPPED
[INFO] Apache DeltaSpike Security-Module .................. SKIPPED
[INFO] Apache DeltaSpike Security-Module API .............. SKIPPED
[INFO] Apache DeltaSpike Security-Module Impl ............. SKIPPED
[INFO] Apache DeltaSpike JPA-Module ....................... SKIPPED
[INFO] Apache DeltaSpike JPA-Module API ................... SKIPPED
[INFO] Apache DeltaSpike JPA-Module Impl .................. SKIPPED
[INFO] Apache DeltaSpike Servlet-Module ................... SKIPPED
[INFO] Apache DeltaSpike Servlet-Module API ............... SKIPPED
[INFO] Apache DeltaSpike Servlet-Module Impl .............. SKIPPED
[INFO] Apache DeltaSpike JSF-Module ....................... SKIPPED
[INFO] Apache DeltaSpike JSF-Module API ................... SKIPPED
[INFO] Apache DeltaSpike JSF-Module Impl .................. SKIPPED
[INFO] Apache DeltaSpike JSF-Module Impl (EE6 only) ....... SKIPPED
[INFO] Apache DeltaSpike Partial-Bean-Module .............. SKIPPED
[INFO] Apache DeltaSpike Partial-Bean-Module API .......... SKIPPED
[INFO] Apache DeltaSpike Partial-Bean-Module Impl ......... SKIPPED
[INFO] Apache DeltaSpike BeanValidation-Module ............ SKIPPED
[INFO] Apache DeltaSpike BeanValidation-Module API ........ SKIPPED
[INFO] Apache DeltaSpike BeanValidation-Module Impl ....... SKIPPED
[INFO] Apache DeltaSpike Data-Module ...................... SKIPPED
[INFO] Apache DeltaSpike Data-Module API .................. SKIPPED
[INFO] Apache DeltaSpike Data-Module Impl ................. SKIPPED
[INFO] Apache DeltaSpike Data-Module Tests with Java 8 .... SKIPPED
[INFO] Apache DeltaSpike Scheduler-Module ................. SKIPPED
[INFO] Apache DeltaSpike Scheduler-Module API ............. SKIPPED
[INFO] Apache DeltaSpike Scheduler-Module Impl ............ SKIPPED
[INFO] Apache DeltaSpike Test-Control-Module .............. SKIPPED
[INFO] Apache DeltaSpike Test-Control-Module API .......... SKIPPED
[INFO] Apache DeltaSpike Test-Control-Module Impl ......... SKIPPED
[INFO] Apache DeltaSpike Examples ......................... SKIPPED
[INFO] Apache DeltaSpike Java-SE Examples ................. SKIPPED
[INFO] Apache DeltaSpike JSF Examples ..................... SKIPPED
[INFO] Apache DeltaSpike JSF Playground ................... SKIPPED
[INFO] Apache DeltaSpike Security Example CDI ............. SKIPPED
[INFO] Apache DeltaSpike Security Example PicketLink ...... SKIPPED
[INFO] Apache DeltaSpike Java-SE Scheduler Examples ....... SKIPPED
[INFO] Apache DeltaSpike JPA Examples ..................... SKIPPED
[INFO] Apache DeltaSpike Data Examples .................... SKIPPED
[INFO] Apache DeltaSpike Distribution ..................... SKIPPED
[INFO] Apache DeltaSpike Distribution Bill of Materials ... SKIPPED
[INFO] Apache DeltaSpike Full Distribution ................ SKIPPED
[INFO] Apache DeltaSpike Documentation .................... SKIPPED
[INFO] Apache DeltaSpike Site ............................. SKIPPED
[INFO] ------------------------------------------------------------------------
[INFO] BUILD FAILURE
[INFO] ------------------------------------------------------------------------
[INFO] Total time: 01:50 min
[INFO] Finished at: 2017-07-06T15:54:05Z
[INFO] Final Memory: 66M/817M
[INFO] ------------------------------------------------------------------------
[ERROR] Failed to execute goal on project parent-code: Could not resolve dependencies for
project org.apache.deltaspike:parent-code:pom:1.8.1-SNAPSHOT: The following artifacts could
not be resolved: org.apache.geronimo.specs:geronimo-annotation_1.3_spec:jar:1.0-SNAPSHOT,
org.apache.geronimo.specs:geronimo-jcdi_2.0_spec:jar:1.0-SNAPSHOT: Could not find artifact
org.apache.geronimo.specs:geronimo-annotation_1.3_spec:jar:1.0-SNAPSHOT in apache-snapshot-repository
(http://repository.apache.org/snapshots/) -> [Help 1]
[ERROR] 
[ERROR] To see the full stack trace of the errors, re-run Maven with the -e switch.
[ERROR] Re-run Maven using the -X switch to enable full debug logging.
[ERROR] 
[ERROR] For more information about the errors and possible solutions, please read the following
articles:
[ERROR] [Help 1] http://cwiki.apache.org/confluence/display/MAVEN/DependencyResolutionException
[ERROR] 
[ERROR] After correcting the problems, you can resume the build with the command
[ERROR]   mvn <goals> -rf :parent-code
[JENKINS] Archiving <https://builds.apache.org/job/DeltaSpike%20OWB%202.0.0/ws/deltaspike/cdictrl/tck/pom.xml>
to org.apache.deltaspike.test/deltaspike-cdictrl-tck/1.8.1-SNAPSHOT/deltaspike-cdictrl-tck-1.8.1-SNAPSHOT.pom
[JENKINS] Archiving <https://builds.apache.org/job/DeltaSpike%20OWB%202.0.0/ws/deltaspike/dist/pom.xml>
to org.apache.deltaspike.distribution/distributions-project/1.8.1-SNAPSHOT/distributions-project-1.8.1-SNAPSHOT.pom
[JENKINS] Archiving <https://builds.apache.org/job/DeltaSpike%20OWB%202.0.0/ws/deltaspike/modules/jsf/impl/pom.xml>
to org.apache.deltaspike.modules/deltaspike-jsf-module-impl/1.8.1-SNAPSHOT/deltaspike-jsf-module-impl-1.8.1-SNAPSHOT.pom
[JENKINS] Archiving <https://builds.apache.org/job/DeltaSpike%20OWB%202.0.0/ws/deltaspike/modules/data/impl/pom.xml>
to org.apache.deltaspike.modules/deltaspike-data-module-impl/1.8.1-SNAPSHOT/deltaspike-data-module-impl-1.8.1-SNAPSHOT.pom
[JENKINS] Archiving <https://builds.apache.org/job/DeltaSpike%20OWB%202.0.0/ws/deltaspike/modules/jsf/pom.xml>
to org.apache.deltaspike.modules/jsf-module-project/1.8.1-SNAPSHOT/jsf-module-project-1.8.1-SNAPSHOT.pom
[JENKINS] Archiving <https://builds.apache.org/job/DeltaSpike%20OWB%202.0.0/ws/deltaspike/modules/bean-validation/impl/pom.xml>
to org.apache.deltaspike.modules/deltaspike-bean-validation-module-impl/1.8.1-SNAPSHOT/deltaspike-bean-validation-module-impl-1.8.1-SNAPSHOT.pom
[JENKINS] Archiving <https://builds.apache.org/job/DeltaSpike%20OWB%202.0.0/ws/deltaspike/examples/jpa-examples/pom.xml>
to org.apache.deltaspike.examples/deltaspike-jpa-examples/1.8.1-SNAPSHOT/deltaspike-jpa-examples-1.8.1-SNAPSHOT.pom
[JENKINS] Archiving <https://builds.apache.org/job/DeltaSpike%20OWB%202.0.0/ws/deltaspike/cdictrl/pom.xml>
to org.apache.deltaspike.cdictrl/cdictrl-project/1.8.1-SNAPSHOT/cdictrl-project-1.8.1-SNAPSHOT.pom
[JENKINS] Archiving <https://builds.apache.org/job/DeltaSpike%20OWB%202.0.0/ws/deltaspike/modules/partial-bean/api/pom.xml>
to org.apache.deltaspike.modules/deltaspike-partial-bean-module-api/1.8.1-SNAPSHOT/deltaspike-partial-bean-module-api-1.8.1-SNAPSHOT.pom
[JENKINS] Archiving <https://builds.apache.org/job/DeltaSpike%20OWB%202.0.0/ws/deltaspike/cdictrl/api/pom.xml>
to org.apache.deltaspike.cdictrl/deltaspike-cdictrl-api/1.8.1-SNAPSHOT/deltaspike-cdictrl-api-1.8.1-SNAPSHOT.pom
[JENKINS] Archiving <https://builds.apache.org/job/DeltaSpike%20OWB%202.0.0/ws/deltaspike/modules/security/api/pom.xml>
to org.apache.deltaspike.modules/deltaspike-security-module-api/1.8.1-SNAPSHOT/deltaspike-security-module-api-1.8.1-SNAPSHOT.pom
[JENKINS] Archiving <https://builds.apache.org/job/DeltaSpike%20OWB%202.0.0/ws/deltaspike/modules/data/api/pom.xml>
to org.apache.deltaspike.modules/deltaspike-data-module-api/1.8.1-SNAPSHOT/deltaspike-data-module-api-1.8.1-SNAPSHOT.pom
[JENKINS] Archiving <https://builds.apache.org/job/DeltaSpike%20OWB%202.0.0/ws/documentation/pom.xml>
to org.apache.deltaspike/deltaspike-documentation/1.8.1-SNAPSHOT/deltaspike-documentation-1.8.1-SNAPSHOT.pom
[JENKINS] Archiving <https://builds.apache.org/job/DeltaSpike%20OWB%202.0.0/ws/deltaspike/examples/jse-examples/pom.xml>
to org.apache.deltaspike.examples/deltaspike-jse-example/1.8.1-SNAPSHOT/deltaspike-jse-example-1.8.1-SNAPSHOT.pom
[JENKINS] Archiving <https://builds.apache.org/job/DeltaSpike%20OWB%202.0.0/ws/deltaspike/examples/pom.xml>
to org.apache.deltaspike.examples/examples-project/1.8.1-SNAPSHOT/examples-project-1.8.1-SNAPSHOT.pom
[JENKINS] Archiving <https://builds.apache.org/job/DeltaSpike%20OWB%202.0.0/ws/deltaspike/modules/jpa/pom.xml>
to org.apache.deltaspike.modules/jpa-module-project/1.8.1-SNAPSHOT/jpa-module-project-1.8.1-SNAPSHOT.pom
[JENKINS] Archiving <https://builds.apache.org/job/DeltaSpike%20OWB%202.0.0/ws/deltaspike/modules/servlet/pom.xml>
to org.apache.deltaspike.modules/servlet-module-project/1.8.1-SNAPSHOT/servlet-module-project-1.8.1-SNAPSHOT.pom
[JENKINS] Archiving <https://builds.apache.org/job/DeltaSpike%20OWB%202.0.0/ws/deltaspike/pom.xml>
to org.apache.deltaspike/deltaspike-project/1.8.1-SNAPSHOT/deltaspike-project-1.8.1-SNAPSHOT.pom
[JENKINS] Archiving <https://builds.apache.org/job/DeltaSpike%20OWB%202.0.0/ws/pom.xml>
to org.apache.deltaspike/deltaspike/1.8.1-SNAPSHOT/deltaspike-1.8.1-SNAPSHOT.pom
[JENKINS] Archiving <https://builds.apache.org/job/DeltaSpike%20OWB%202.0.0/ws/deltaspike/core/impl/pom.xml>
to org.apache.deltaspike.core/deltaspike-core-impl/1.8.1-SNAPSHOT/deltaspike-core-impl-1.8.1-SNAPSHOT.pom
[JENKINS] Archiving <https://builds.apache.org/job/DeltaSpike%20OWB%202.0.0/ws/deltaspike/modules/partial-bean/pom.xml>
to org.apache.deltaspike.modules/partial-bean-module-project/1.8.1-SNAPSHOT/partial-bean-module-project-1.8.1-SNAPSHOT.pom
[JENKINS] Archiving <https://builds.apache.org/job/DeltaSpike%20OWB%202.0.0/ws/deltaspike/cdictrl/impl-owb/pom.xml>
to org.apache.deltaspike.cdictrl/deltaspike-cdictrl-owb/1.8.1-SNAPSHOT/deltaspike-cdictrl-owb-1.8.1-SNAPSHOT.pom
[JENKINS] Archiving <https://builds.apache.org/job/DeltaSpike%20OWB%202.0.0/ws/deltaspike/modules/proxy/pom.xml>
to org.apache.deltaspike.modules/proxy-module-project/1.8.1-SNAPSHOT/proxy-module-project-1.8.1-SNAPSHOT.pom
[JENKINS] Archiving <https://builds.apache.org/job/DeltaSpike%20OWB%202.0.0/ws/deltaspike/parent/pom.xml>
to org.apache.deltaspike/parent/1.8.1-SNAPSHOT/parent-1.8.1-SNAPSHOT.pom
Compressed 41.23 KB of artifacts by 77.6% relative to #12
[JENKINS] Archiving <https://builds.apache.org/job/DeltaSpike%20OWB%202.0.0/ws/deltaspike/modules/security/impl/pom.xml>
to org.apache.deltaspike.modules/deltaspike-security-module-impl/1.8.1-SNAPSHOT/deltaspike-security-module-impl-1.8.1-SNAPSHOT.pom
[JENKINS] Archiving <https://builds.apache.org/job/DeltaSpike%20OWB%202.0.0/ws/deltaspike/modules/jpa/api/pom.xml>
to org.apache.deltaspike.modules/deltaspike-jpa-module-api/1.8.1-SNAPSHOT/deltaspike-jpa-module-api-1.8.1-SNAPSHOT.pom
[JENKINS] Archiving <https://builds.apache.org/job/DeltaSpike%20OWB%202.0.0/ws/deltaspike/modules/proxy/impl-asm5/pom.xml>
to org.apache.deltaspike.modules/deltaspike-proxy-module-impl-asm5/1.8.1-SNAPSHOT/deltaspike-proxy-module-impl-asm5-1.8.1-SNAPSHOT.pom
[JENKINS] Archiving <https://builds.apache.org/job/DeltaSpike%20OWB%202.0.0/ws/deltaspike/dist/bom/pom.xml>
to org.apache.deltaspike.distribution/distributions-bom/1.8.1-SNAPSHOT/distributions-bom-1.8.1-SNAPSHOT.pom
[JENKINS] Archiving <https://builds.apache.org/job/DeltaSpike%20OWB%202.0.0/ws/deltaspike/modules/bean-validation/pom.xml>
to org.apache.deltaspike.modules/bean-validation-module-project/1.8.1-SNAPSHOT/bean-validation-module-project-1.8.1-SNAPSHOT.pom
[JENKINS] Archiving <https://builds.apache.org/job/DeltaSpike%20OWB%202.0.0/ws/deltaspike/parent/code/pom.xml>
to org.apache.deltaspike/parent-code/1.8.1-SNAPSHOT/parent-code-1.8.1-SNAPSHOT.pom
Compressed 95.23 KB of artifacts by 67.2% relative to #12
[JENKINS] Archiving <https://builds.apache.org/job/DeltaSpike%20OWB%202.0.0/ws/deltaspike/modules/jpa/impl/pom.xml>
to org.apache.deltaspike.modules/deltaspike-jpa-module-impl/1.8.1-SNAPSHOT/deltaspike-jpa-module-impl-1.8.1-SNAPSHOT.pom
[JENKINS] Archiving <https://builds.apache.org/job/DeltaSpike%20OWB%202.0.0/ws/deltaspike/modules/partial-bean/impl/pom.xml>
to org.apache.deltaspike.modules/deltaspike-partial-bean-module-impl/1.8.1-SNAPSHOT/deltaspike-partial-bean-module-impl-1.8.1-SNAPSHOT.pom
[JENKINS] Archiving <https://builds.apache.org/job/DeltaSpike%20OWB%202.0.0/ws/deltaspike/cdictrl/servlet/pom.xml>
to org.apache.deltaspike.cdictrl/deltaspike-cdictrl-servlet/1.8.1-SNAPSHOT/deltaspike-cdictrl-servlet-1.8.1-SNAPSHOT.pom
[JENKINS] Archiving <https://builds.apache.org/job/DeltaSpike%20OWB%202.0.0/ws/deltaspike/modules/scheduler/api/pom.xml>
to org.apache.deltaspike.modules/deltaspike-scheduler-module-api/1.8.1-SNAPSHOT/deltaspike-scheduler-module-api-1.8.1-SNAPSHOT.pom
[JENKINS] Archiving <https://builds.apache.org/job/DeltaSpike%20OWB%202.0.0/ws/deltaspike/modules/test-control/pom.xml>
to org.apache.deltaspike.modules/test-control-module-project/1.8.1-SNAPSHOT/test-control-module-project-1.8.1-SNAPSHOT.pom
[JENKINS] Archiving <https://builds.apache.org/job/DeltaSpike%20OWB%202.0.0/ws/deltaspike/modules/scheduler/impl/pom.xml>
to org.apache.deltaspike.modules/deltaspike-scheduler-module-impl/1.8.1-SNAPSHOT/deltaspike-scheduler-module-impl-1.8.1-SNAPSHOT.pom
[JENKINS] Archiving <https://builds.apache.org/job/DeltaSpike%20OWB%202.0.0/ws/deltaspike/examples/jsf-playground/pom.xml>
to org.apache.deltaspike.examples/deltaspike-jsf-playground/1.8.1-SNAPSHOT/deltaspike-jsf-playground-1.8.1-SNAPSHOT.pom
[JENKINS] Archiving <https://builds.apache.org/job/DeltaSpike%20OWB%202.0.0/ws/deltaspike/modules/test-control/impl/pom.xml>
to org.apache.deltaspike.modules/deltaspike-test-control-module-impl/1.8.1-SNAPSHOT/deltaspike-test-control-module-impl-1.8.1-SNAPSHOT.pom
[JENKINS] Archiving <https://builds.apache.org/job/DeltaSpike%20OWB%202.0.0/ws/deltaspike/checkstyle-rules/pom.xml>
to org.apache.deltaspike/checkstyle-rules/1.8.1-SNAPSHOT/checkstyle-rules-1.8.1-SNAPSHOT.pom
[JENKINS] Archiving <https://builds.apache.org/job/DeltaSpike%20OWB%202.0.0/ws/deltaspike/checkstyle-rules/target/checkstyle-rules-1.8.1-SNAPSHOT.jar>
to org.apache.deltaspike/checkstyle-rules/1.8.1-SNAPSHOT/checkstyle-rules-1.8.1-SNAPSHOT.jar
[JENKINS] Archiving <https://builds.apache.org/job/DeltaSpike%20OWB%202.0.0/ws/deltaspike/modules/proxy/api/pom.xml>
to org.apache.deltaspike.modules/deltaspike-proxy-module-api/1.8.1-SNAPSHOT/deltaspike-proxy-module-api-1.8.1-SNAPSHOT.pom
[JENKINS] Archiving <https://builds.apache.org/job/DeltaSpike%20OWB%202.0.0/ws/deltaspike/modules/servlet/api/pom.xml>
to org.apache.deltaspike.modules/deltaspike-servlet-module-api/1.8.1-SNAPSHOT/deltaspike-servlet-module-api-1.8.1-SNAPSHOT.pom
[JENKINS] Archiving <https://builds.apache.org/job/DeltaSpike%20OWB%202.0.0/ws/deltaspike/examples/data-examples/pom.xml>
to org.apache.deltaspike.examples/deltaspike-data-examples/1.8.1-SNAPSHOT/deltaspike-data-examples-1.8.1-SNAPSHOT.pom
[JENKINS] Archiving <https://builds.apache.org/job/DeltaSpike%20OWB%202.0.0/ws/deltaspike/core/api/pom.xml>
to org.apache.deltaspike.core/deltaspike-core-api/1.8.1-SNAPSHOT/deltaspike-core-api-1.8.1-SNAPSHOT.pom
[JENKINS] Archiving <https://builds.apache.org/job/DeltaSpike%20OWB%202.0.0/ws/deltaspike/examples/security-requested-page-after-login-picketlink/pom.xml>
to org.apache.deltaspike.examples/deltaspike-security-requested-page-after-login-picketlink/1.8.1-SNAPSHOT/deltaspike-security-requested-page-after-login-picketlink-1.8.1-SNAPSHOT.pom
[JENKINS] Archiving <https://builds.apache.org/job/DeltaSpike%20OWB%202.0.0/ws/deltaspike/modules/bean-validation/api/pom.xml>
to org.apache.deltaspike.modules/deltaspike-bean-validation-module-api/1.8.1-SNAPSHOT/deltaspike-bean-validation-module-api-1.8.1-SNAPSHOT.pom
[JENKINS] Archiving <https://builds.apache.org/job/DeltaSpike%20OWB%202.0.0/ws/deltaspike/examples/scheduler-playground/pom.xml>
to org.apache.deltaspike.examples/deltaspike-scheduler-example/1.8.1-SNAPSHOT/deltaspike-scheduler-example-1.8.1-SNAPSHOT.pom
[JENKINS] Archiving <https://builds.apache.org/job/DeltaSpike%20OWB%202.0.0/ws/deltaspike/modules/pom.xml>
to org.apache.deltaspike.modules/modules-project/1.8.1-SNAPSHOT/modules-project-1.8.1-SNAPSHOT.pom
[JENKINS] Archiving <https://builds.apache.org/job/DeltaSpike%20OWB%202.0.0/ws/deltaspike/modules/scheduler/pom.xml>
to org.apache.deltaspike.modules/scheduler-module-project/1.8.1-SNAPSHOT/scheduler-module-project-1.8.1-SNAPSHOT.pom
[JENKINS] Archiving <https://builds.apache.org/job/DeltaSpike%20OWB%202.0.0/ws/deltaspike/test-utils/pom.xml>
to org.apache.deltaspike.test/test-utils/1.8.1-SNAPSHOT/test-utils-1.8.1-SNAPSHOT.pom
[JENKINS] Archiving <https://builds.apache.org/job/DeltaSpike%20OWB%202.0.0/ws/deltaspike/test-utils/target/test-utils-1.8.1-SNAPSHOT.jar>
to org.apache.deltaspike.test/test-utils/1.8.1-SNAPSHOT/test-utils-1.8.1-SNAPSHOT.jar
[JENKINS] Archiving <https://builds.apache.org/job/DeltaSpike%20OWB%202.0.0/ws/deltaspike/test-utils/target/test-utils-1.8.1-SNAPSHOT-sources.jar>
to org.apache.deltaspike.test/test-utils/1.8.1-SNAPSHOT/test-utils-1.8.1-SNAPSHOT-sources.jar
[JENKINS] Archiving <https://builds.apache.org/job/DeltaSpike%20OWB%202.0.0/ws/deltaspike/modules/security/pom.xml>
to org.apache.deltaspike.modules/security-module-project/1.8.1-SNAPSHOT/security-module-project-1.8.1-SNAPSHOT.pom
[JENKINS] Archiving <https://builds.apache.org/job/DeltaSpike%20OWB%202.0.0/ws/deltaspike/modules/jsf/api/pom.xml>
to org.apache.deltaspike.modules/deltaspike-jsf-module-api/1.8.1-SNAPSHOT/deltaspike-jsf-module-api-1.8.1-SNAPSHOT.pom
[JENKINS] Archiving <https://builds.apache.org/job/DeltaSpike%20OWB%202.0.0/ws/deltaspike/modules/data/pom.xml>
to org.apache.deltaspike.modules/data-module-project/1.8.1-SNAPSHOT/data-module-project-1.8.1-SNAPSHOT.pom
[JENKINS] Archiving <https://builds.apache.org/job/DeltaSpike%20OWB%202.0.0/ws/deltaspike/modules/servlet/impl/pom.xml>
to org.apache.deltaspike.modules/deltaspike-servlet-module-impl/1.8.1-SNAPSHOT/deltaspike-servlet-module-impl-1.8.1-SNAPSHOT.pom
[JENKINS] Archiving <https://builds.apache.org/job/DeltaSpike%20OWB%202.0.0/ws/deltaspike/modules/test-control/api/pom.xml>
to org.apache.deltaspike.modules/deltaspike-test-control-module-api/1.8.1-SNAPSHOT/deltaspike-test-control-module-api-1.8.1-SNAPSHOT.pom
[JENKINS] Archiving <https://builds.apache.org/job/DeltaSpike%20OWB%202.0.0/ws/deltaspike/examples/jsf-examples/pom.xml>
to org.apache.deltaspike.examples/deltaspike-jsf-example/1.8.1-SNAPSHOT/deltaspike-jsf-example-1.8.1-SNAPSHOT.pom
[JENKINS] Archiving <https://builds.apache.org/job/DeltaSpike%20OWB%202.0.0/ws/deltaspike/modules/jsf/impl-ee6/pom.xml>
to org.apache.deltaspike.modules/deltaspike-jsf-module-impl-ee6/1.8.1-SNAPSHOT/deltaspike-jsf-module-impl-ee6-1.8.1-SNAPSHOT.pom
[JENKINS] Archiving <https://builds.apache.org/job/DeltaSpike%20OWB%202.0.0/ws/deltaspike/examples/security-requested-page-after-login-cdi/pom.xml>
to org.apache.deltaspike.examples/deltaspike-security-requested-page-after-login-cdi/1.8.1-SNAPSHOT/deltaspike-security-requested-page-after-login-cdi-1.8.1-SNAPSHOT.pom
[JENKINS] Archiving <https://builds.apache.org/job/DeltaSpike%20OWB%202.0.0/ws/deltaspike/core/pom.xml>
to org.apache.deltaspike.core/core-project/1.8.1-SNAPSHOT/core-project-1.8.1-SNAPSHOT.pom
[JENKINS] Archiving <https://builds.apache.org/job/DeltaSpike%20OWB%202.0.0/ws/deltaspike/dist/full/pom.xml>
to org.apache.deltaspike.distribution/distribution-full/1.8.1-SNAPSHOT/distribution-full-1.8.1-SNAPSHOT.pom
[JENKINS] Archiving <https://builds.apache.org/job/DeltaSpike%20OWB%202.0.0/ws/site/pom.xml>
to org.apache.deltaspike/deltaspike-site/1.8.1-SNAPSHOT/deltaspike-site-1.8.1-SNAPSHOT.pom
channel stopped

Mime
View raw message