deltaspike-commits mailing list archives

Site index · List index
Message view « Date » · « Thread »
Top « Date » · « Thread »
From Apache Jenkins Server <jenk...@builds.apache.org>
Subject Build failed in Jenkins: DeltaSpike_Wildfly_9.0.2 #165
Date Mon, 26 Jun 2017 20:11:41 GMT
See <https://builds.apache.org/job/DeltaSpike_Wildfly_9.0.2/165/display/redirect?page=changes>

Changes:

[tandraschko] DELTASPIKE-1274 Refactor proxy-module / improve performance

------------------------------------------
[...truncated 178.09 KB...]
[INFO] Apache DeltaSpike Parent ........................... SUCCESS [  5.208 s]
[INFO] Apache DeltaSpike Test-Utils ....................... SUCCESS [  4.774 s]
[INFO] Apache DeltaSpike Code Parent ...................... SUCCESS [ 14.660 s]
[INFO] Apache DeltaSpike Core ............................. SUCCESS [  4.747 s]
[INFO] Apache DeltaSpike Core-API ......................... SUCCESS [ 24.375 s]
[INFO] Apache DeltaSpike Core-Implementation .............. FAILURE [02:17 min]
[INFO] Apache DeltaSpike ContainerControl parent .......... SKIPPED
[INFO] Apache DeltaSpike CDI ContainerControl API ......... SKIPPED
[INFO] Apache DeltaSpike CDI Weld-ContainerControl ........ SKIPPED
[INFO] Apache DeltaSpike Modules .......................... SKIPPED
[INFO] Apache DeltaSpike Proxy-Module ..................... SKIPPED
[INFO] Apache DeltaSpike Proxy-Module API ................. SKIPPED
[INFO] Apache DeltaSpike Proxy-Module Impl ASM5 ........... SKIPPED
[INFO] Apache DeltaSpike Security-Module .................. SKIPPED
[INFO] Apache DeltaSpike Security-Module API .............. SKIPPED
[INFO] Apache DeltaSpike Security-Module Impl ............. SKIPPED
[INFO] Apache DeltaSpike JPA-Module ....................... SKIPPED
[INFO] Apache DeltaSpike JPA-Module API ................... SKIPPED
[INFO] Apache DeltaSpike JPA-Module Impl .................. SKIPPED
[INFO] Apache DeltaSpike Servlet-Module ................... SKIPPED
[INFO] Apache DeltaSpike Servlet-Module API ............... SKIPPED
[INFO] Apache DeltaSpike Servlet-Module Impl .............. SKIPPED
[INFO] Apache DeltaSpike JSF-Module ....................... SKIPPED
[INFO] Apache DeltaSpike JSF-Module API ................... SKIPPED
[INFO] Apache DeltaSpike JSF-Module Impl .................. SKIPPED
[INFO] Apache DeltaSpike JSF-Module Impl (EE6 only) ....... SKIPPED
[INFO] Apache DeltaSpike Partial-Bean-Module .............. SKIPPED
[INFO] Apache DeltaSpike Partial-Bean-Module API .......... SKIPPED
[INFO] Apache DeltaSpike Partial-Bean-Module Impl ......... SKIPPED
[INFO] Apache DeltaSpike BeanValidation-Module ............ SKIPPED
[INFO] Apache DeltaSpike BeanValidation-Module API ........ SKIPPED
[INFO] Apache DeltaSpike BeanValidation-Module Impl ....... SKIPPED
[INFO] Apache DeltaSpike Data-Module ...................... SKIPPED
[INFO] Apache DeltaSpike Data-Module API .................. SKIPPED
[INFO] Apache DeltaSpike Data-Module Impl ................. SKIPPED
[INFO] Apache DeltaSpike Scheduler-Module ................. SKIPPED
[INFO] Apache DeltaSpike Scheduler-Module API ............. SKIPPED
[INFO] Apache DeltaSpike Scheduler-Module Impl ............ SKIPPED
[INFO] Apache DeltaSpike Test-Control-Module .............. SKIPPED
[INFO] Apache DeltaSpike Test-Control-Module API .......... SKIPPED
[INFO] Apache DeltaSpike Test-Control-Module Impl ......... SKIPPED
[INFO] Apache DeltaSpike Examples ......................... SKIPPED
[INFO] Apache DeltaSpike Java-SE Examples ................. SKIPPED
[INFO] Apache DeltaSpike JSF Examples ..................... SKIPPED
[INFO] Apache DeltaSpike JSF Playground ................... SKIPPED
[INFO] Apache DeltaSpike Security Example CDI ............. SKIPPED
[INFO] Apache DeltaSpike Security Example PicketLink ...... SKIPPED
[INFO] Apache DeltaSpike Java-SE Scheduler Examples ....... SKIPPED
[INFO] Apache DeltaSpike JPA Examples ..................... SKIPPED
[INFO] Apache DeltaSpike Data Examples .................... SKIPPED
[INFO] Apache DeltaSpike Distribution ..................... SKIPPED
[INFO] Apache DeltaSpike Distribution Bill of Materials ... SKIPPED
[INFO] Apache DeltaSpike Full Distribution ................ SKIPPED
[INFO] Apache DeltaSpike Documentation .................... SKIPPED
[INFO] Apache DeltaSpike Site ............................. SKIPPED
[INFO] ------------------------------------------------------------------------
[INFO] BUILD FAILURE
[INFO] ------------------------------------------------------------------------
[INFO] Total time: 03:46 min
[INFO] Finished at: 2017-06-26T19:52:52Z
[INFO] Final Memory: 79M/812M
[INFO] ------------------------------------------------------------------------
Waiting for Jenkins to finish collecting data
[ERROR] Failed to execute goal org.apache.maven.plugins:maven-surefire-plugin:2.19.1:test
(default-test) on project deltaspike-core-impl: Execution default-test of goal org.apache.maven.plugins:maven-surefire-plugin:2.19.1:test
failed: There was an error in the forked process
[ERROR] org.apache.maven.surefire.testset.TestSetFailedException: java.lang.RuntimeException:
Could not run @AfterSuite
[ERROR] at org.apache.maven.surefire.common.junit4.JUnit4RunListener.rethrowAnyTestMechanismFailures(JUnit4RunListener.java:209)
[ERROR] at org.apache.maven.surefire.junitcore.JUnitCoreWrapper.createRequestAndRun(JUnitCoreWrapper.java:138)
[ERROR] at org.apache.maven.surefire.junitcore.JUnitCoreWrapper.executeEager(JUnitCoreWrapper.java:107)
[ERROR] at org.apache.maven.surefire.junitcore.JUnitCoreWrapper.execute(JUnitCoreWrapper.java:83)
[ERROR] at org.apache.maven.surefire.junitcore.JUnitCoreWrapper.execute(JUnitCoreWrapper.java:75)
[ERROR] at org.apache.maven.surefire.junitcore.JUnitCoreProvider.invoke(JUnitCoreProvider.java:161)
[ERROR] at org.apache.maven.surefire.booter.ForkedBooter.invokeProviderInSameClassLoader(ForkedBooter.java:290)
[ERROR] at org.apache.maven.surefire.booter.ForkedBooter.runSuitesInProcess(ForkedBooter.java:242)
[ERROR] at org.apache.maven.surefire.booter.ForkedBooter.main(ForkedBooter.java:121)
[ERROR] Caused by: java.lang.RuntimeException: Could not run @AfterSuite
[ERROR] at org.jboss.arquillian.junit.Arquillian$1.shutdown(Arquillian.java:158)
[ERROR] at org.jboss.arquillian.junit.Arquillian$1.testRunFinished(Arquillian.java:132)
[ERROR] at org.junit.runner.notification.RunNotifier$2.notifyListener(RunNotifier.java:71)
[ERROR] at org.junit.runner.notification.RunNotifier$SafeNotifier.run(RunNotifier.java:41)
[ERROR] at org.junit.runner.notification.RunNotifier.fireTestRunFinished(RunNotifier.java:68)
[ERROR] at org.apache.maven.surefire.junitcore.JUnitCore.run(JUnitCore.java:63)
[ERROR] at org.apache.maven.surefire.junitcore.JUnitCoreWrapper.createRequestAndRun(JUnitCoreWrapper.java:137)
[ERROR] ... 7 more
[ERROR] Caused by: org.jboss.arquillian.container.spi.client.container.LifecycleException:
Could not stop container
[ERROR] at org.jboss.as.arquillian.container.managed.ManagedDeployableContainer.stopInternal(ManagedDeployableContainer.java:284)
[ERROR] at org.jboss.as.arquillian.container.CommonDeployableContainer.stop(CommonDeployableContainer.java:122)
[ERROR] at org.jboss.arquillian.container.impl.ContainerImpl.stop(ContainerImpl.java:217)
[ERROR] at org.jboss.arquillian.container.impl.client.container.ContainerLifecycleController$9.perform(ContainerLifecycleController.java:178)
[ERROR] at org.jboss.arquillian.container.impl.client.container.ContainerLifecycleController$9.perform(ContainerLifecycleController.java:172)
[ERROR] at org.jboss.arquillian.container.impl.client.container.ContainerLifecycleController.forContainer(ContainerLifecycleController.java:255)
[ERROR] at org.jboss.arquillian.container.impl.client.container.ContainerLifecycleController.stopContainer(ContainerLifecycleController.java:171)
[ERROR] at sun.reflect.NativeMethodAccessorImpl.invoke0(Native Method)
[ERROR] at sun.reflect.NativeMethodAccessorImpl.invoke(NativeMethodAccessorImpl.java:57)
[ERROR] at sun.reflect.DelegatingMethodAccessorImpl.invoke(DelegatingMethodAccessorImpl.java:43)
[ERROR] at java.lang.reflect.Method.invoke(Method.java:606)
[ERROR] at org.jboss.arquillian.core.impl.ObserverImpl.invoke(ObserverImpl.java:94)
[ERROR] at org.jboss.arquillian.core.impl.EventContextImpl.invokeObservers(EventContextImpl.java:99)
[ERROR] at org.jboss.arquillian.core.impl.EventContextImpl.proceed(EventContextImpl.java:81)
[ERROR] at org.jboss.arquillian.container.impl.client.ContainerDeploymentContextHandler.createContainerContext(ContainerDeploymentContextHandler.java:57)
[ERROR] at sun.reflect.GeneratedMethodAccessor4.invoke(Unknown Source)
[ERROR] at sun.reflect.DelegatingMethodAccessorImpl.invoke(DelegatingMethodAccessorImpl.java:43)
[ERROR] at java.lang.reflect.Method.invoke(Method.java:606)
[ERROR] at org.jboss.arquillian.core.impl.ObserverImpl.invoke(ObserverImpl.java:94)
[ERROR] at org.jboss.arquillian.core.impl.EventContextImpl.proceed(EventContextImpl.java:88)
[ERROR] at org.jboss.arquillian.core.impl.ManagerImpl.fire(ManagerImpl.java:145)
[ERROR] at org.jboss.arquillian.core.impl.ManagerImpl.fire(ManagerImpl.java:116)
[ERROR] at org.jboss.arquillian.core.impl.EventImpl.fire(EventImpl.java:67)
[ERROR] at org.jboss.arquillian.container.impl.client.container.ContainerLifecycleController$4.perform(ContainerLifecycleController.java:107)
[ERROR] at org.jboss.arquillian.container.impl.client.container.ContainerLifecycleController$4.perform(ContainerLifecycleController.java:100)
[ERROR] at org.jboss.arquillian.container.impl.client.container.ContainerLifecycleController.forEachSuiteContainer(ContainerLifecycleController.java:221)
[ERROR] at org.jboss.arquillian.container.impl.client.container.ContainerLifecycleController.stopSuiteContainers(ContainerLifecycleController.java:99)
[ERROR] at sun.reflect.NativeMethodAccessorImpl.invoke0(Native Method)
[ERROR] at sun.reflect.NativeMethodAccessorImpl.invoke(NativeMethodAccessorImpl.java:57)
[ERROR] at sun.reflect.DelegatingMethodAccessorImpl.invoke(DelegatingMethodAccessorImpl.java:43)
[ERROR] at java.lang.reflect.Method.invoke(Method.java:606)
[ERROR] at org.jboss.arquillian.core.impl.ObserverImpl.invoke(ObserverImpl.java:94)
[ERROR] at org.jboss.arquillian.core.impl.EventContextImpl.invokeObservers(EventContextImpl.java:99)
[ERROR] at org.jboss.arquillian.core.impl.EventContextImpl.proceed(EventContextImpl.java:81)
[ERROR] at org.jboss.arquillian.core.impl.ManagerImpl.fire(ManagerImpl.java:145)
[ERROR] at org.jboss.arquillian.core.impl.ManagerImpl.fire(ManagerImpl.java:116)
[ERROR] at org.jboss.arquillian.core.impl.EventImpl.fire(EventImpl.java:67)
[ERROR] at org.jboss.arquillian.container.test.impl.client.ContainerEventController.execute(ContainerEventController.java:91)
[ERROR] at sun.reflect.NativeMethodAccessorImpl.invoke0(Native Method)
[ERROR] at sun.reflect.NativeMethodAccessorImpl.invoke(NativeMethodAccessorImpl.java:57)
[ERROR] at sun.reflect.DelegatingMethodAccessorImpl.invoke(DelegatingMethodAccessorImpl.java:43)
[ERROR] at java.lang.reflect.Method.invoke(Method.java:606)
[ERROR] at org.jboss.arquillian.core.impl.ObserverImpl.invoke(ObserverImpl.java:94)
[ERROR] at org.jboss.arquillian.core.impl.EventContextImpl.invokeObservers(EventContextImpl.java:99)
[ERROR] at org.jboss.arquillian.core.impl.EventContextImpl.proceed(EventContextImpl.java:81)
[ERROR] at org.jboss.arquillian.test.impl.TestContextHandler.createSuiteContext(TestContextHandler.java:73)
[ERROR] at sun.reflect.GeneratedMethodAccessor1.invoke(Unknown Source)
[ERROR] at sun.reflect.DelegatingMethodAccessorImpl.invoke(DelegatingMethodAccessorImpl.java:43)
[ERROR] at java.lang.reflect.Method.invoke(Method.java:606)
[ERROR] at org.jboss.arquillian.core.impl.ObserverImpl.invoke(ObserverImpl.java:94)
[ERROR] at org.jboss.arquillian.core.impl.EventContextImpl.proceed(EventContextImpl.java:88)
[ERROR] at org.jboss.arquillian.core.impl.ManagerImpl.fire(ManagerImpl.java:145)
[ERROR] at org.jboss.arquillian.core.impl.ManagerImpl.fire(ManagerImpl.java:116)
[ERROR] at org.jboss.arquillian.test.impl.EventTestRunnerAdaptor.afterSuite(EventTestRunnerAdaptor.java:80)
[ERROR] at org.jboss.arquillian.junit.Arquillian$1.shutdown(Arquillian.java:145)
[ERROR] ... 13 more
[ERROR] Caused by: java.lang.RuntimeException: java.net.ConnectException: WFLYPRT0053: Could
not connect to http-remoting://127.0.0.1:59990. The connection failed
[ERROR] at org.jboss.as.controller.client.impl.AbstractModelControllerClient.executeAsync(AbstractModelControllerClient.java:104)
[ERROR] at org.jboss.as.arquillian.container.managed.ManagedDeployableContainer.stopInternal(ManagedDeployableContainer.java:273)
[ERROR] ... 67 more
[ERROR] Caused by: java.net.ConnectException: WFLYPRT0053: Could not connect to http-remoting://127.0.0.1:59990.
The connection failed
[ERROR] at org.jboss.as.protocol.ProtocolConnectionUtils.connectSync(ProtocolConnectionUtils.java:122)
[ERROR] at org.jboss.as.protocol.ProtocolConnectionManager$EstablishingConnection.connect(ProtocolConnectionManager.java:257)
[ERROR] at org.jboss.as.protocol.ProtocolConnectionManager.connect(ProtocolConnectionManager.java:71)
[ERROR] at org.jboss.as.protocol.mgmt.FutureManagementChannel$Establishing.getChannel(FutureManagementChannel.java:212)
[ERROR] at org.jboss.as.controller.client.impl.RemotingModelControllerClient.getOrCreateChannel(RemotingModelControllerClient.java:146)
[ERROR] at org.jboss.as.controller.client.impl.RemotingModelControllerClient$1.getChannel(RemotingModelControllerClient.java:65)
[ERROR] at org.jboss.as.protocol.mgmt.ManagementChannelHandler.executeRequest(ManagementChannelHandler.java:147)
[ERROR] at org.jboss.as.protocol.mgmt.ManagementChannelHandler.executeRequest(ManagementChannelHandler.java:122)
[ERROR] at org.jboss.as.controller.client.impl.AbstractModelControllerClient.executeRequest(AbstractModelControllerClient.java:263)
[ERROR] at org.jboss.as.controller.client.impl.AbstractModelControllerClient.execute(AbstractModelControllerClient.java:168)
[ERROR] at org.jboss.as.controller.client.impl.AbstractModelControllerClient.executeAsync(AbstractModelControllerClient.java:101)
[ERROR] ... 68 more
[ERROR] Caused by: java.net.ConnectException: Connection refused
[ERROR] at sun.nio.ch.SocketChannelImpl.checkConnect(Native Method)
[ERROR] at sun.nio.ch.SocketChannelImpl.finishConnect(SocketChannelImpl.java:744)
[ERROR] at org.xnio.nio.WorkerThread$ConnectHandle.handleReady(WorkerThread.java:319)
[ERROR] at org.xnio.nio.WorkerThread.run(WorkerThread.java:539)
[ERROR] at ...asynchronous invocation...(Unknown Source)
[ERROR] at org.jboss.remoting3.EndpointImpl.doConnect(EndpointImpl.java:272)
[ERROR] at org.jboss.remoting3.EndpointImpl.doConnect(EndpointImpl.java:253)
[ERROR] at org.jboss.remoting3.EndpointImpl.connect(EndpointImpl.java:351)
[ERROR] at org.jboss.remoting3.EndpointImpl.connect(EndpointImpl.java:339)
[ERROR] at org.jboss.as.protocol.ProtocolConnectionUtils.connect(ProtocolConnectionUtils.java:83)
[ERROR] at org.jboss.as.protocol.ProtocolConnectionUtils.connectSync(ProtocolConnectionUtils.java:114)
[ERROR] ... 78 more
[ERROR] -> [Help 1]
[ERROR] 
[ERROR] To see the full stack trace of the errors, re-run Maven with the -e switch.
[ERROR] Re-run Maven using the -X switch to enable full debug logging.
[ERROR] 
[ERROR] For more information about the errors and possible solutions, please read the following
articles:
[ERROR] [Help 1] http://cwiki.apache.org/confluence/display/MAVEN/PluginExecutionException
[ERROR] 
[ERROR] After correcting the problems, you can resume the build with the command
[ERROR]   mvn <goals> -rf :deltaspike-core-impl
[JENKINS] Archiving <https://builds.apache.org/job/DeltaSpike_Wildfly_9.0.2/ws/deltaspike/dist/pom.xml>
to org.apache.deltaspike.distribution/distributions-project/1.8.1-SNAPSHOT/distributions-project-1.8.1-SNAPSHOT.pom
[JENKINS] Archiving <https://builds.apache.org/job/DeltaSpike_Wildfly_9.0.2/ws/deltaspike/modules/jsf/impl/pom.xml>
to org.apache.deltaspike.modules/deltaspike-jsf-module-impl/1.8.1-SNAPSHOT/deltaspike-jsf-module-impl-1.8.1-SNAPSHOT.pom
[JENKINS] Archiving <https://builds.apache.org/job/DeltaSpike_Wildfly_9.0.2/ws/deltaspike/modules/data/impl/pom.xml>
to org.apache.deltaspike.modules/deltaspike-data-module-impl/1.8.1-SNAPSHOT/deltaspike-data-module-impl-1.8.1-SNAPSHOT.pom
[JENKINS] Archiving <https://builds.apache.org/job/DeltaSpike_Wildfly_9.0.2/ws/deltaspike/modules/jsf/pom.xml>
to org.apache.deltaspike.modules/jsf-module-project/1.8.1-SNAPSHOT/jsf-module-project-1.8.1-SNAPSHOT.pom
[JENKINS] Archiving <https://builds.apache.org/job/DeltaSpike_Wildfly_9.0.2/ws/deltaspike/modules/bean-validation/impl/pom.xml>
to org.apache.deltaspike.modules/deltaspike-bean-validation-module-impl/1.8.1-SNAPSHOT/deltaspike-bean-validation-module-impl-1.8.1-SNAPSHOT.pom
[JENKINS] Archiving <https://builds.apache.org/job/DeltaSpike_Wildfly_9.0.2/ws/deltaspike/examples/jpa-examples/pom.xml>
to org.apache.deltaspike.examples/deltaspike-jpa-examples/1.8.1-SNAPSHOT/deltaspike-jpa-examples-1.8.1-SNAPSHOT.pom
[JENKINS] Archiving <https://builds.apache.org/job/DeltaSpike_Wildfly_9.0.2/ws/deltaspike/cdictrl/pom.xml>
to org.apache.deltaspike.cdictrl/cdictrl-project/1.8.1-SNAPSHOT/cdictrl-project-1.8.1-SNAPSHOT.pom
[JENKINS] Archiving <https://builds.apache.org/job/DeltaSpike_Wildfly_9.0.2/ws/deltaspike/modules/partial-bean/api/pom.xml>
to org.apache.deltaspike.modules/deltaspike-partial-bean-module-api/1.8.1-SNAPSHOT/deltaspike-partial-bean-module-api-1.8.1-SNAPSHOT.pom
[JENKINS] Archiving <https://builds.apache.org/job/DeltaSpike_Wildfly_9.0.2/ws/deltaspike/cdictrl/api/pom.xml>
to org.apache.deltaspike.cdictrl/deltaspike-cdictrl-api/1.8.1-SNAPSHOT/deltaspike-cdictrl-api-1.8.1-SNAPSHOT.pom
[JENKINS] Archiving <https://builds.apache.org/job/DeltaSpike_Wildfly_9.0.2/ws/deltaspike/modules/security/api/pom.xml>
to org.apache.deltaspike.modules/deltaspike-security-module-api/1.8.1-SNAPSHOT/deltaspike-security-module-api-1.8.1-SNAPSHOT.pom
[JENKINS] Archiving <https://builds.apache.org/job/DeltaSpike_Wildfly_9.0.2/ws/deltaspike/modules/data/api/pom.xml>
to org.apache.deltaspike.modules/deltaspike-data-module-api/1.8.1-SNAPSHOT/deltaspike-data-module-api-1.8.1-SNAPSHOT.pom
[JENKINS] Archiving <https://builds.apache.org/job/DeltaSpike_Wildfly_9.0.2/ws/documentation/pom.xml>
to org.apache.deltaspike/deltaspike-documentation/1.8.1-SNAPSHOT/deltaspike-documentation-1.8.1-SNAPSHOT.pom
[JENKINS] Archiving <https://builds.apache.org/job/DeltaSpike_Wildfly_9.0.2/ws/deltaspike/examples/jse-examples/pom.xml>
to org.apache.deltaspike.examples/deltaspike-jse-example/1.8.1-SNAPSHOT/deltaspike-jse-example-1.8.1-SNAPSHOT.pom
[JENKINS] Archiving <https://builds.apache.org/job/DeltaSpike_Wildfly_9.0.2/ws/deltaspike/examples/pom.xml>
to org.apache.deltaspike.examples/examples-project/1.8.1-SNAPSHOT/examples-project-1.8.1-SNAPSHOT.pom
[JENKINS] Archiving <https://builds.apache.org/job/DeltaSpike_Wildfly_9.0.2/ws/deltaspike/modules/jpa/pom.xml>
to org.apache.deltaspike.modules/jpa-module-project/1.8.1-SNAPSHOT/jpa-module-project-1.8.1-SNAPSHOT.pom
[JENKINS] Archiving <https://builds.apache.org/job/DeltaSpike_Wildfly_9.0.2/ws/deltaspike/modules/servlet/pom.xml>
to org.apache.deltaspike.modules/servlet-module-project/1.8.1-SNAPSHOT/servlet-module-project-1.8.1-SNAPSHOT.pom
[JENKINS] Archiving <https://builds.apache.org/job/DeltaSpike_Wildfly_9.0.2/ws/deltaspike/pom.xml>
to org.apache.deltaspike/deltaspike-project/1.8.1-SNAPSHOT/deltaspike-project-1.8.1-SNAPSHOT.pom
[JENKINS] Archiving <https://builds.apache.org/job/DeltaSpike_Wildfly_9.0.2/ws/pom.xml>
to org.apache.deltaspike/deltaspike/1.8.1-SNAPSHOT/deltaspike-1.8.1-SNAPSHOT.pom
[JENKINS] Archiving <https://builds.apache.org/job/DeltaSpike_Wildfly_9.0.2/ws/deltaspike/core/impl/pom.xml>
to org.apache.deltaspike.core/deltaspike-core-impl/1.8.1-SNAPSHOT/deltaspike-core-impl-1.8.1-SNAPSHOT.pom
[JENKINS] Archiving <https://builds.apache.org/job/DeltaSpike_Wildfly_9.0.2/ws/deltaspike/modules/partial-bean/pom.xml>
to org.apache.deltaspike.modules/partial-bean-module-project/1.8.1-SNAPSHOT/partial-bean-module-project-1.8.1-SNAPSHOT.pom
[JENKINS] Archiving <https://builds.apache.org/job/DeltaSpike_Wildfly_9.0.2/ws/deltaspike/cdictrl/impl-weld/pom.xml>
to org.apache.deltaspike.cdictrl/deltaspike-cdictrl-weld/1.8.1-SNAPSHOT/deltaspike-cdictrl-weld-1.8.1-SNAPSHOT.pom
[JENKINS] Archiving <https://builds.apache.org/job/DeltaSpike_Wildfly_9.0.2/ws/deltaspike/modules/proxy/pom.xml>
to org.apache.deltaspike.modules/proxy-module-project/1.8.1-SNAPSHOT/proxy-module-project-1.8.1-SNAPSHOT.pom
[JENKINS] Archiving <https://builds.apache.org/job/DeltaSpike_Wildfly_9.0.2/ws/deltaspike/parent/pom.xml>
to org.apache.deltaspike/parent/1.8.1-SNAPSHOT/parent-1.8.1-SNAPSHOT.pom
Compressed 41.23 KB of artifacts by 77.6% relative to #164
[JENKINS] Archiving <https://builds.apache.org/job/DeltaSpike_Wildfly_9.0.2/ws/deltaspike/modules/security/impl/pom.xml>
to org.apache.deltaspike.modules/deltaspike-security-module-impl/1.8.1-SNAPSHOT/deltaspike-security-module-impl-1.8.1-SNAPSHOT.pom
[JENKINS] Archiving <https://builds.apache.org/job/DeltaSpike_Wildfly_9.0.2/ws/deltaspike/modules/jpa/api/pom.xml>
to org.apache.deltaspike.modules/deltaspike-jpa-module-api/1.8.1-SNAPSHOT/deltaspike-jpa-module-api-1.8.1-SNAPSHOT.pom
[JENKINS] Archiving <https://builds.apache.org/job/DeltaSpike_Wildfly_9.0.2/ws/deltaspike/modules/proxy/impl-asm5/pom.xml>
to org.apache.deltaspike.modules/deltaspike-proxy-module-impl-asm5/1.8.1-SNAPSHOT/deltaspike-proxy-module-impl-asm5-1.8.1-SNAPSHOT.pom
[JENKINS] Archiving <https://builds.apache.org/job/DeltaSpike_Wildfly_9.0.2/ws/deltaspike/dist/bom/pom.xml>
to org.apache.deltaspike.distribution/distributions-bom/1.8.1-SNAPSHOT/distributions-bom-1.8.1-SNAPSHOT.pom
[JENKINS] Archiving <https://builds.apache.org/job/DeltaSpike_Wildfly_9.0.2/ws/deltaspike/modules/bean-validation/pom.xml>
to org.apache.deltaspike.modules/bean-validation-module-project/1.8.1-SNAPSHOT/bean-validation-module-project-1.8.1-SNAPSHOT.pom
[JENKINS] Archiving <https://builds.apache.org/job/DeltaSpike_Wildfly_9.0.2/ws/deltaspike/parent/code/pom.xml>
to org.apache.deltaspike/parent-code/1.8.1-SNAPSHOT/parent-code-1.8.1-SNAPSHOT.pom
[JENKINS] Archiving <https://builds.apache.org/job/DeltaSpike_Wildfly_9.0.2/ws/deltaspike/parent/code/target/parent-code-1.8.1-SNAPSHOT-tests.jar>
to org.apache.deltaspike/parent-code/1.8.1-SNAPSHOT/parent-code-1.8.1-SNAPSHOT-tests.jar
Compressed 102.91 KB of artifacts by 62.2% relative to #164
[JENKINS] Archiving <https://builds.apache.org/job/DeltaSpike_Wildfly_9.0.2/ws/deltaspike/modules/jpa/impl/pom.xml>
to org.apache.deltaspike.modules/deltaspike-jpa-module-impl/1.8.1-SNAPSHOT/deltaspike-jpa-module-impl-1.8.1-SNAPSHOT.pom
[JENKINS] Archiving <https://builds.apache.org/job/DeltaSpike_Wildfly_9.0.2/ws/deltaspike/modules/partial-bean/impl/pom.xml>
to org.apache.deltaspike.modules/deltaspike-partial-bean-module-impl/1.8.1-SNAPSHOT/deltaspike-partial-bean-module-impl-1.8.1-SNAPSHOT.pom
[JENKINS] Archiving <https://builds.apache.org/job/DeltaSpike_Wildfly_9.0.2/ws/deltaspike/modules/scheduler/api/pom.xml>
to org.apache.deltaspike.modules/deltaspike-scheduler-module-api/1.8.1-SNAPSHOT/deltaspike-scheduler-module-api-1.8.1-SNAPSHOT.pom
[JENKINS] Archiving <https://builds.apache.org/job/DeltaSpike_Wildfly_9.0.2/ws/deltaspike/modules/test-control/pom.xml>
to org.apache.deltaspike.modules/test-control-module-project/1.8.1-SNAPSHOT/test-control-module-project-1.8.1-SNAPSHOT.pom
[JENKINS] Archiving <https://builds.apache.org/job/DeltaSpike_Wildfly_9.0.2/ws/deltaspike/modules/scheduler/impl/pom.xml>
to org.apache.deltaspike.modules/deltaspike-scheduler-module-impl/1.8.1-SNAPSHOT/deltaspike-scheduler-module-impl-1.8.1-SNAPSHOT.pom
[JENKINS] Archiving <https://builds.apache.org/job/DeltaSpike_Wildfly_9.0.2/ws/deltaspike/examples/jsf-playground/pom.xml>
to org.apache.deltaspike.examples/deltaspike-jsf-playground/1.8.1-SNAPSHOT/deltaspike-jsf-playground-1.8.1-SNAPSHOT.pom
[JENKINS] Archiving <https://builds.apache.org/job/DeltaSpike_Wildfly_9.0.2/ws/deltaspike/modules/test-control/impl/pom.xml>
to org.apache.deltaspike.modules/deltaspike-test-control-module-impl/1.8.1-SNAPSHOT/deltaspike-test-control-module-impl-1.8.1-SNAPSHOT.pom
[JENKINS] Archiving <https://builds.apache.org/job/DeltaSpike_Wildfly_9.0.2/ws/deltaspike/checkstyle-rules/pom.xml>
to org.apache.deltaspike/checkstyle-rules/1.8.1-SNAPSHOT/checkstyle-rules-1.8.1-SNAPSHOT.pom
[JENKINS] Archiving <https://builds.apache.org/job/DeltaSpike_Wildfly_9.0.2/ws/deltaspike/checkstyle-rules/target/checkstyle-rules-1.8.1-SNAPSHOT.jar>
to org.apache.deltaspike/checkstyle-rules/1.8.1-SNAPSHOT/checkstyle-rules-1.8.1-SNAPSHOT.jar
[JENKINS] Archiving <https://builds.apache.org/job/DeltaSpike_Wildfly_9.0.2/ws/deltaspike/modules/proxy/api/pom.xml>
to org.apache.deltaspike.modules/deltaspike-proxy-module-api/1.8.1-SNAPSHOT/deltaspike-proxy-module-api-1.8.1-SNAPSHOT.pom
[JENKINS] Archiving <https://builds.apache.org/job/DeltaSpike_Wildfly_9.0.2/ws/deltaspike/modules/servlet/api/pom.xml>
to org.apache.deltaspike.modules/deltaspike-servlet-module-api/1.8.1-SNAPSHOT/deltaspike-servlet-module-api-1.8.1-SNAPSHOT.pom
[JENKINS] Archiving <https://builds.apache.org/job/DeltaSpike_Wildfly_9.0.2/ws/deltaspike/examples/data-examples/pom.xml>
to org.apache.deltaspike.examples/deltaspike-data-examples/1.8.1-SNAPSHOT/deltaspike-data-examples-1.8.1-SNAPSHOT.pom
[JENKINS] Archiving <https://builds.apache.org/job/DeltaSpike_Wildfly_9.0.2/ws/deltaspike/core/api/pom.xml>
to org.apache.deltaspike.core/deltaspike-core-api/1.8.1-SNAPSHOT/deltaspike-core-api-1.8.1-SNAPSHOT.pom
[JENKINS] Archiving <https://builds.apache.org/job/DeltaSpike_Wildfly_9.0.2/ws/deltaspike/core/api/target/deltaspike-core-api-1.8.1-SNAPSHOT.jar>
to org.apache.deltaspike.core/deltaspike-core-api/1.8.1-SNAPSHOT/deltaspike-core-api-1.8.1-SNAPSHOT.jar
[JENKINS] Archiving <https://builds.apache.org/job/DeltaSpike_Wildfly_9.0.2/ws/deltaspike/core/api/target/deltaspike-core-api-1.8.1-SNAPSHOT-tests.jar>
to org.apache.deltaspike.core/deltaspike-core-api/1.8.1-SNAPSHOT/deltaspike-core-api-1.8.1-SNAPSHOT-tests.jar
[JENKINS] Archiving <https://builds.apache.org/job/DeltaSpike_Wildfly_9.0.2/ws/deltaspike/core/api/target/deltaspike-core-api-1.8.1-SNAPSHOT-sources.jar>
to org.apache.deltaspike.core/deltaspike-core-api/1.8.1-SNAPSHOT/deltaspike-core-api-1.8.1-SNAPSHOT-sources.jar
[JENKINS] Archiving <https://builds.apache.org/job/DeltaSpike_Wildfly_9.0.2/ws/deltaspike/examples/security-requested-page-after-login-picketlink/pom.xml>
to org.apache.deltaspike.examples/deltaspike-security-requested-page-after-login-picketlink/1.8.1-SNAPSHOT/deltaspike-security-requested-page-after-login-picketlink-1.8.1-SNAPSHOT.pom
[JENKINS] Archiving <https://builds.apache.org/job/DeltaSpike_Wildfly_9.0.2/ws/deltaspike/modules/bean-validation/api/pom.xml>
to org.apache.deltaspike.modules/deltaspike-bean-validation-module-api/1.8.1-SNAPSHOT/deltaspike-bean-validation-module-api-1.8.1-SNAPSHOT.pom
[JENKINS] Archiving <https://builds.apache.org/job/DeltaSpike_Wildfly_9.0.2/ws/deltaspike/examples/scheduler-playground/pom.xml>
to org.apache.deltaspike.examples/deltaspike-scheduler-example/1.8.1-SNAPSHOT/deltaspike-scheduler-example-1.8.1-SNAPSHOT.pom
[JENKINS] Archiving <https://builds.apache.org/job/DeltaSpike_Wildfly_9.0.2/ws/deltaspike/modules/pom.xml>
to org.apache.deltaspike.modules/modules-project/1.8.1-SNAPSHOT/modules-project-1.8.1-SNAPSHOT.pom
[JENKINS] Archiving <https://builds.apache.org/job/DeltaSpike_Wildfly_9.0.2/ws/deltaspike/modules/scheduler/pom.xml>
to org.apache.deltaspike.modules/scheduler-module-project/1.8.1-SNAPSHOT/scheduler-module-project-1.8.1-SNAPSHOT.pom
[JENKINS] Archiving <https://builds.apache.org/job/DeltaSpike_Wildfly_9.0.2/ws/deltaspike/test-utils/pom.xml>
to org.apache.deltaspike.test/test-utils/1.8.1-SNAPSHOT/test-utils-1.8.1-SNAPSHOT.pom
[JENKINS] Archiving <https://builds.apache.org/job/DeltaSpike_Wildfly_9.0.2/ws/deltaspike/test-utils/target/test-utils-1.8.1-SNAPSHOT.jar>
to org.apache.deltaspike.test/test-utils/1.8.1-SNAPSHOT/test-utils-1.8.1-SNAPSHOT.jar
[JENKINS] Archiving <https://builds.apache.org/job/DeltaSpike_Wildfly_9.0.2/ws/deltaspike/test-utils/target/test-utils-1.8.1-SNAPSHOT-sources.jar>
to org.apache.deltaspike.test/test-utils/1.8.1-SNAPSHOT/test-utils-1.8.1-SNAPSHOT-sources.jar
[JENKINS] Archiving <https://builds.apache.org/job/DeltaSpike_Wildfly_9.0.2/ws/deltaspike/modules/security/pom.xml>
to org.apache.deltaspike.modules/security-module-project/1.8.1-SNAPSHOT/security-module-project-1.8.1-SNAPSHOT.pom
[JENKINS] Archiving <https://builds.apache.org/job/DeltaSpike_Wildfly_9.0.2/ws/deltaspike/modules/jsf/api/pom.xml>
to org.apache.deltaspike.modules/deltaspike-jsf-module-api/1.8.1-SNAPSHOT/deltaspike-jsf-module-api-1.8.1-SNAPSHOT.pom
[JENKINS] Archiving <https://builds.apache.org/job/DeltaSpike_Wildfly_9.0.2/ws/deltaspike/modules/data/pom.xml>
to org.apache.deltaspike.modules/data-module-project/1.8.1-SNAPSHOT/data-module-project-1.8.1-SNAPSHOT.pom
[JENKINS] Archiving <https://builds.apache.org/job/DeltaSpike_Wildfly_9.0.2/ws/deltaspike/modules/servlet/impl/pom.xml>
to org.apache.deltaspike.modules/deltaspike-servlet-module-impl/1.8.1-SNAPSHOT/deltaspike-servlet-module-impl-1.8.1-SNAPSHOT.pom
[JENKINS] Archiving <https://builds.apache.org/job/DeltaSpike_Wildfly_9.0.2/ws/deltaspike/modules/test-control/api/pom.xml>
to org.apache.deltaspike.modules/deltaspike-test-control-module-api/1.8.1-SNAPSHOT/deltaspike-test-control-module-api-1.8.1-SNAPSHOT.pom
[JENKINS] Archiving <https://builds.apache.org/job/DeltaSpike_Wildfly_9.0.2/ws/deltaspike/examples/jsf-examples/pom.xml>
to org.apache.deltaspike.examples/deltaspike-jsf-example/1.8.1-SNAPSHOT/deltaspike-jsf-example-1.8.1-SNAPSHOT.pom
[JENKINS] Archiving <https://builds.apache.org/job/DeltaSpike_Wildfly_9.0.2/ws/deltaspike/modules/jsf/impl-ee6/pom.xml>
to org.apache.deltaspike.modules/deltaspike-jsf-module-impl-ee6/1.8.1-SNAPSHOT/deltaspike-jsf-module-impl-ee6-1.8.1-SNAPSHOT.pom
[JENKINS] Archiving <https://builds.apache.org/job/DeltaSpike_Wildfly_9.0.2/ws/deltaspike/examples/security-requested-page-after-login-cdi/pom.xml>
to org.apache.deltaspike.examples/deltaspike-security-requested-page-after-login-cdi/1.8.1-SNAPSHOT/deltaspike-security-requested-page-after-login-cdi-1.8.1-SNAPSHOT.pom
[JENKINS] Archiving <https://builds.apache.org/job/DeltaSpike_Wildfly_9.0.2/ws/deltaspike/core/pom.xml>
to org.apache.deltaspike.core/core-project/1.8.1-SNAPSHOT/core-project-1.8.1-SNAPSHOT.pom
[JENKINS] Archiving <https://builds.apache.org/job/DeltaSpike_Wildfly_9.0.2/ws/deltaspike/core/target/core-project-1.8.1-SNAPSHOT-tests.jar>
to org.apache.deltaspike.core/core-project/1.8.1-SNAPSHOT/core-project-1.8.1-SNAPSHOT-tests.jar
[JENKINS] Archiving <https://builds.apache.org/job/DeltaSpike_Wildfly_9.0.2/ws/deltaspike/dist/full/pom.xml>
to org.apache.deltaspike.distribution/distribution-full/1.8.1-SNAPSHOT/distribution-full-1.8.1-SNAPSHOT.pom
[JENKINS] Archiving <https://builds.apache.org/job/DeltaSpike_Wildfly_9.0.2/ws/site/pom.xml>
to org.apache.deltaspike/deltaspike-site/1.8.1-SNAPSHOT/deltaspike-site-1.8.1-SNAPSHOT.pom
channel stopped

Mime
View raw message