deltaspike-commits mailing list archives

Site index · List index
Message view « Date » · « Thread »
Top « Date » · « Thread »
From Apache Jenkins Server <jenk...@builds.apache.org>
Subject Build failed in Jenkins: DeltaSpike_TomEE_7.0.3 #34
Date Tue, 09 May 2017 10:37:32 GMT
See <https://builds.apache.org/job/DeltaSpike_TomEE_7.0.3/34/display/redirect?page=changes>

Changes:

[struberg] more asserts to track down random failure

------------------------------------------
[...truncated 7.30 KB...]
[INFO] 
[INFO] --- maven-site-plugin:3.5.1:attach-descriptor (attach-descriptor) @ deltaspike-project
---
[INFO] 
[INFO] --- maven-install-plugin:2.5.2:install (default-install) @ deltaspike-project ---
[INFO] Installing <https://builds.apache.org/job/DeltaSpike_TomEE_7.0.3/ws/deltaspike/pom.xml>
to /home/jenkins/jenkins-slave/maven-repositories/0/org/apache/deltaspike/deltaspike-project/1.8.0-SNAPSHOT/deltaspike-project-1.8.0-SNAPSHOT.pom
[INFO]                                                                         
[INFO] ------------------------------------------------------------------------
[INFO] Building Apache DeltaSpike CheckStyle-rules 1.8.0-SNAPSHOT
[INFO] ------------------------------------------------------------------------
[INFO] 
[INFO] --- maven-clean-plugin:3.0.0:clean (default-clean) @ checkstyle-rules ---
[INFO] 
[INFO] --- maven-remote-resources-plugin:1.5:process (process-resource-bundles) @ checkstyle-rules
---
[INFO] 
[INFO] --- maven-resources-plugin:2.7:resources (default-resources) @ checkstyle-rules ---
[INFO] Using 'UTF-8' encoding to copy filtered resources.
[INFO] Copying 2 resources
[INFO] Copying 3 resources
[INFO] 
[INFO] --- maven-compiler-plugin:3.5.1:compile (default-compile) @ checkstyle-rules ---
[INFO] No sources to compile
[INFO] 
[INFO] --- maven-resources-plugin:2.7:testResources (default-testResources) @ checkstyle-rules
---
[INFO] Using 'UTF-8' encoding to copy filtered resources.
[INFO] skip non existing resourceDirectory <https://builds.apache.org/job/DeltaSpike_TomEE_7.0.3/ws/deltaspike/checkstyle-rules/src/test/resources>
[INFO] Copying 3 resources
[INFO] 
[INFO] --- maven-compiler-plugin:3.5.1:testCompile (default-testCompile) @ checkstyle-rules
---
[INFO] No sources to compile
[INFO] 
[INFO] --- maven-surefire-plugin:2.19.1:test (default-test) @ checkstyle-rules ---
[JENKINS] Recording test results
[INFO] 
[INFO] --- maven-jar-plugin:3.0.0:jar (default-jar) @ checkstyle-rules ---
[INFO] Building jar: <https://builds.apache.org/job/DeltaSpike_TomEE_7.0.3/ws/deltaspike/checkstyle-rules/target/checkstyle-rules-1.8.0-SNAPSHOT.jar>
[INFO] 
[INFO] --- maven-site-plugin:3.5.1:attach-descriptor (attach-descriptor) @ checkstyle-rules
---
[INFO] 
[INFO] --- maven-install-plugin:2.5.2:install (default-install) @ checkstyle-rules ---
[INFO] Installing <https://builds.apache.org/job/DeltaSpike_TomEE_7.0.3/ws/deltaspike/checkstyle-rules/target/checkstyle-rules-1.8.0-SNAPSHOT.jar>
to /home/jenkins/jenkins-slave/maven-repositories/0/org/apache/deltaspike/checkstyle-rules/1.8.0-SNAPSHOT/checkstyle-rules-1.8.0-SNAPSHOT.jar
[INFO] Installing <https://builds.apache.org/job/DeltaSpike_TomEE_7.0.3/ws/deltaspike/checkstyle-rules/pom.xml>
to /home/jenkins/jenkins-slave/maven-repositories/0/org/apache/deltaspike/checkstyle-rules/1.8.0-SNAPSHOT/checkstyle-rules-1.8.0-SNAPSHOT.pom
[INFO]                                                                         
[INFO] ------------------------------------------------------------------------
[INFO] Building Apache DeltaSpike Parent 1.8.0-SNAPSHOT
[INFO] ------------------------------------------------------------------------
[INFO] 
[INFO] --- maven-clean-plugin:3.0.0:clean (default-clean) @ parent ---
[INFO] 
[INFO] --- maven-bundle-plugin:2.3.7:cleanVersions (versions) @ parent ---
[INFO] 
[INFO] --- maven-antrun-plugin:1.8:run (javadoc.resources) @ parent ---
[WARNING] Parameter tasks is deprecated, use target instead
[INFO] Executing tasks

main:
[INFO] Executed tasks
[INFO] 
[INFO] --- maven-remote-resources-plugin:1.5:process (process-resource-bundles) @ parent ---
[INFO] 
[INFO] --- maven-site-plugin:3.5.1:attach-descriptor (attach-descriptor) @ parent ---
[INFO] 
[INFO] >>> maven-source-plugin:3.0.0:jar (attach-sources) > generate-sources @
parent >>>
[INFO] 
[INFO] --- maven-bundle-plugin:2.3.7:cleanVersions (versions) @ parent ---
[INFO] 
[INFO] --- maven-antrun-plugin:1.8:run (javadoc.resources) @ parent ---
[WARNING] Parameter tasks is deprecated, use target instead
[INFO] Executing tasks

main:
[INFO] Executed tasks
[WARNING] Failed to getClass for org.apache.maven.plugins.source.SourceJarMojo
[INFO] 
[INFO] <<< maven-source-plugin:3.0.0:jar (attach-sources) < generate-sources @
parent <<<
[INFO] 
[INFO] --- maven-source-plugin:3.0.0:jar (attach-sources) @ parent ---
[INFO] 
[INFO] --- maven-checkstyle-plugin:2.9.1:check (verify-style) @ parent ---
[INFO] Starting audit...
Audit done.

[INFO] 
[INFO] --- maven-install-plugin:2.5.2:install (default-install) @ parent ---
[INFO] Installing <https://builds.apache.org/job/DeltaSpike_TomEE_7.0.3/ws/deltaspike/parent/pom.xml>
to /home/jenkins/jenkins-slave/maven-repositories/0/org/apache/deltaspike/parent/1.8.0-SNAPSHOT/parent-1.8.0-SNAPSHOT.pom
[INFO]                                                                         
[INFO] ------------------------------------------------------------------------
[INFO] Building Apache DeltaSpike Test-Utils 1.8.0-SNAPSHOT
[INFO] ------------------------------------------------------------------------
[INFO] 
[INFO] --- maven-clean-plugin:3.0.0:clean (default-clean) @ test-utils ---
[INFO] 
[INFO] --- maven-bundle-plugin:2.3.7:cleanVersions (versions) @ test-utils ---
[INFO] 
[INFO] --- maven-antrun-plugin:1.8:run (javadoc.resources) @ test-utils ---
[WARNING] Parameter tasks is deprecated, use target instead
[INFO] Executing tasks

main:
[INFO] Executed tasks
[INFO] 
[INFO] --- maven-remote-resources-plugin:1.5:process (process-resource-bundles) @ test-utils
---
[INFO] 
[INFO] --- maven-resources-plugin:2.7:resources (default-resources) @ test-utils ---
[INFO] Using 'UTF-8' encoding to copy filtered resources.
[INFO] Copying 3 resources
[INFO] Copying 3 resources
[INFO] 
[INFO] --- maven-compiler-plugin:2.5:compile (default-compile) @ test-utils ---
[INFO] Compiling 13 source files to <https://builds.apache.org/job/DeltaSpike_TomEE_7.0.3/ws/deltaspike/test-utils/target/classes>
[INFO] ------------------------------------------------------------------------
[INFO] Reactor Summary:
[INFO] 
[INFO] Apache DeltaSpike .................................. SUCCESS [ 24.715 s]
[INFO] Apache DeltaSpike Sources .......................... SUCCESS [ 12.211 s]
[INFO] Apache DeltaSpike CheckStyle-rules ................. SUCCESS [ 26.949 s]
[INFO] Apache DeltaSpike Parent ........................... SUCCESS [ 16.811 s]
[INFO] Apache DeltaSpike Test-Utils ....................... FAILURE [ 13.870 s]
[INFO] Apache DeltaSpike Code Parent ...................... SKIPPED
[INFO] Apache DeltaSpike Core ............................. SKIPPED
[INFO] Apache DeltaSpike Core-API ......................... SKIPPED
[INFO] Apache DeltaSpike Core-Implementation .............. SKIPPED
[INFO] Apache DeltaSpike ContainerControl parent .......... SKIPPED
[INFO] Apache DeltaSpike CDI ContainerControl API ......... SKIPPED
[INFO] Apache DeltaSpike CDI ContainerControl TCK ......... SKIPPED
[INFO] Apache DeltaSpike CDI OpenEJB-ContainerControl ..... SKIPPED
[INFO] Apache DeltaSpike Modules .......................... SKIPPED
[INFO] Apache DeltaSpike Proxy-Module ..................... SKIPPED
[INFO] Apache DeltaSpike Proxy-Module API ................. SKIPPED
[INFO] Apache DeltaSpike Proxy-Module Impl ASM5 ........... SKIPPED
[INFO] Apache DeltaSpike Security-Module .................. SKIPPED
[INFO] Apache DeltaSpike Security-Module API .............. SKIPPED
[INFO] Apache DeltaSpike Security-Module Impl ............. SKIPPED
[INFO] Apache DeltaSpike JPA-Module ....................... SKIPPED
[INFO] Apache DeltaSpike JPA-Module API ................... SKIPPED
[INFO] Apache DeltaSpike JPA-Module Impl .................. SKIPPED
[INFO] Apache DeltaSpike Servlet-Module ................... SKIPPED
[INFO] Apache DeltaSpike Servlet-Module API ............... SKIPPED
[INFO] Apache DeltaSpike Servlet-Module Impl .............. SKIPPED
[INFO] Apache DeltaSpike JSF-Module ....................... SKIPPED
[INFO] Apache DeltaSpike JSF-Module API ................... SKIPPED
[INFO] Apache DeltaSpike JSF-Module Impl .................. SKIPPED
[INFO] Apache DeltaSpike JSF-Module Impl (EE6 only) ....... SKIPPED
[INFO] Apache DeltaSpike Partial-Bean-Module .............. SKIPPED
[INFO] Apache DeltaSpike Partial-Bean-Module API .......... SKIPPED
[INFO] Apache DeltaSpike Partial-Bean-Module Impl ......... SKIPPED
[INFO] Apache DeltaSpike BeanValidation-Module ............ SKIPPED
[INFO] Apache DeltaSpike BeanValidation-Module API ........ SKIPPED
[INFO] Apache DeltaSpike BeanValidation-Module Impl ....... SKIPPED
[INFO] Apache DeltaSpike Data-Module ...................... SKIPPED
[INFO] Apache DeltaSpike Data-Module API .................. SKIPPED
[INFO] Apache DeltaSpike Data-Module Impl ................. SKIPPED
[INFO] Apache DeltaSpike Data-Module Tests with Java 8 .... SKIPPED
[INFO] Apache DeltaSpike Scheduler-Module ................. SKIPPED
[INFO] Apache DeltaSpike Scheduler-Module API ............. SKIPPED
[INFO] Apache DeltaSpike Scheduler-Module Impl ............ SKIPPED
[INFO] Apache DeltaSpike Test-Control-Module .............. SKIPPED
[INFO] Apache DeltaSpike Test-Control-Module API .......... SKIPPED
[INFO] Apache DeltaSpike Test-Control-Module Impl ......... SKIPPED
[INFO] Apache DeltaSpike Examples ......................... SKIPPED
[INFO] Apache DeltaSpike Java-SE Examples ................. SKIPPED
[INFO] Apache DeltaSpike JSF Examples ..................... SKIPPED
[INFO] Apache DeltaSpike JSF Playground ................... SKIPPED
[INFO] Apache DeltaSpike Security Example CDI ............. SKIPPED
[INFO] Apache DeltaSpike Security Example PicketLink ...... SKIPPED
[INFO] Apache DeltaSpike Java-SE Scheduler Examples ....... SKIPPED
[INFO] Apache DeltaSpike JPA Examples ..................... SKIPPED
[INFO] Apache DeltaSpike Data Examples .................... SKIPPED
[INFO] Apache DeltaSpike Documentation .................... SKIPPED
[INFO] Apache DeltaSpike Site ............................. SKIPPED
[INFO] ------------------------------------------------------------------------
[INFO] BUILD FAILURE
[INFO] ------------------------------------------------------------------------
[INFO] Total time: 03:31 min
[INFO] Finished at: 2017-05-09T10:12:10+00:00
[INFO] Final Memory: 55M/696M
[INFO] ------------------------------------------------------------------------
Waiting for Jenkins to finish collecting data
[ERROR] Failed to execute goal org.apache.maven.plugins:maven-compiler-plugin:2.5:compile
(default-compile) on project test-utils: Fatal error compiling: tools.jar not found: /usr/lib/jvm/java-8-openjdk-amd64/jre/../lib/tools.jar
-> [Help 1]
[ERROR] 
[ERROR] To see the full stack trace of the errors, re-run Maven with the -e switch.
[ERROR] Re-run Maven using the -X switch to enable full debug logging.
[ERROR] 
[ERROR] For more information about the errors and possible solutions, please read the following
articles:
[ERROR] [Help 1] http://cwiki.apache.org/confluence/display/MAVEN/MojoExecutionException
[ERROR] 
[ERROR] After correcting the problems, you can resume the build with the command
[ERROR]   mvn <goals> -rf :test-utils
[JENKINS] Archiving <https://builds.apache.org/job/DeltaSpike_TomEE_7.0.3/ws/deltaspike/cdictrl/tck/pom.xml>
to org.apache.deltaspike.test/deltaspike-cdictrl-tck/1.8.0-SNAPSHOT/deltaspike-cdictrl-tck-1.8.0-SNAPSHOT.pom
[JENKINS] Archiving <https://builds.apache.org/job/DeltaSpike_TomEE_7.0.3/ws/deltaspike/modules/jsf/impl/pom.xml>
to org.apache.deltaspike.modules/deltaspike-jsf-module-impl/1.8.0-SNAPSHOT/deltaspike-jsf-module-impl-1.8.0-SNAPSHOT.pom
[JENKINS] Archiving <https://builds.apache.org/job/DeltaSpike_TomEE_7.0.3/ws/deltaspike/modules/data/impl/pom.xml>
to org.apache.deltaspike.modules/deltaspike-data-module-impl/1.8.0-SNAPSHOT/deltaspike-data-module-impl-1.8.0-SNAPSHOT.pom
[JENKINS] Archiving <https://builds.apache.org/job/DeltaSpike_TomEE_7.0.3/ws/deltaspike/modules/jsf/pom.xml>
to org.apache.deltaspike.modules/jsf-module-project/1.8.0-SNAPSHOT/jsf-module-project-1.8.0-SNAPSHOT.pom
[JENKINS] Archiving <https://builds.apache.org/job/DeltaSpike_TomEE_7.0.3/ws/deltaspike/modules/bean-validation/impl/pom.xml>
to org.apache.deltaspike.modules/deltaspike-bean-validation-module-impl/1.8.0-SNAPSHOT/deltaspike-bean-validation-module-impl-1.8.0-SNAPSHOT.pom
[JENKINS] Archiving <https://builds.apache.org/job/DeltaSpike_TomEE_7.0.3/ws/deltaspike/examples/jpa-examples/pom.xml>
to org.apache.deltaspike.examples/deltaspike-jpa-examples/1.8.0-SNAPSHOT/deltaspike-jpa-examples-1.8.0-SNAPSHOT.pom
[JENKINS] Archiving <https://builds.apache.org/job/DeltaSpike_TomEE_7.0.3/ws/deltaspike/cdictrl/pom.xml>
to org.apache.deltaspike.cdictrl/cdictrl-project/1.8.0-SNAPSHOT/cdictrl-project-1.8.0-SNAPSHOT.pom
[JENKINS] Archiving <https://builds.apache.org/job/DeltaSpike_TomEE_7.0.3/ws/deltaspike/modules/partial-bean/api/pom.xml>
to org.apache.deltaspike.modules/deltaspike-partial-bean-module-api/1.8.0-SNAPSHOT/deltaspike-partial-bean-module-api-1.8.0-SNAPSHOT.pom
[JENKINS] Archiving <https://builds.apache.org/job/DeltaSpike_TomEE_7.0.3/ws/deltaspike/cdictrl/api/pom.xml>
to org.apache.deltaspike.cdictrl/deltaspike-cdictrl-api/1.8.0-SNAPSHOT/deltaspike-cdictrl-api-1.8.0-SNAPSHOT.pom
[JENKINS] Archiving <https://builds.apache.org/job/DeltaSpike_TomEE_7.0.3/ws/deltaspike/modules/security/api/pom.xml>
to org.apache.deltaspike.modules/deltaspike-security-module-api/1.8.0-SNAPSHOT/deltaspike-security-module-api-1.8.0-SNAPSHOT.pom
[JENKINS] Archiving <https://builds.apache.org/job/DeltaSpike_TomEE_7.0.3/ws/deltaspike/modules/data/api/pom.xml>
to org.apache.deltaspike.modules/deltaspike-data-module-api/1.8.0-SNAPSHOT/deltaspike-data-module-api-1.8.0-SNAPSHOT.pom
[JENKINS] Archiving <https://builds.apache.org/job/DeltaSpike_TomEE_7.0.3/ws/documentation/pom.xml>
to org.apache.deltaspike/deltaspike-documentation/1.8.0-SNAPSHOT/deltaspike-documentation-1.8.0-SNAPSHOT.pom
[JENKINS] Archiving <https://builds.apache.org/job/DeltaSpike_TomEE_7.0.3/ws/deltaspike/examples/jse-examples/pom.xml>
to org.apache.deltaspike.examples/deltaspike-jse-example/1.8.0-SNAPSHOT/deltaspike-jse-example-1.8.0-SNAPSHOT.pom
[JENKINS] Archiving <https://builds.apache.org/job/DeltaSpike_TomEE_7.0.3/ws/deltaspike/modules/data/test-java8/pom.xml>
to org.apache.deltaspike.modules/deltaspike-data-module-test-java8/1.8.0-SNAPSHOT/deltaspike-data-module-test-java8-1.8.0-SNAPSHOT.pom
No prior successful build to compare, so performing full copy of artifacts
[JENKINS] Archiving <https://builds.apache.org/job/DeltaSpike_TomEE_7.0.3/ws/deltaspike/examples/pom.xml>
to org.apache.deltaspike.examples/examples-project/1.8.0-SNAPSHOT/examples-project-1.8.0-SNAPSHOT.pom
[JENKINS] Archiving <https://builds.apache.org/job/DeltaSpike_TomEE_7.0.3/ws/deltaspike/modules/jpa/pom.xml>
to org.apache.deltaspike.modules/jpa-module-project/1.8.0-SNAPSHOT/jpa-module-project-1.8.0-SNAPSHOT.pom
[JENKINS] Archiving <https://builds.apache.org/job/DeltaSpike_TomEE_7.0.3/ws/deltaspike/modules/servlet/pom.xml>
to org.apache.deltaspike.modules/servlet-module-project/1.8.0-SNAPSHOT/servlet-module-project-1.8.0-SNAPSHOT.pom
[JENKINS] Archiving <https://builds.apache.org/job/DeltaSpike_TomEE_7.0.3/ws/deltaspike/pom.xml>
to org.apache.deltaspike/deltaspike-project/1.8.0-SNAPSHOT/deltaspike-project-1.8.0-SNAPSHOT.pom
[JENKINS] Archiving <https://builds.apache.org/job/DeltaSpike_TomEE_7.0.3/ws/pom.xml>
to org.apache.deltaspike/deltaspike/1.8.0-SNAPSHOT/deltaspike-1.8.0-SNAPSHOT.pom
[JENKINS] Archiving <https://builds.apache.org/job/DeltaSpike_TomEE_7.0.3/ws/deltaspike/core/impl/pom.xml>
to org.apache.deltaspike.core/deltaspike-core-impl/1.8.0-SNAPSHOT/deltaspike-core-impl-1.8.0-SNAPSHOT.pom
[JENKINS] Archiving <https://builds.apache.org/job/DeltaSpike_TomEE_7.0.3/ws/deltaspike/modules/partial-bean/pom.xml>
to org.apache.deltaspike.modules/partial-bean-module-project/1.8.0-SNAPSHOT/partial-bean-module-project-1.8.0-SNAPSHOT.pom
[JENKINS] Archiving <https://builds.apache.org/job/DeltaSpike_TomEE_7.0.3/ws/deltaspike/modules/proxy/pom.xml>
to org.apache.deltaspike.modules/proxy-module-project/1.8.0-SNAPSHOT/proxy-module-project-1.8.0-SNAPSHOT.pom
[JENKINS] Archiving <https://builds.apache.org/job/DeltaSpike_TomEE_7.0.3/ws/deltaspike/parent/pom.xml>
to org.apache.deltaspike/parent/1.8.0-SNAPSHOT/parent-1.8.0-SNAPSHOT.pom
Compressed 40.41 KB of artifacts by 79.2% relative to #33
[JENKINS] Archiving <https://builds.apache.org/job/DeltaSpike_TomEE_7.0.3/ws/deltaspike/modules/security/impl/pom.xml>
to org.apache.deltaspike.modules/deltaspike-security-module-impl/1.8.0-SNAPSHOT/deltaspike-security-module-impl-1.8.0-SNAPSHOT.pom
[JENKINS] Archiving <https://builds.apache.org/job/DeltaSpike_TomEE_7.0.3/ws/deltaspike/modules/jpa/api/pom.xml>
to org.apache.deltaspike.modules/deltaspike-jpa-module-api/1.8.0-SNAPSHOT/deltaspike-jpa-module-api-1.8.0-SNAPSHOT.pom
[JENKINS] Archiving <https://builds.apache.org/job/DeltaSpike_TomEE_7.0.3/ws/deltaspike/modules/proxy/impl-asm5/pom.xml>
to org.apache.deltaspike.modules/deltaspike-proxy-module-impl-asm5/1.8.0-SNAPSHOT/deltaspike-proxy-module-impl-asm5-1.8.0-SNAPSHOT.pom
[JENKINS] Archiving <https://builds.apache.org/job/DeltaSpike_TomEE_7.0.3/ws/deltaspike/modules/bean-validation/pom.xml>
to org.apache.deltaspike.modules/bean-validation-module-project/1.8.0-SNAPSHOT/bean-validation-module-project-1.8.0-SNAPSHOT.pom
[JENKINS] Archiving <https://builds.apache.org/job/DeltaSpike_TomEE_7.0.3/ws/deltaspike/parent/code/pom.xml>
to org.apache.deltaspike/parent-code/1.8.0-SNAPSHOT/parent-code-1.8.0-SNAPSHOT.pom
Compressed 90.75 KB of artifacts by 70.5% relative to #29
[JENKINS] Archiving <https://builds.apache.org/job/DeltaSpike_TomEE_7.0.3/ws/deltaspike/modules/jpa/impl/pom.xml>
to org.apache.deltaspike.modules/deltaspike-jpa-module-impl/1.8.0-SNAPSHOT/deltaspike-jpa-module-impl-1.8.0-SNAPSHOT.pom
[JENKINS] Archiving <https://builds.apache.org/job/DeltaSpike_TomEE_7.0.3/ws/deltaspike/modules/partial-bean/impl/pom.xml>
to org.apache.deltaspike.modules/deltaspike-partial-bean-module-impl/1.8.0-SNAPSHOT/deltaspike-partial-bean-module-impl-1.8.0-SNAPSHOT.pom
[JENKINS] Archiving <https://builds.apache.org/job/DeltaSpike_TomEE_7.0.3/ws/deltaspike/modules/scheduler/api/pom.xml>
to org.apache.deltaspike.modules/deltaspike-scheduler-module-api/1.8.0-SNAPSHOT/deltaspike-scheduler-module-api-1.8.0-SNAPSHOT.pom
[JENKINS] Archiving <https://builds.apache.org/job/DeltaSpike_TomEE_7.0.3/ws/deltaspike/modules/test-control/pom.xml>
to org.apache.deltaspike.modules/test-control-module-project/1.8.0-SNAPSHOT/test-control-module-project-1.8.0-SNAPSHOT.pom
[JENKINS] Archiving <https://builds.apache.org/job/DeltaSpike_TomEE_7.0.3/ws/deltaspike/modules/scheduler/impl/pom.xml>
to org.apache.deltaspike.modules/deltaspike-scheduler-module-impl/1.8.0-SNAPSHOT/deltaspike-scheduler-module-impl-1.8.0-SNAPSHOT.pom
[JENKINS] Archiving <https://builds.apache.org/job/DeltaSpike_TomEE_7.0.3/ws/deltaspike/examples/jsf-playground/pom.xml>
to org.apache.deltaspike.examples/deltaspike-jsf-playground/1.8.0-SNAPSHOT/deltaspike-jsf-playground-1.8.0-SNAPSHOT.pom
[JENKINS] Archiving <https://builds.apache.org/job/DeltaSpike_TomEE_7.0.3/ws/deltaspike/modules/test-control/impl/pom.xml>
to org.apache.deltaspike.modules/deltaspike-test-control-module-impl/1.8.0-SNAPSHOT/deltaspike-test-control-module-impl-1.8.0-SNAPSHOT.pom
[JENKINS] Archiving <https://builds.apache.org/job/DeltaSpike_TomEE_7.0.3/ws/deltaspike/checkstyle-rules/pom.xml>
to org.apache.deltaspike/checkstyle-rules/1.8.0-SNAPSHOT/checkstyle-rules-1.8.0-SNAPSHOT.pom
[JENKINS] Archiving <https://builds.apache.org/job/DeltaSpike_TomEE_7.0.3/ws/deltaspike/checkstyle-rules/target/checkstyle-rules-1.8.0-SNAPSHOT.jar>
to org.apache.deltaspike/checkstyle-rules/1.8.0-SNAPSHOT/checkstyle-rules-1.8.0-SNAPSHOT.jar
[JENKINS] Archiving <https://builds.apache.org/job/DeltaSpike_TomEE_7.0.3/ws/deltaspike/modules/proxy/api/pom.xml>
to org.apache.deltaspike.modules/deltaspike-proxy-module-api/1.8.0-SNAPSHOT/deltaspike-proxy-module-api-1.8.0-SNAPSHOT.pom
[JENKINS] Archiving <https://builds.apache.org/job/DeltaSpike_TomEE_7.0.3/ws/deltaspike/modules/servlet/api/pom.xml>
to org.apache.deltaspike.modules/deltaspike-servlet-module-api/1.8.0-SNAPSHOT/deltaspike-servlet-module-api-1.8.0-SNAPSHOT.pom
[JENKINS] Archiving <https://builds.apache.org/job/DeltaSpike_TomEE_7.0.3/ws/deltaspike/examples/data-examples/pom.xml>
to org.apache.deltaspike.examples/deltaspike-data-examples/1.8.0-SNAPSHOT/deltaspike-data-examples-1.8.0-SNAPSHOT.pom
[JENKINS] Archiving <https://builds.apache.org/job/DeltaSpike_TomEE_7.0.3/ws/deltaspike/core/api/pom.xml>
to org.apache.deltaspike.core/deltaspike-core-api/1.8.0-SNAPSHOT/deltaspike-core-api-1.8.0-SNAPSHOT.pom
[JENKINS] Archiving <https://builds.apache.org/job/DeltaSpike_TomEE_7.0.3/ws/deltaspike/examples/security-requested-page-after-login-picketlink/pom.xml>
to org.apache.deltaspike.examples/deltaspike-security-requested-page-after-login-picketlink/1.8.0-SNAPSHOT/deltaspike-security-requested-page-after-login-picketlink-1.8.0-SNAPSHOT.pom
[JENKINS] Archiving <https://builds.apache.org/job/DeltaSpike_TomEE_7.0.3/ws/deltaspike/modules/bean-validation/api/pom.xml>
to org.apache.deltaspike.modules/deltaspike-bean-validation-module-api/1.8.0-SNAPSHOT/deltaspike-bean-validation-module-api-1.8.0-SNAPSHOT.pom
[JENKINS] Archiving <https://builds.apache.org/job/DeltaSpike_TomEE_7.0.3/ws/deltaspike/examples/scheduler-playground/pom.xml>
to org.apache.deltaspike.examples/deltaspike-scheduler-example/1.8.0-SNAPSHOT/deltaspike-scheduler-example-1.8.0-SNAPSHOT.pom
[JENKINS] Archiving <https://builds.apache.org/job/DeltaSpike_TomEE_7.0.3/ws/deltaspike/modules/pom.xml>
to org.apache.deltaspike.modules/modules-project/1.8.0-SNAPSHOT/modules-project-1.8.0-SNAPSHOT.pom
[JENKINS] Archiving <https://builds.apache.org/job/DeltaSpike_TomEE_7.0.3/ws/deltaspike/modules/scheduler/pom.xml>
to org.apache.deltaspike.modules/scheduler-module-project/1.8.0-SNAPSHOT/scheduler-module-project-1.8.0-SNAPSHOT.pom
[JENKINS] Archiving <https://builds.apache.org/job/DeltaSpike_TomEE_7.0.3/ws/deltaspike/test-utils/pom.xml>
to org.apache.deltaspike.test/test-utils/1.8.0-SNAPSHOT/test-utils-1.8.0-SNAPSHOT.pom
[JENKINS] Archiving <https://builds.apache.org/job/DeltaSpike_TomEE_7.0.3/ws/deltaspike/modules/security/pom.xml>
to org.apache.deltaspike.modules/security-module-project/1.8.0-SNAPSHOT/security-module-project-1.8.0-SNAPSHOT.pom
[JENKINS] Archiving <https://builds.apache.org/job/DeltaSpike_TomEE_7.0.3/ws/deltaspike/modules/jsf/api/pom.xml>
to org.apache.deltaspike.modules/deltaspike-jsf-module-api/1.8.0-SNAPSHOT/deltaspike-jsf-module-api-1.8.0-SNAPSHOT.pom
[JENKINS] Archiving <https://builds.apache.org/job/DeltaSpike_TomEE_7.0.3/ws/deltaspike/modules/data/pom.xml>
to org.apache.deltaspike.modules/data-module-project/1.8.0-SNAPSHOT/data-module-project-1.8.0-SNAPSHOT.pom
[JENKINS] Archiving <https://builds.apache.org/job/DeltaSpike_TomEE_7.0.3/ws/deltaspike/modules/servlet/impl/pom.xml>
to org.apache.deltaspike.modules/deltaspike-servlet-module-impl/1.8.0-SNAPSHOT/deltaspike-servlet-module-impl-1.8.0-SNAPSHOT.pom
[JENKINS] Archiving <https://builds.apache.org/job/DeltaSpike_TomEE_7.0.3/ws/deltaspike/modules/test-control/api/pom.xml>
to org.apache.deltaspike.modules/deltaspike-test-control-module-api/1.8.0-SNAPSHOT/deltaspike-test-control-module-api-1.8.0-SNAPSHOT.pom
[JENKINS] Archiving <https://builds.apache.org/job/DeltaSpike_TomEE_7.0.3/ws/deltaspike/cdictrl/impl-openejb/pom.xml>
to org.apache.deltaspike.cdictrl/deltaspike-cdictrl-openejb/1.8.0-SNAPSHOT/deltaspike-cdictrl-openejb-1.8.0-SNAPSHOT.pom
[JENKINS] Archiving <https://builds.apache.org/job/DeltaSpike_TomEE_7.0.3/ws/deltaspike/examples/jsf-examples/pom.xml>
to org.apache.deltaspike.examples/deltaspike-jsf-example/1.8.0-SNAPSHOT/deltaspike-jsf-example-1.8.0-SNAPSHOT.pom
[JENKINS] Archiving <https://builds.apache.org/job/DeltaSpike_TomEE_7.0.3/ws/deltaspike/modules/jsf/impl-ee6/pom.xml>
to org.apache.deltaspike.modules/deltaspike-jsf-module-impl-ee6/1.8.0-SNAPSHOT/deltaspike-jsf-module-impl-ee6-1.8.0-SNAPSHOT.pom
[JENKINS] Archiving <https://builds.apache.org/job/DeltaSpike_TomEE_7.0.3/ws/deltaspike/examples/security-requested-page-after-login-cdi/pom.xml>
to org.apache.deltaspike.examples/deltaspike-security-requested-page-after-login-cdi/1.8.0-SNAPSHOT/deltaspike-security-requested-page-after-login-cdi-1.8.0-SNAPSHOT.pom
[JENKINS] Archiving <https://builds.apache.org/job/DeltaSpike_TomEE_7.0.3/ws/deltaspike/core/pom.xml>
to org.apache.deltaspike.core/core-project/1.8.0-SNAPSHOT/core-project-1.8.0-SNAPSHOT.pom
[JENKINS] Archiving <https://builds.apache.org/job/DeltaSpike_TomEE_7.0.3/ws/site/pom.xml>
to org.apache.deltaspike/deltaspike-site/1.8.0-SNAPSHOT/deltaspike-site-1.8.0-SNAPSHOT.pom
channel stopped

Mime
View raw message