deltaspike-commits mailing list archives

Site index · List index
Message view « Date » · « Thread »
Top « Date » · « Thread »
From Apache Jenkins Server <jenk...@builds.apache.org>
Subject Build failed in Jenkins: DeltaSpike Weld 2.3.5 #38
Date Sun, 28 May 2017 11:38:34 GMT
See <https://builds.apache.org/job/DeltaSpike%20Weld%202.3.5/38/display/redirect?page=changes>

Changes:

[struberg] further release fixes

[struberg] clean up superfluous stuff in our poms

------------------------------------------
[...truncated 285.73 KB...]
main:
[INFO] Executed tasks
[WARNING] Failed to getClass for org.apache.maven.plugins.source.SourceJarMojo
[INFO] 
[INFO] <<< maven-source-plugin:3.0.0:jar (attach-sources) < generate-sources @
deltaspike-cdictrl-api <<<
[INFO] 
[INFO] --- maven-source-plugin:3.0.0:jar (attach-sources) @ deltaspike-cdictrl-api ---
[INFO] Building jar: <https://builds.apache.org/job/DeltaSpike%20Weld%202.3.5/ws/deltaspike/cdictrl/api/target/deltaspike-cdictrl-api-1.8.0-SNAPSHOT-sources.jar>
[INFO] 
[INFO] --- maven-checkstyle-plugin:2.9.1:check (verify-style) @ deltaspike-cdictrl-api ---
[INFO] Starting audit...
Audit done.

[INFO] 
[INFO] --- maven-install-plugin:2.5.2:install (default-install) @ deltaspike-cdictrl-api ---
[INFO] Installing <https://builds.apache.org/job/DeltaSpike%20Weld%202.3.5/ws/deltaspike/cdictrl/api/target/deltaspike-cdictrl-api-1.8.0-SNAPSHOT.jar>
to /home/jenkins/jenkins-slave/maven-repositories/1/org/apache/deltaspike/cdictrl/deltaspike-cdictrl-api/1.8.0-SNAPSHOT/deltaspike-cdictrl-api-1.8.0-SNAPSHOT.jar
[INFO] Installing <https://builds.apache.org/job/DeltaSpike%20Weld%202.3.5/ws/deltaspike/cdictrl/api/pom.xml>
to /home/jenkins/jenkins-slave/maven-repositories/1/org/apache/deltaspike/cdictrl/deltaspike-cdictrl-api/1.8.0-SNAPSHOT/deltaspike-cdictrl-api-1.8.0-SNAPSHOT.pom
[INFO] Installing <https://builds.apache.org/job/DeltaSpike%20Weld%202.3.5/ws/deltaspike/cdictrl/api/target/deltaspike-cdictrl-api-1.8.0-SNAPSHOT-tests.jar>
to /home/jenkins/jenkins-slave/maven-repositories/1/org/apache/deltaspike/cdictrl/deltaspike-cdictrl-api/1.8.0-SNAPSHOT/deltaspike-cdictrl-api-1.8.0-SNAPSHOT-tests.jar
[INFO] Installing <https://builds.apache.org/job/DeltaSpike%20Weld%202.3.5/ws/deltaspike/cdictrl/api/target/deltaspike-cdictrl-api-1.8.0-SNAPSHOT-sources.jar>
to /home/jenkins/jenkins-slave/maven-repositories/1/org/apache/deltaspike/cdictrl/deltaspike-cdictrl-api/1.8.0-SNAPSHOT/deltaspike-cdictrl-api-1.8.0-SNAPSHOT-sources.jar
[INFO]                                                                         
[INFO] ------------------------------------------------------------------------
[INFO] Building Apache DeltaSpike CDI Weld-ContainerControl 1.8.0-SNAPSHOT
[INFO] ------------------------------------------------------------------------
[INFO] 
[INFO] --- maven-clean-plugin:3.0.0:clean (default-clean) @ deltaspike-cdictrl-weld ---
[INFO] Deleting <https://builds.apache.org/job/DeltaSpike%20Weld%202.3.5/ws/deltaspike/cdictrl/impl-weld/target>
[INFO] 
[INFO] --- maven-bundle-plugin:2.3.7:cleanVersions (versions) @ deltaspike-cdictrl-weld ---
[INFO] 
[INFO] --- maven-antrun-plugin:1.8:run (javadoc.resources) @ deltaspike-cdictrl-weld ---
[WARNING] Parameter tasks is deprecated, use target instead
[INFO] Executing tasks

main:
[INFO] Executed tasks
[INFO] 
[INFO] --- maven-remote-resources-plugin:1.5:process (process-resource-bundles) @ deltaspike-cdictrl-weld
---
[INFO] 
[INFO] --- maven-resources-plugin:2.7:resources (default-resources) @ deltaspike-cdictrl-weld
---
[INFO] Using 'UTF-8' encoding to copy filtered resources.
[INFO] Copying 2 resources
[INFO] Copying 3 resources
[INFO] 
[INFO] --- maven-compiler-plugin:2.5:compile (default-compile) @ deltaspike-cdictrl-weld ---
[INFO] Compiling 2 source files to <https://builds.apache.org/job/DeltaSpike%20Weld%202.3.5/ws/deltaspike/cdictrl/impl-weld/target/classes>
[INFO] 
[INFO] --- maven-resources-plugin:2.7:testResources (default-testResources) @ deltaspike-cdictrl-weld
---
[INFO] Using 'UTF-8' encoding to copy filtered resources.
[INFO] skip non existing resourceDirectory <https://builds.apache.org/job/DeltaSpike%20Weld%202.3.5/ws/deltaspike/cdictrl/impl-weld/src/test/resources>
[INFO] Copying 3 resources
[INFO] 
[INFO] --- maven-compiler-plugin:2.5:testCompile (default-testCompile) @ deltaspike-cdictrl-weld
---
[INFO] No sources to compile
[INFO] 
[INFO] --- maven-dependency-plugin:2.4:unpack (unpack) @ deltaspike-cdictrl-weld ---
[INFO] Configured Artifact: org.apache.deltaspike.test:deltaspike-cdictrl-tck:1.8.0-SNAPSHOT:jar
[INFO] Unpacking /home/jenkins/jenkins-slave/maven-repositories/1/org/apache/deltaspike/test/deltaspike-cdictrl-tck/1.8.0-SNAPSHOT/deltaspike-cdictrl-tck-1.8.0-SNAPSHOT.jar
to <https://builds.apache.org/job/DeltaSpike%20Weld%202.3.5/ws/deltaspike/cdictrl/impl-weld/target/test-classes>
with includes "" and excludes ""
[INFO] 
[INFO] --- maven-surefire-plugin:2.19.1:test (default-test) @ deltaspike-cdictrl-weld ---

-------------------------------------------------------
 T E S T S
-------------------------------------------------------

Results :

Tests run: 0, Failures: 0, Errors: 0, Skipped: 0

[JENKINS] Recording test results
[INFO] ------------------------------------------------------------------------
[INFO] Reactor Summary:
[INFO] 
[INFO] Apache DeltaSpike .................................. SUCCESS [  8.372 s]
[INFO] Apache DeltaSpike Sources .......................... SUCCESS [  3.825 s]
[INFO] Apache DeltaSpike CheckStyle-rules ................. SUCCESS [  7.368 s]
[INFO] Apache DeltaSpike Parent ........................... SUCCESS [ 12.393 s]
[INFO] Apache DeltaSpike Test-Utils ....................... SUCCESS [ 11.109 s]
[INFO] Apache DeltaSpike Code Parent ...................... SUCCESS [ 10.478 s]
[INFO] Apache DeltaSpike Core ............................. SUCCESS [ 10.554 s]
[INFO] Apache DeltaSpike Core-API ......................... SUCCESS [ 24.228 s]
[INFO] Apache DeltaSpike Core-Implementation .............. SUCCESS [01:06 min]
[INFO] Apache DeltaSpike ContainerControl parent .......... SUCCESS [ 18.825 s]
[INFO] Apache DeltaSpike CDI ContainerControl API ......... SUCCESS [ 19.222 s]
[INFO] Apache DeltaSpike CDI Weld-ContainerControl ........ FAILURE [ 15.704 s]
[INFO] Apache DeltaSpike CDI Servlet-ContainerControl ..... SKIPPED
[INFO] Apache DeltaSpike CDI ContainerControl TCK ......... SKIPPED
[INFO] Apache DeltaSpike Modules .......................... SKIPPED
[INFO] Apache DeltaSpike Proxy-Module ..................... SKIPPED
[INFO] Apache DeltaSpike Proxy-Module API ................. SKIPPED
[INFO] Apache DeltaSpike Proxy-Module Impl ASM5 ........... SKIPPED
[INFO] Apache DeltaSpike Security-Module .................. SKIPPED
[INFO] Apache DeltaSpike Security-Module API .............. SKIPPED
[INFO] Apache DeltaSpike Security-Module Impl ............. SKIPPED
[INFO] Apache DeltaSpike JPA-Module ....................... SKIPPED
[INFO] Apache DeltaSpike JPA-Module API ................... SKIPPED
[INFO] Apache DeltaSpike JPA-Module Impl .................. SKIPPED
[INFO] Apache DeltaSpike Servlet-Module ................... SKIPPED
[INFO] Apache DeltaSpike Servlet-Module API ............... SKIPPED
[INFO] Apache DeltaSpike Servlet-Module Impl .............. SKIPPED
[INFO] Apache DeltaSpike JSF-Module ....................... SKIPPED
[INFO] Apache DeltaSpike JSF-Module API ................... SKIPPED
[INFO] Apache DeltaSpike JSF-Module Impl .................. SKIPPED
[INFO] Apache DeltaSpike JSF-Module Impl (EE6 only) ....... SKIPPED
[INFO] Apache DeltaSpike Partial-Bean-Module .............. SKIPPED
[INFO] Apache DeltaSpike Partial-Bean-Module API .......... SKIPPED
[INFO] Apache DeltaSpike Partial-Bean-Module Impl ......... SKIPPED
[INFO] Apache DeltaSpike BeanValidation-Module ............ SKIPPED
[INFO] Apache DeltaSpike BeanValidation-Module API ........ SKIPPED
[INFO] Apache DeltaSpike BeanValidation-Module Impl ....... SKIPPED
[INFO] Apache DeltaSpike Data-Module ...................... SKIPPED
[INFO] Apache DeltaSpike Data-Module API .................. SKIPPED
[INFO] Apache DeltaSpike Data-Module Impl ................. SKIPPED
[INFO] Apache DeltaSpike Scheduler-Module ................. SKIPPED
[INFO] Apache DeltaSpike Scheduler-Module API ............. SKIPPED
[INFO] Apache DeltaSpike Scheduler-Module Impl ............ SKIPPED
[INFO] Apache DeltaSpike Test-Control-Module .............. SKIPPED
[INFO] Apache DeltaSpike Test-Control-Module API .......... SKIPPED
[INFO] Apache DeltaSpike Test-Control-Module Impl ......... SKIPPED
[INFO] Apache DeltaSpike Examples ......................... SKIPPED
[INFO] Apache DeltaSpike Java-SE Examples ................. SKIPPED
[INFO] Apache DeltaSpike JSF Examples ..................... SKIPPED
[INFO] Apache DeltaSpike JSF Playground ................... SKIPPED
[INFO] Apache DeltaSpike Security Example CDI ............. SKIPPED
[INFO] Apache DeltaSpike Security Example PicketLink ...... SKIPPED
[INFO] Apache DeltaSpike Java-SE Scheduler Examples ....... SKIPPED
[INFO] Apache DeltaSpike JPA Examples ..................... SKIPPED
[INFO] Apache DeltaSpike Data Examples .................... SKIPPED
[INFO] Apache DeltaSpike Distribution ..................... SKIPPED
[INFO] Apache DeltaSpike Distribution Bill of Materials ... SKIPPED
[INFO] Apache DeltaSpike Full Distribution ................ SKIPPED
[INFO] Apache DeltaSpike Documentation .................... SKIPPED
[INFO] Apache DeltaSpike Site ............................. SKIPPED
[INFO] ------------------------------------------------------------------------
[INFO] BUILD FAILURE
[INFO] ------------------------------------------------------------------------
[INFO] Total time: 05:24 min
[INFO] Finished at: 2017-05-28T11:16:59+00:00
[INFO] Final Memory: 78M/819M
[INFO] ------------------------------------------------------------------------
Waiting for Jenkins to finish collecting data
[ERROR] Failed to execute goal org.apache.maven.plugins:maven-surefire-plugin:2.19.1:test
(default-test) on project deltaspike-cdictrl-weld: Execution default-test of goal org.apache.maven.plugins:maven-surefire-plugin:2.19.1:test
failed: There was an error in the forked process
[ERROR] java.lang.UnsupportedClassVersionError: org/apache/deltaspike/cdise/tck/ContainerCtrlTckTest
: Unsupported major.minor version 52.0
[ERROR] at java.lang.ClassLoader.defineClass1(Native Method)
[ERROR] at java.lang.ClassLoader.defineClass(ClassLoader.java:800)
[ERROR] at java.security.SecureClassLoader.defineClass(SecureClassLoader.java:142)
[ERROR] at java.net.URLClassLoader.defineClass(URLClassLoader.java:449)
[ERROR] at java.net.URLClassLoader.access$100(URLClassLoader.java:71)
[ERROR] at java.net.URLClassLoader$1.run(URLClassLoader.java:361)
[ERROR] at java.net.URLClassLoader$1.run(URLClassLoader.java:355)
[ERROR] at java.security.AccessController.doPrivileged(Native Method)
[ERROR] at java.net.URLClassLoader.findClass(URLClassLoader.java:354)
[ERROR] at java.lang.ClassLoader.loadClass(ClassLoader.java:425)
[ERROR] at sun.misc.Launcher$AppClassLoader.loadClass(Launcher.java:308)
[ERROR] at java.lang.ClassLoader.loadClass(ClassLoader.java:358)
[ERROR] at org.apache.maven.surefire.util.DefaultScanResult.loadClass(DefaultScanResult.java:131)
[ERROR] at org.apache.maven.surefire.util.DefaultScanResult.applyFilter(DefaultScanResult.java:96)
[ERROR] at org.apache.maven.surefire.junitcore.JUnitCoreProvider.scanClassPath(JUnitCoreProvider.java:295)
[ERROR] at org.apache.maven.surefire.junitcore.JUnitCoreProvider.setTestsToRun(JUnitCoreProvider.java:203)
[ERROR] at org.apache.maven.surefire.junitcore.JUnitCoreProvider.invoke(JUnitCoreProvider.java:138)
[ERROR] at org.apache.maven.surefire.booter.ForkedBooter.invokeProviderInSameClassLoader(ForkedBooter.java:290)
[ERROR] at org.apache.maven.surefire.booter.ForkedBooter.runSuitesInProcess(ForkedBooter.java:242)
[ERROR] at org.apache.maven.surefire.booter.ForkedBooter.main(ForkedBooter.java:121)
[ERROR] -> [Help 1]
[ERROR] 
[ERROR] To see the full stack trace of the errors, re-run Maven with the -e switch.
[ERROR] Re-run Maven using the -X switch to enable full debug logging.
[ERROR] 
[ERROR] For more information about the errors and possible solutions, please read the following
articles:
[ERROR] [Help 1] http://cwiki.apache.org/confluence/display/MAVEN/PluginExecutionException
[ERROR] 
[ERROR] After correcting the problems, you can resume the build with the command
[ERROR]   mvn <goals> -rf :deltaspike-cdictrl-weld
[JENKINS] Archiving <https://builds.apache.org/job/DeltaSpike%20Weld%202.3.5/ws/deltaspike/cdictrl/tck/pom.xml>
to org.apache.deltaspike.test/deltaspike-cdictrl-tck/1.8.0-SNAPSHOT/deltaspike-cdictrl-tck-1.8.0-SNAPSHOT.pom
[JENKINS] Archiving <https://builds.apache.org/job/DeltaSpike%20Weld%202.3.5/ws/deltaspike/dist/pom.xml>
to org.apache.deltaspike.distribution/distributions-project/1.8.0-SNAPSHOT/distributions-project-1.8.0-SNAPSHOT.pom
[JENKINS] Archiving <https://builds.apache.org/job/DeltaSpike%20Weld%202.3.5/ws/deltaspike/modules/jsf/impl/pom.xml>
to org.apache.deltaspike.modules/deltaspike-jsf-module-impl/1.8.0-SNAPSHOT/deltaspike-jsf-module-impl-1.8.0-SNAPSHOT.pom
[JENKINS] Archiving <https://builds.apache.org/job/DeltaSpike%20Weld%202.3.5/ws/deltaspike/modules/data/impl/pom.xml>
to org.apache.deltaspike.modules/deltaspike-data-module-impl/1.8.0-SNAPSHOT/deltaspike-data-module-impl-1.8.0-SNAPSHOT.pom
[JENKINS] Archiving <https://builds.apache.org/job/DeltaSpike%20Weld%202.3.5/ws/deltaspike/modules/jsf/pom.xml>
to org.apache.deltaspike.modules/jsf-module-project/1.8.0-SNAPSHOT/jsf-module-project-1.8.0-SNAPSHOT.pom
[JENKINS] Archiving <https://builds.apache.org/job/DeltaSpike%20Weld%202.3.5/ws/deltaspike/modules/bean-validation/impl/pom.xml>
to org.apache.deltaspike.modules/deltaspike-bean-validation-module-impl/1.8.0-SNAPSHOT/deltaspike-bean-validation-module-impl-1.8.0-SNAPSHOT.pom
[JENKINS] Archiving <https://builds.apache.org/job/DeltaSpike%20Weld%202.3.5/ws/deltaspike/examples/jpa-examples/pom.xml>
to org.apache.deltaspike.examples/deltaspike-jpa-examples/1.8.0-SNAPSHOT/deltaspike-jpa-examples-1.8.0-SNAPSHOT.pom
[JENKINS] Archiving <https://builds.apache.org/job/DeltaSpike%20Weld%202.3.5/ws/deltaspike/cdictrl/pom.xml>
to org.apache.deltaspike.cdictrl/cdictrl-project/1.8.0-SNAPSHOT/cdictrl-project-1.8.0-SNAPSHOT.pom
[JENKINS] Archiving <https://builds.apache.org/job/DeltaSpike%20Weld%202.3.5/ws/deltaspike/cdictrl/target/cdictrl-project-1.8.0-SNAPSHOT-tests.jar>
to org.apache.deltaspike.cdictrl/cdictrl-project/1.8.0-SNAPSHOT/cdictrl-project-1.8.0-SNAPSHOT-tests.jar
[JENKINS] Archiving <https://builds.apache.org/job/DeltaSpike%20Weld%202.3.5/ws/deltaspike/modules/partial-bean/api/pom.xml>
to org.apache.deltaspike.modules/deltaspike-partial-bean-module-api/1.8.0-SNAPSHOT/deltaspike-partial-bean-module-api-1.8.0-SNAPSHOT.pom
[JENKINS] Archiving <https://builds.apache.org/job/DeltaSpike%20Weld%202.3.5/ws/deltaspike/cdictrl/api/pom.xml>
to org.apache.deltaspike.cdictrl/deltaspike-cdictrl-api/1.8.0-SNAPSHOT/deltaspike-cdictrl-api-1.8.0-SNAPSHOT.pom
[JENKINS] Archiving <https://builds.apache.org/job/DeltaSpike%20Weld%202.3.5/ws/deltaspike/cdictrl/api/target/deltaspike-cdictrl-api-1.8.0-SNAPSHOT.jar>
to org.apache.deltaspike.cdictrl/deltaspike-cdictrl-api/1.8.0-SNAPSHOT/deltaspike-cdictrl-api-1.8.0-SNAPSHOT.jar
[JENKINS] Archiving <https://builds.apache.org/job/DeltaSpike%20Weld%202.3.5/ws/deltaspike/cdictrl/api/target/deltaspike-cdictrl-api-1.8.0-SNAPSHOT-tests.jar>
to org.apache.deltaspike.cdictrl/deltaspike-cdictrl-api/1.8.0-SNAPSHOT/deltaspike-cdictrl-api-1.8.0-SNAPSHOT-tests.jar
[JENKINS] Archiving <https://builds.apache.org/job/DeltaSpike%20Weld%202.3.5/ws/deltaspike/cdictrl/api/target/deltaspike-cdictrl-api-1.8.0-SNAPSHOT-sources.jar>
to org.apache.deltaspike.cdictrl/deltaspike-cdictrl-api/1.8.0-SNAPSHOT/deltaspike-cdictrl-api-1.8.0-SNAPSHOT-sources.jar
[JENKINS] Archiving <https://builds.apache.org/job/DeltaSpike%20Weld%202.3.5/ws/deltaspike/modules/security/api/pom.xml>
to org.apache.deltaspike.modules/deltaspike-security-module-api/1.8.0-SNAPSHOT/deltaspike-security-module-api-1.8.0-SNAPSHOT.pom
[JENKINS] Archiving <https://builds.apache.org/job/DeltaSpike%20Weld%202.3.5/ws/deltaspike/modules/data/api/pom.xml>
to org.apache.deltaspike.modules/deltaspike-data-module-api/1.8.0-SNAPSHOT/deltaspike-data-module-api-1.8.0-SNAPSHOT.pom
[JENKINS] Archiving <https://builds.apache.org/job/DeltaSpike%20Weld%202.3.5/ws/documentation/pom.xml>
to org.apache.deltaspike/deltaspike-documentation/1.8.0-SNAPSHOT/deltaspike-documentation-1.8.0-SNAPSHOT.pom
[JENKINS] Archiving <https://builds.apache.org/job/DeltaSpike%20Weld%202.3.5/ws/deltaspike/examples/jse-examples/pom.xml>
to org.apache.deltaspike.examples/deltaspike-jse-example/1.8.0-SNAPSHOT/deltaspike-jse-example-1.8.0-SNAPSHOT.pom
[JENKINS] Archiving <https://builds.apache.org/job/DeltaSpike%20Weld%202.3.5/ws/deltaspike/examples/pom.xml>
to org.apache.deltaspike.examples/examples-project/1.8.0-SNAPSHOT/examples-project-1.8.0-SNAPSHOT.pom
[JENKINS] Archiving <https://builds.apache.org/job/DeltaSpike%20Weld%202.3.5/ws/deltaspike/modules/jpa/pom.xml>
to org.apache.deltaspike.modules/jpa-module-project/1.8.0-SNAPSHOT/jpa-module-project-1.8.0-SNAPSHOT.pom
[JENKINS] Archiving <https://builds.apache.org/job/DeltaSpike%20Weld%202.3.5/ws/deltaspike/modules/servlet/pom.xml>
to org.apache.deltaspike.modules/servlet-module-project/1.8.0-SNAPSHOT/servlet-module-project-1.8.0-SNAPSHOT.pom
[JENKINS] Archiving <https://builds.apache.org/job/DeltaSpike%20Weld%202.3.5/ws/deltaspike/pom.xml>
to org.apache.deltaspike/deltaspike-project/1.8.0-SNAPSHOT/deltaspike-project-1.8.0-SNAPSHOT.pom
[JENKINS] Archiving <https://builds.apache.org/job/DeltaSpike%20Weld%202.3.5/ws/pom.xml>
to org.apache.deltaspike/deltaspike/1.8.0-SNAPSHOT/deltaspike-1.8.0-SNAPSHOT.pom
[JENKINS] Archiving <https://builds.apache.org/job/DeltaSpike%20Weld%202.3.5/ws/deltaspike/core/impl/pom.xml>
to org.apache.deltaspike.core/deltaspike-core-impl/1.8.0-SNAPSHOT/deltaspike-core-impl-1.8.0-SNAPSHOT.pom
[JENKINS] Archiving <https://builds.apache.org/job/DeltaSpike%20Weld%202.3.5/ws/deltaspike/core/impl/target/deltaspike-core-impl-1.8.0-SNAPSHOT.jar>
to org.apache.deltaspike.core/deltaspike-core-impl/1.8.0-SNAPSHOT/deltaspike-core-impl-1.8.0-SNAPSHOT.jar
[JENKINS] Archiving <https://builds.apache.org/job/DeltaSpike%20Weld%202.3.5/ws/deltaspike/core/impl/target/deltaspike-core-impl-1.8.0-SNAPSHOT-tests.jar>
to org.apache.deltaspike.core/deltaspike-core-impl/1.8.0-SNAPSHOT/deltaspike-core-impl-1.8.0-SNAPSHOT-tests.jar
[JENKINS] Archiving <https://builds.apache.org/job/DeltaSpike%20Weld%202.3.5/ws/deltaspike/core/impl/target/deltaspike-core-impl-1.8.0-SNAPSHOT-sources.jar>
to org.apache.deltaspike.core/deltaspike-core-impl/1.8.0-SNAPSHOT/deltaspike-core-impl-1.8.0-SNAPSHOT-sources.jar
[JENKINS] Archiving <https://builds.apache.org/job/DeltaSpike%20Weld%202.3.5/ws/deltaspike/modules/partial-bean/pom.xml>
to org.apache.deltaspike.modules/partial-bean-module-project/1.8.0-SNAPSHOT/partial-bean-module-project-1.8.0-SNAPSHOT.pom
[JENKINS] Archiving <https://builds.apache.org/job/DeltaSpike%20Weld%202.3.5/ws/deltaspike/cdictrl/impl-weld/pom.xml>
to org.apache.deltaspike.cdictrl/deltaspike-cdictrl-weld/1.8.0-SNAPSHOT/deltaspike-cdictrl-weld-1.8.0-SNAPSHOT.pom
[JENKINS] Archiving <https://builds.apache.org/job/DeltaSpike%20Weld%202.3.5/ws/deltaspike/modules/proxy/pom.xml>
to org.apache.deltaspike.modules/proxy-module-project/1.8.0-SNAPSHOT/proxy-module-project-1.8.0-SNAPSHOT.pom
[JENKINS] Archiving <https://builds.apache.org/job/DeltaSpike%20Weld%202.3.5/ws/deltaspike/parent/pom.xml>
to org.apache.deltaspike/parent/1.8.0-SNAPSHOT/parent-1.8.0-SNAPSHOT.pom
[JENKINS] Archiving <https://builds.apache.org/job/DeltaSpike%20Weld%202.3.5/ws/deltaspike/modules/security/impl/pom.xml>
to org.apache.deltaspike.modules/deltaspike-security-module-impl/1.8.0-SNAPSHOT/deltaspike-security-module-impl-1.8.0-SNAPSHOT.pom
[JENKINS] Archiving <https://builds.apache.org/job/DeltaSpike%20Weld%202.3.5/ws/deltaspike/modules/jpa/api/pom.xml>
to org.apache.deltaspike.modules/deltaspike-jpa-module-api/1.8.0-SNAPSHOT/deltaspike-jpa-module-api-1.8.0-SNAPSHOT.pom
[JENKINS] Archiving <https://builds.apache.org/job/DeltaSpike%20Weld%202.3.5/ws/deltaspike/modules/proxy/impl-asm5/pom.xml>
to org.apache.deltaspike.modules/deltaspike-proxy-module-impl-asm5/1.8.0-SNAPSHOT/deltaspike-proxy-module-impl-asm5-1.8.0-SNAPSHOT.pom
[JENKINS] Archiving <https://builds.apache.org/job/DeltaSpike%20Weld%202.3.5/ws/deltaspike/dist/bom/pom.xml>
to org.apache.deltaspike.distribution/distributions-bom/1.8.0-SNAPSHOT/distributions-bom-1.8.0-SNAPSHOT.pom
[JENKINS] Archiving <https://builds.apache.org/job/DeltaSpike%20Weld%202.3.5/ws/deltaspike/modules/bean-validation/pom.xml>
to org.apache.deltaspike.modules/bean-validation-module-project/1.8.0-SNAPSHOT/bean-validation-module-project-1.8.0-SNAPSHOT.pom
[JENKINS] Archiving <https://builds.apache.org/job/DeltaSpike%20Weld%202.3.5/ws/deltaspike/parent/code/pom.xml>
to org.apache.deltaspike/parent-code/1.8.0-SNAPSHOT/parent-code-1.8.0-SNAPSHOT.pom
[JENKINS] Archiving <https://builds.apache.org/job/DeltaSpike%20Weld%202.3.5/ws/deltaspike/parent/code/target/parent-code-1.8.0-SNAPSHOT-tests.jar>
to org.apache.deltaspike/parent-code/1.8.0-SNAPSHOT/parent-code-1.8.0-SNAPSHOT-tests.jar
Compressed 98.26 KB of artifacts by 65.1% relative to #37
[JENKINS] Archiving <https://builds.apache.org/job/DeltaSpike%20Weld%202.3.5/ws/deltaspike/modules/jpa/impl/pom.xml>
to org.apache.deltaspike.modules/deltaspike-jpa-module-impl/1.8.0-SNAPSHOT/deltaspike-jpa-module-impl-1.8.0-SNAPSHOT.pom
[JENKINS] Archiving <https://builds.apache.org/job/DeltaSpike%20Weld%202.3.5/ws/deltaspike/modules/partial-bean/impl/pom.xml>
to org.apache.deltaspike.modules/deltaspike-partial-bean-module-impl/1.8.0-SNAPSHOT/deltaspike-partial-bean-module-impl-1.8.0-SNAPSHOT.pom
[JENKINS] Archiving <https://builds.apache.org/job/DeltaSpike%20Weld%202.3.5/ws/deltaspike/cdictrl/servlet/pom.xml>
to org.apache.deltaspike.cdictrl/deltaspike-cdictrl-servlet/1.8.0-SNAPSHOT/deltaspike-cdictrl-servlet-1.8.0-SNAPSHOT.pom
[JENKINS] Archiving <https://builds.apache.org/job/DeltaSpike%20Weld%202.3.5/ws/deltaspike/modules/scheduler/api/pom.xml>
to org.apache.deltaspike.modules/deltaspike-scheduler-module-api/1.8.0-SNAPSHOT/deltaspike-scheduler-module-api-1.8.0-SNAPSHOT.pom
[JENKINS] Archiving <https://builds.apache.org/job/DeltaSpike%20Weld%202.3.5/ws/deltaspike/modules/test-control/pom.xml>
to org.apache.deltaspike.modules/test-control-module-project/1.8.0-SNAPSHOT/test-control-module-project-1.8.0-SNAPSHOT.pom
[JENKINS] Archiving <https://builds.apache.org/job/DeltaSpike%20Weld%202.3.5/ws/deltaspike/modules/scheduler/impl/pom.xml>
to org.apache.deltaspike.modules/deltaspike-scheduler-module-impl/1.8.0-SNAPSHOT/deltaspike-scheduler-module-impl-1.8.0-SNAPSHOT.pom
[JENKINS] Archiving <https://builds.apache.org/job/DeltaSpike%20Weld%202.3.5/ws/deltaspike/examples/jsf-playground/pom.xml>
to org.apache.deltaspike.examples/deltaspike-jsf-playground/1.8.0-SNAPSHOT/deltaspike-jsf-playground-1.8.0-SNAPSHOT.pom
[JENKINS] Archiving <https://builds.apache.org/job/DeltaSpike%20Weld%202.3.5/ws/deltaspike/modules/test-control/impl/pom.xml>
to org.apache.deltaspike.modules/deltaspike-test-control-module-impl/1.8.0-SNAPSHOT/deltaspike-test-control-module-impl-1.8.0-SNAPSHOT.pom
[JENKINS] Archiving <https://builds.apache.org/job/DeltaSpike%20Weld%202.3.5/ws/deltaspike/checkstyle-rules/pom.xml>
to org.apache.deltaspike/checkstyle-rules/1.8.0-SNAPSHOT/checkstyle-rules-1.8.0-SNAPSHOT.pom
[JENKINS] Archiving <https://builds.apache.org/job/DeltaSpike%20Weld%202.3.5/ws/deltaspike/checkstyle-rules/target/checkstyle-rules-1.8.0-SNAPSHOT.jar>
to org.apache.deltaspike/checkstyle-rules/1.8.0-SNAPSHOT/checkstyle-rules-1.8.0-SNAPSHOT.jar
[JENKINS] Archiving <https://builds.apache.org/job/DeltaSpike%20Weld%202.3.5/ws/deltaspike/modules/proxy/api/pom.xml>
to org.apache.deltaspike.modules/deltaspike-proxy-module-api/1.8.0-SNAPSHOT/deltaspike-proxy-module-api-1.8.0-SNAPSHOT.pom
[JENKINS] Archiving <https://builds.apache.org/job/DeltaSpike%20Weld%202.3.5/ws/deltaspike/modules/servlet/api/pom.xml>
to org.apache.deltaspike.modules/deltaspike-servlet-module-api/1.8.0-SNAPSHOT/deltaspike-servlet-module-api-1.8.0-SNAPSHOT.pom
[JENKINS] Archiving <https://builds.apache.org/job/DeltaSpike%20Weld%202.3.5/ws/deltaspike/examples/data-examples/pom.xml>
to org.apache.deltaspike.examples/deltaspike-data-examples/1.8.0-SNAPSHOT/deltaspike-data-examples-1.8.0-SNAPSHOT.pom
[JENKINS] Archiving <https://builds.apache.org/job/DeltaSpike%20Weld%202.3.5/ws/deltaspike/core/api/pom.xml>
to org.apache.deltaspike.core/deltaspike-core-api/1.8.0-SNAPSHOT/deltaspike-core-api-1.8.0-SNAPSHOT.pom
[JENKINS] Archiving <https://builds.apache.org/job/DeltaSpike%20Weld%202.3.5/ws/deltaspike/core/api/target/deltaspike-core-api-1.8.0-SNAPSHOT.jar>
to org.apache.deltaspike.core/deltaspike-core-api/1.8.0-SNAPSHOT/deltaspike-core-api-1.8.0-SNAPSHOT.jar
[JENKINS] Archiving <https://builds.apache.org/job/DeltaSpike%20Weld%202.3.5/ws/deltaspike/core/api/target/deltaspike-core-api-1.8.0-SNAPSHOT-tests.jar>
to org.apache.deltaspike.core/deltaspike-core-api/1.8.0-SNAPSHOT/deltaspike-core-api-1.8.0-SNAPSHOT-tests.jar
[JENKINS] Archiving <https://builds.apache.org/job/DeltaSpike%20Weld%202.3.5/ws/deltaspike/core/api/target/deltaspike-core-api-1.8.0-SNAPSHOT-sources.jar>
to org.apache.deltaspike.core/deltaspike-core-api/1.8.0-SNAPSHOT/deltaspike-core-api-1.8.0-SNAPSHOT-sources.jar
[JENKINS] Archiving <https://builds.apache.org/job/DeltaSpike%20Weld%202.3.5/ws/deltaspike/examples/security-requested-page-after-login-picketlink/pom.xml>
to org.apache.deltaspike.examples/deltaspike-security-requested-page-after-login-picketlink/1.8.0-SNAPSHOT/deltaspike-security-requested-page-after-login-picketlink-1.8.0-SNAPSHOT.pom
[JENKINS] Archiving <https://builds.apache.org/job/DeltaSpike%20Weld%202.3.5/ws/deltaspike/modules/bean-validation/api/pom.xml>
to org.apache.deltaspike.modules/deltaspike-bean-validation-module-api/1.8.0-SNAPSHOT/deltaspike-bean-validation-module-api-1.8.0-SNAPSHOT.pom
[JENKINS] Archiving <https://builds.apache.org/job/DeltaSpike%20Weld%202.3.5/ws/deltaspike/examples/scheduler-playground/pom.xml>
to org.apache.deltaspike.examples/deltaspike-scheduler-example/1.8.0-SNAPSHOT/deltaspike-scheduler-example-1.8.0-SNAPSHOT.pom
[JENKINS] Archiving <https://builds.apache.org/job/DeltaSpike%20Weld%202.3.5/ws/deltaspike/modules/pom.xml>
to org.apache.deltaspike.modules/modules-project/1.8.0-SNAPSHOT/modules-project-1.8.0-SNAPSHOT.pom
[JENKINS] Archiving <https://builds.apache.org/job/DeltaSpike%20Weld%202.3.5/ws/deltaspike/modules/scheduler/pom.xml>
to org.apache.deltaspike.modules/scheduler-module-project/1.8.0-SNAPSHOT/scheduler-module-project-1.8.0-SNAPSHOT.pom
[JENKINS] Archiving <https://builds.apache.org/job/DeltaSpike%20Weld%202.3.5/ws/deltaspike/test-utils/pom.xml>
to org.apache.deltaspike.test/test-utils/1.8.0-SNAPSHOT/test-utils-1.8.0-SNAPSHOT.pom
[JENKINS] Archiving <https://builds.apache.org/job/DeltaSpike%20Weld%202.3.5/ws/deltaspike/test-utils/target/test-utils-1.8.0-SNAPSHOT.jar>
to org.apache.deltaspike.test/test-utils/1.8.0-SNAPSHOT/test-utils-1.8.0-SNAPSHOT.jar
[JENKINS] Archiving <https://builds.apache.org/job/DeltaSpike%20Weld%202.3.5/ws/deltaspike/test-utils/target/test-utils-1.8.0-SNAPSHOT-sources.jar>
to org.apache.deltaspike.test/test-utils/1.8.0-SNAPSHOT/test-utils-1.8.0-SNAPSHOT-sources.jar
[JENKINS] Archiving <https://builds.apache.org/job/DeltaSpike%20Weld%202.3.5/ws/deltaspike/modules/security/pom.xml>
to org.apache.deltaspike.modules/security-module-project/1.8.0-SNAPSHOT/security-module-project-1.8.0-SNAPSHOT.pom
[JENKINS] Archiving <https://builds.apache.org/job/DeltaSpike%20Weld%202.3.5/ws/deltaspike/modules/jsf/api/pom.xml>
to org.apache.deltaspike.modules/deltaspike-jsf-module-api/1.8.0-SNAPSHOT/deltaspike-jsf-module-api-1.8.0-SNAPSHOT.pom
[JENKINS] Archiving <https://builds.apache.org/job/DeltaSpike%20Weld%202.3.5/ws/deltaspike/modules/data/pom.xml>
to org.apache.deltaspike.modules/data-module-project/1.8.0-SNAPSHOT/data-module-project-1.8.0-SNAPSHOT.pom
[JENKINS] Archiving <https://builds.apache.org/job/DeltaSpike%20Weld%202.3.5/ws/deltaspike/modules/servlet/impl/pom.xml>
to org.apache.deltaspike.modules/deltaspike-servlet-module-impl/1.8.0-SNAPSHOT/deltaspike-servlet-module-impl-1.8.0-SNAPSHOT.pom
[JENKINS] Archiving <https://builds.apache.org/job/DeltaSpike%20Weld%202.3.5/ws/deltaspike/modules/test-control/api/pom.xml>
to org.apache.deltaspike.modules/deltaspike-test-control-module-api/1.8.0-SNAPSHOT/deltaspike-test-control-module-api-1.8.0-SNAPSHOT.pom
[JENKINS] Archiving <https://builds.apache.org/job/DeltaSpike%20Weld%202.3.5/ws/deltaspike/examples/jsf-examples/pom.xml>
to org.apache.deltaspike.examples/deltaspike-jsf-example/1.8.0-SNAPSHOT/deltaspike-jsf-example-1.8.0-SNAPSHOT.pom
[JENKINS] Archiving <https://builds.apache.org/job/DeltaSpike%20Weld%202.3.5/ws/deltaspike/modules/jsf/impl-ee6/pom.xml>
to org.apache.deltaspike.modules/deltaspike-jsf-module-impl-ee6/1.8.0-SNAPSHOT/deltaspike-jsf-module-impl-ee6-1.8.0-SNAPSHOT.pom
[JENKINS] Archiving <https://builds.apache.org/job/DeltaSpike%20Weld%202.3.5/ws/deltaspike/examples/security-requested-page-after-login-cdi/pom.xml>
to org.apache.deltaspike.examples/deltaspike-security-requested-page-after-login-cdi/1.8.0-SNAPSHOT/deltaspike-security-requested-page-after-login-cdi-1.8.0-SNAPSHOT.pom
[JENKINS] Archiving <https://builds.apache.org/job/DeltaSpike%20Weld%202.3.5/ws/deltaspike/core/pom.xml>
to org.apache.deltaspike.core/core-project/1.8.0-SNAPSHOT/core-project-1.8.0-SNAPSHOT.pom
[JENKINS] Archiving <https://builds.apache.org/job/DeltaSpike%20Weld%202.3.5/ws/deltaspike/core/target/core-project-1.8.0-SNAPSHOT-tests.jar>
to org.apache.deltaspike.core/core-project/1.8.0-SNAPSHOT/core-project-1.8.0-SNAPSHOT-tests.jar
[JENKINS] Archiving <https://builds.apache.org/job/DeltaSpike%20Weld%202.3.5/ws/deltaspike/dist/full/pom.xml>
to org.apache.deltaspike.distribution/distribution-full/1.8.0-SNAPSHOT/distribution-full-1.8.0-SNAPSHOT.pom
[JENKINS] Archiving <https://builds.apache.org/job/DeltaSpike%20Weld%202.3.5/ws/site/pom.xml>
to org.apache.deltaspike/deltaspike-site/1.8.0-SNAPSHOT/deltaspike-site-1.8.0-SNAPSHOT.pom
channel stopped

Mime
View raw message