deltaspike-commits mailing list archives

Site index · List index
Message view « Date » · « Thread »
Top « Date » · « Thread »
From Apache Jenkins Server <jenk...@builds.apache.org>
Subject Build failed in Jenkins: DeltaSpike Deploy #1830
Date Sun, 09 Apr 2017 13:46:56 GMT
See <https://builds.apache.org/job/DeltaSpike%20Deploy/1830/display/redirect>

------------------------------------------
[...truncated 186.75 KB...]
INFO: Custom config found by DeltaSpike. Name: 'myboottimeconfig.properties', URL: '<https://builds.apache.org/job/DeltaSpike%20Deploy/ws/deltaspike/core/impl/target/test-classes/myboottimeconfig.properties'>
Apr 09, 2017 1:45:07 PM org.apache.webbeans.config.BeansDeployer validateInjectionPoints
INFO: All injection points were validated successfully.
Apr 09, 2017 1:45:07 PM org.apache.webbeans.lifecycle.AbstractLifeCycle bootstrapApplication
INFO: OpenWebBeans Container has started, it took [105] ms.
Tests run: 1, Failures: 0, Errors: 0, Skipped: 0, Time elapsed: 0.441 sec - in org.apache.deltaspike.test.core.impl.jmx.CustomTypeTest
Running org.apache.deltaspike.test.core.impl.scope.window.DefaultWindowContextTest
Apr 09, 2017 1:45:08 PM org.apache.deltaspike.test.utils.ShrinkWrapArchiveUtil getArchives
INFO: Test org.apache.deltaspike.test.core.impl.custom.spi.ServiceUtilsWarFileTest Adding
Java ClassPath URL as JavaArchive <https://builds.apache.org/job/DeltaSpike%20Deploy/ws/deltaspike/core/impl/target/classes/META-INF/beans.xml>
Apr 09, 2017 1:45:08 PM org.apache.deltaspike.test.utils.ShrinkWrapArchiveUtil getArchives
INFO: Test org.apache.deltaspike.test.core.impl.custom.spi.ServiceUtilsWarFileTest Adding
Java ClassPath URL as JavaArchive jar:<https://builds.apache.org/job/DeltaSpike%20Deploy/ws/deltaspike/core/api/target/deltaspike-core-api-1.8.0-SNAPSHOT.jar!/META-INF/beans.xml>
Apr 09, 2017 1:45:08 PM org.apache.webbeans.lifecycle.AbstractLifeCycle bootstrapApplication
INFO: OpenWebBeans Container is starting...
Apr 09, 2017 1:45:08 PM org.apache.deltaspike.core.impl.config.EnvironmentPropertyConfigSourceProvider
<init>
INFO: Custom config found by DeltaSpike. Name: 'META-INF/apache-deltaspike.properties', URL:
'<https://builds.apache.org/job/DeltaSpike%20Deploy/ws/deltaspike/core/impl/target/test-classes/META-INF/apache-deltaspike.properties'>
Apr 09, 2017 1:45:08 PM org.apache.deltaspike.core.impl.config.EnvironmentPropertyConfigSourceProvider
<init>
INFO: Custom config found by DeltaSpike. Name: 'myboottimeconfig.properties', URL: '<https://builds.apache.org/job/DeltaSpike%20Deploy/ws/deltaspike/core/impl/target/test-classes/myboottimeconfig.properties'>
Apr 09, 2017 1:45:08 PM org.apache.webbeans.config.BeansDeployer validateInjectionPoints
INFO: All injection points were validated successfully.
Apr 09, 2017 1:45:08 PM org.apache.webbeans.lifecycle.AbstractLifeCycle bootstrapApplication
INFO: OpenWebBeans Container has started, it took [153] ms.
Tests run: 1, Failures: 0, Errors: 0, Skipped: 0, Time elapsed: 0.544 sec - in org.apache.deltaspike.test.core.impl.scope.window.DefaultWindowContextTest
Running org.apache.deltaspike.test.core.impl.custom.spi.ServiceUtilsWarFileTest
Apr 09, 2017 1:45:08 PM org.apache.deltaspike.test.utils.ShrinkWrapArchiveUtil getArchives
INFO: Test org.apache.deltaspike.test.core.impl.activation.DefaultClassDeactivatorTest Adding
Java ClassPath URL as JavaArchive <https://builds.apache.org/job/DeltaSpike%20Deploy/ws/deltaspike/core/impl/target/classes/META-INF/beans.xml>
Apr 09, 2017 1:45:08 PM org.apache.deltaspike.test.utils.ShrinkWrapArchiveUtil getArchives
INFO: Test org.apache.deltaspike.test.core.impl.activation.DefaultClassDeactivatorTest Adding
Java ClassPath URL as JavaArchive jar:<https://builds.apache.org/job/DeltaSpike%20Deploy/ws/deltaspike/core/api/target/deltaspike-core-api-1.8.0-SNAPSHOT.jar!/META-INF/beans.xml>
Apr 09, 2017 1:45:08 PM org.apache.webbeans.lifecycle.AbstractLifeCycle bootstrapApplication
INFO: OpenWebBeans Container is starting...
Apr 09, 2017 1:45:08 PM org.apache.deltaspike.core.impl.config.EnvironmentPropertyConfigSourceProvider
<init>
INFO: Custom config found by DeltaSpike. Name: 'META-INF/apache-deltaspike.properties', URL:
'<https://builds.apache.org/job/DeltaSpike%20Deploy/ws/deltaspike/core/impl/target/test-classes/META-INF/apache-deltaspike.properties'>
Apr 09, 2017 1:45:08 PM org.apache.deltaspike.core.impl.config.EnvironmentPropertyConfigSourceProvider
<init>
INFO: Custom config found by DeltaSpike. Name: 'META-INF/apache-deltaspike.properties', URL:
'archive:defaultClassDeactivatorTest.war/META-INF/apache-deltaspike.properties'
Apr 09, 2017 1:45:08 PM org.apache.deltaspike.core.impl.config.EnvironmentPropertyConfigSourceProvider
<init>
INFO: Custom config found by DeltaSpike. Name: 'myboottimeconfig.properties', URL: '<https://builds.apache.org/job/DeltaSpike%20Deploy/ws/deltaspike/core/impl/target/test-classes/myboottimeconfig.properties'>
Apr 09, 2017 1:45:08 PM org.apache.webbeans.config.BeansDeployer validateInjectionPoints
INFO: All injection points were validated successfully.
Apr 09, 2017 1:45:09 PM org.apache.webbeans.lifecycle.AbstractLifeCycle bootstrapApplication
INFO: OpenWebBeans Container has started, it took [131] ms.
Tests run: 1, Failures: 0, Errors: 0, Skipped: 0, Time elapsed: 0.536 sec - in org.apache.deltaspike.test.core.impl.custom.spi.ServiceUtilsWarFileTest
Running org.apache.deltaspike.test.core.impl.activation.DefaultClassDeactivatorTest
Apr 09, 2017 1:45:09 PM org.apache.deltaspike.test.utils.ShrinkWrapArchiveUtil getArchives
INFO: Test org.apache.deltaspike.test.core.impl.activation.ClassDeactivationWarFileTest Adding
Java ClassPath URL as JavaArchive <https://builds.apache.org/job/DeltaSpike%20Deploy/ws/deltaspike/core/impl/target/classes/META-INF/beans.xml>
Apr 09, 2017 1:45:09 PM org.apache.deltaspike.test.utils.ShrinkWrapArchiveUtil getArchives
INFO: Test org.apache.deltaspike.test.core.impl.activation.ClassDeactivationWarFileTest Adding
Java ClassPath URL as JavaArchive jar:<https://builds.apache.org/job/DeltaSpike%20Deploy/ws/deltaspike/core/api/target/deltaspike-core-api-1.8.0-SNAPSHOT.jar!/META-INF/beans.xml>
Apr 09, 2017 1:45:09 PM org.apache.webbeans.lifecycle.AbstractLifeCycle bootstrapApplication
INFO: OpenWebBeans Container is starting...
Apr 09, 2017 1:45:09 PM org.apache.deltaspike.core.impl.config.EnvironmentPropertyConfigSourceProvider
<init>
INFO: Custom config found by DeltaSpike. Name: 'META-INF/apache-deltaspike.properties', URL:
'<https://builds.apache.org/job/DeltaSpike%20Deploy/ws/deltaspike/core/impl/target/test-classes/META-INF/apache-deltaspike.properties'>
Apr 09, 2017 1:45:09 PM org.apache.deltaspike.core.impl.config.EnvironmentPropertyConfigSourceProvider
<init>
INFO: Custom config found by DeltaSpike. Name: 'META-INF/apache-deltaspike.properties', URL:
'archive:classDeactivationWarFileTest.war/META-INF/apache-deltaspike.properties'
Apr 09, 2017 1:45:09 PM org.apache.deltaspike.core.impl.config.EnvironmentPropertyConfigSourceProvider
<init>
INFO: Custom config found by DeltaSpike. Name: 'myboottimeconfig.properties', URL: '<https://builds.apache.org/job/DeltaSpike%20Deploy/ws/deltaspike/core/impl/target/test-classes/myboottimeconfig.properties'>
Apr 09, 2017 1:45:09 PM org.apache.webbeans.config.BeansDeployer validateInjectionPoints
INFO: All injection points were validated successfully.
Apr 09, 2017 1:45:09 PM org.apache.webbeans.lifecycle.AbstractLifeCycle bootstrapApplication
INFO: OpenWebBeans Container has started, it took [107] ms.
Tests run: 3, Failures: 0, Errors: 0, Skipped: 0, Time elapsed: 0.341 sec - in org.apache.deltaspike.test.core.impl.activation.DefaultClassDeactivatorTest
Running org.apache.deltaspike.test.core.impl.activation.ClassDeactivationWarFileTest
Apr 09, 2017 1:45:09 PM org.apache.deltaspike.test.utils.ShrinkWrapArchiveUtil getArchives
INFO: Test org.apache.deltaspike.test.core.impl.future.FutureableTest Adding Java ClassPath
URL as JavaArchive <https://builds.apache.org/job/DeltaSpike%20Deploy/ws/deltaspike/core/impl/target/classes/META-INF/beans.xml>
Apr 09, 2017 1:45:09 PM org.apache.deltaspike.test.utils.ShrinkWrapArchiveUtil getArchives
INFO: Test org.apache.deltaspike.test.core.impl.future.FutureableTest Adding Java ClassPath
URL as JavaArchive jar:<https://builds.apache.org/job/DeltaSpike%20Deploy/ws/deltaspike/core/api/target/deltaspike-core-api-1.8.0-SNAPSHOT.jar!/META-INF/beans.xml>
Apr 09, 2017 1:45:09 PM org.apache.webbeans.lifecycle.AbstractLifeCycle bootstrapApplication
INFO: OpenWebBeans Container is starting...
Apr 09, 2017 1:45:09 PM org.apache.deltaspike.core.impl.config.EnvironmentPropertyConfigSourceProvider
<init>
INFO: Custom config found by DeltaSpike. Name: 'META-INF/apache-deltaspike.properties', URL:
'<https://builds.apache.org/job/DeltaSpike%20Deploy/ws/deltaspike/core/impl/target/test-classes/META-INF/apache-deltaspike.properties'>
Apr 09, 2017 1:45:09 PM org.apache.deltaspike.core.impl.config.EnvironmentPropertyConfigSourceProvider
<init>
INFO: Custom config found by DeltaSpike. Name: 'myboottimeconfig.properties', URL: '<https://builds.apache.org/job/DeltaSpike%20Deploy/ws/deltaspike/core/impl/target/test-classes/myboottimeconfig.properties'>
Apr 09, 2017 1:45:09 PM org.apache.webbeans.xml.WebBeansXMLConfigurator configureInterceptorsElement
WARNING: Interceptor class : org.apache.deltaspike.core.impl.future.FutureableInterceptor
is already defined
Apr 09, 2017 1:45:09 PM org.apache.webbeans.config.BeansDeployer validateInjectionPoints
INFO: All injection points were validated successfully.
Apr 09, 2017 1:45:09 PM org.apache.webbeans.lifecycle.AbstractLifeCycle bootstrapApplication
INFO: OpenWebBeans Container has started, it took [214] ms.
Tests run: 2, Failures: 0, Errors: 0, Skipped: 0, Time elapsed: 0.561 sec - in org.apache.deltaspike.test.core.impl.activation.ClassDeactivationWarFileTest
Running org.apache.deltaspike.test.core.impl.future.FutureableTest
Java HotSpot(TM) 64-Bit Server VM warning: INFO: os::commit_memory(0x00000007ed400000, 314572800,
0) failed; error='Cannot allocate memory' (errno=12)
#
# There is insufficient memory for the Java Runtime Environment to continue.
# Native memory allocation (malloc) failed to allocate 314572800 bytes for committing reserved
memory.
# An error report file with more information is saved as:
# <https://builds.apache.org/job/DeltaSpike%20Deploy/ws/deltaspike/core/impl/hs_err_pid30053.log>

Results :

Tests run: 136, Failures: 0, Errors: 0, Skipped: 0

[JENKINS] Recording test results
[INFO] ------------------------------------------------------------------------
[INFO] Reactor Summary:
[INFO] 
[INFO] Apache DeltaSpike .................................. SUCCESS [ 10.233 s]
[INFO] Apache DeltaSpike Sources .......................... SUCCESS [  7.616 s]
[INFO] Apache DeltaSpike CheckStyle-rules ................. SUCCESS [  6.917 s]
[INFO] Apache DeltaSpike Parent ........................... SUCCESS [ 16.461 s]
[INFO] Apache DeltaSpike Test-Utils ....................... SUCCESS [ 12.097 s]
[INFO] Apache DeltaSpike Code Parent ...................... SUCCESS [  4.868 s]
[INFO] Apache DeltaSpike Core ............................. SUCCESS [  4.514 s]
[INFO] Apache DeltaSpike Core-API ......................... SUCCESS [ 47.628 s]
[INFO] Apache DeltaSpike Core-Implementation .............. FAILURE [ 32.845 s]
[INFO] Apache DeltaSpike ContainerControl parent .......... SKIPPED
[INFO] Apache DeltaSpike CDI ContainerControl API ......... SKIPPED
[INFO] Apache DeltaSpike CDI ContainerControl TCK ......... SKIPPED
[INFO] Apache DeltaSpike CDI OWB-ContainerControl ......... SKIPPED
[INFO] Apache DeltaSpike CDI Weld-ContainerControl ........ SKIPPED
[INFO] Apache DeltaSpike CDI OpenEJB-ContainerControl ..... SKIPPED
[INFO] Apache DeltaSpike CDI Servlet-ContainerControl ..... SKIPPED
[INFO] Apache DeltaSpike Modules .......................... SKIPPED
[INFO] Apache DeltaSpike Proxy-Module ..................... SKIPPED
[INFO] Apache DeltaSpike Proxy-Module API ................. SKIPPED
[INFO] Apache DeltaSpike Proxy-Module Impl ASM5 ........... SKIPPED
[INFO] Apache DeltaSpike Security-Module .................. SKIPPED
[INFO] Apache DeltaSpike Security-Module API .............. SKIPPED
[INFO] Apache DeltaSpike Security-Module Impl ............. SKIPPED
[INFO] Apache DeltaSpike JPA-Module ....................... SKIPPED
[INFO] Apache DeltaSpike JPA-Module API ................... SKIPPED
[INFO] Apache DeltaSpike JPA-Module Impl .................. SKIPPED
[INFO] Apache DeltaSpike Servlet-Module ................... SKIPPED
[INFO] Apache DeltaSpike Servlet-Module API ............... SKIPPED
[INFO] Apache DeltaSpike Servlet-Module Impl .............. SKIPPED
[INFO] Apache DeltaSpike JSF-Module ....................... SKIPPED
[INFO] Apache DeltaSpike JSF-Module API ................... SKIPPED
[INFO] Apache DeltaSpike JSF-Module Impl .................. SKIPPED
[INFO] Apache DeltaSpike JSF-Module Impl (EE6 only) ....... SKIPPED
[INFO] Apache DeltaSpike Partial-Bean-Module .............. SKIPPED
[INFO] Apache DeltaSpike Partial-Bean-Module API .......... SKIPPED
[INFO] Apache DeltaSpike Partial-Bean-Module Impl ......... SKIPPED
[INFO] Apache DeltaSpike BeanValidation-Module ............ SKIPPED
[INFO] Apache DeltaSpike BeanValidation-Module API ........ SKIPPED
[INFO] Apache DeltaSpike BeanValidation-Module Impl ....... SKIPPED
[INFO] Apache DeltaSpike Data-Module ...................... SKIPPED
[INFO] Apache DeltaSpike Data-Module API .................. SKIPPED
[INFO] Apache DeltaSpike Data-Module Impl ................. SKIPPED
[INFO] Apache DeltaSpike Scheduler-Module ................. SKIPPED
[INFO] Apache DeltaSpike Scheduler-Module API ............. SKIPPED
[INFO] Apache DeltaSpike Scheduler-Module Impl ............ SKIPPED
[INFO] Apache DeltaSpike Test-Control-Module .............. SKIPPED
[INFO] Apache DeltaSpike Test-Control-Module API .......... SKIPPED
[INFO] Apache DeltaSpike Test-Control-Module Impl ......... SKIPPED
[INFO] Apache DeltaSpike Examples ......................... SKIPPED
[INFO] Apache DeltaSpike Java-SE Examples ................. SKIPPED
[INFO] Apache DeltaSpike JSF Examples ..................... SKIPPED
[INFO] Apache DeltaSpike JSF Playground ................... SKIPPED
[INFO] Apache DeltaSpike Security Example CDI ............. SKIPPED
[INFO] Apache DeltaSpike Security Example PicketLink ...... SKIPPED
[INFO] Apache DeltaSpike Java-SE Scheduler Examples ....... SKIPPED
[INFO] Apache DeltaSpike JPA Examples ..................... SKIPPED
[INFO] Apache DeltaSpike Data Examples .................... SKIPPED
[INFO] Apache DeltaSpike Distribution Bill of Materials ... SKIPPED
[INFO] Apache DeltaSpike Distribution ..................... SKIPPED
[INFO] Apache DeltaSpike Full Distribution ................ SKIPPED
[INFO] Apache DeltaSpike Documentation .................... SKIPPED
[INFO] Apache DeltaSpike Site ............................. SKIPPED
[INFO] ------------------------------------------------------------------------
[INFO] BUILD FAILURE
[INFO] ------------------------------------------------------------------------
[INFO] Total time: 03:15 min
[INFO] Finished at: 2017-04-09T13:45:52+00:00
[INFO] Final Memory: 82M/857M
[INFO] ------------------------------------------------------------------------
Waiting for Jenkins to finish collecting data
[ERROR] Failed to execute goal org.apache.maven.plugins:maven-surefire-plugin:2.19.1:test
(default-test) on project deltaspike-core-impl: Execution default-test of goal org.apache.maven.plugins:maven-surefire-plugin:2.19.1:test
failed: The forked VM terminated without properly saying goodbye. VM crash or System.exit
called?
[ERROR] Command was /bin/sh -c cd "<https://builds.apache.org/job/DeltaSpike%20Deploy/ws/deltaspike/core/impl">
&& /usr/local/asfpackages/java/jdk1.7.0_80/jre/bin/java -jar '<https://builds.apache.org/job/DeltaSpike%20Deploy/ws/deltaspike/core/impl/target/surefire/surefirebooter7451022682684165618.jar'>
'<https://builds.apache.org/job/DeltaSpike%20Deploy/ws/deltaspike/core/impl/target/surefire/surefire3064992695075182517tmp'>
'<https://builds.apache.org/job/DeltaSpike%20Deploy/ws/deltaspike/core/impl/target/surefire/surefire_15913844588615026902tmp'>
[ERROR] -> [Help 1]
[ERROR] 
[ERROR] To see the full stack trace of the errors, re-run Maven with the -e switch.
[ERROR] Re-run Maven using the -X switch to enable full debug logging.
[ERROR] 
[ERROR] For more information about the errors and possible solutions, please read the following
articles:
[ERROR] [Help 1] http://cwiki.apache.org/confluence/display/MAVEN/PluginExecutionException
[ERROR] 
[ERROR] After correcting the problems, you can resume the build with the command
[ERROR]   mvn <goals> -rf :deltaspike-core-impl
[JENKINS] Archiving <https://builds.apache.org/job/DeltaSpike%20Deploy/ws/deltaspike/cdictrl/tck/pom.xml>
to org.apache.deltaspike.test/deltaspike-cdictrl-tck/1.8.0-SNAPSHOT/deltaspike-cdictrl-tck-1.8.0-SNAPSHOT.pom
[JENKINS] Archiving <https://builds.apache.org/job/DeltaSpike%20Deploy/ws/deltaspike/dist/pom.xml>
to org.apache.deltaspike.distribution/distributions-project/1.8.0-SNAPSHOT/distributions-project-1.8.0-SNAPSHOT.pom
[JENKINS] Archiving <https://builds.apache.org/job/DeltaSpike%20Deploy/ws/deltaspike/modules/jsf/impl/pom.xml>
to org.apache.deltaspike.modules/deltaspike-jsf-module-impl/1.8.0-SNAPSHOT/deltaspike-jsf-module-impl-1.8.0-SNAPSHOT.pom
[JENKINS] Archiving <https://builds.apache.org/job/DeltaSpike%20Deploy/ws/deltaspike/modules/data/impl/pom.xml>
to org.apache.deltaspike.modules/deltaspike-data-module-impl/1.8.0-SNAPSHOT/deltaspike-data-module-impl-1.8.0-SNAPSHOT.pom
[JENKINS] Archiving <https://builds.apache.org/job/DeltaSpike%20Deploy/ws/deltaspike/modules/jsf/pom.xml>
to org.apache.deltaspike.modules/jsf-module-project/1.8.0-SNAPSHOT/jsf-module-project-1.8.0-SNAPSHOT.pom
[JENKINS] Archiving <https://builds.apache.org/job/DeltaSpike%20Deploy/ws/deltaspike/modules/bean-validation/impl/pom.xml>
to org.apache.deltaspike.modules/deltaspike-bean-validation-module-impl/1.8.0-SNAPSHOT/deltaspike-bean-validation-module-impl-1.8.0-SNAPSHOT.pom
[JENKINS] Archiving <https://builds.apache.org/job/DeltaSpike%20Deploy/ws/deltaspike/examples/jpa-examples/pom.xml>
to org.apache.deltaspike.examples/deltaspike-jpa-examples/1.8.0-SNAPSHOT/deltaspike-jpa-examples-1.8.0-SNAPSHOT.pom
[JENKINS] Archiving <https://builds.apache.org/job/DeltaSpike%20Deploy/ws/deltaspike/cdictrl/pom.xml>
to org.apache.deltaspike.cdictrl/cdictrl-project/1.8.0-SNAPSHOT/cdictrl-project-1.8.0-SNAPSHOT.pom
[JENKINS] Archiving <https://builds.apache.org/job/DeltaSpike%20Deploy/ws/deltaspike/modules/partial-bean/api/pom.xml>
to org.apache.deltaspike.modules/deltaspike-partial-bean-module-api/1.8.0-SNAPSHOT/deltaspike-partial-bean-module-api-1.8.0-SNAPSHOT.pom
[JENKINS] Archiving <https://builds.apache.org/job/DeltaSpike%20Deploy/ws/deltaspike/cdictrl/api/pom.xml>
to org.apache.deltaspike.cdictrl/deltaspike-cdictrl-api/1.8.0-SNAPSHOT/deltaspike-cdictrl-api-1.8.0-SNAPSHOT.pom
[JENKINS] Archiving <https://builds.apache.org/job/DeltaSpike%20Deploy/ws/deltaspike/modules/security/api/pom.xml>
to org.apache.deltaspike.modules/deltaspike-security-module-api/1.8.0-SNAPSHOT/deltaspike-security-module-api-1.8.0-SNAPSHOT.pom
[JENKINS] Archiving <https://builds.apache.org/job/DeltaSpike%20Deploy/ws/deltaspike/modules/data/api/pom.xml>
to org.apache.deltaspike.modules/deltaspike-data-module-api/1.8.0-SNAPSHOT/deltaspike-data-module-api-1.8.0-SNAPSHOT.pom
[JENKINS] Archiving <https://builds.apache.org/job/DeltaSpike%20Deploy/ws/documentation/pom.xml>
to org.apache.deltaspike/deltaspike-documentation/1.8.0-SNAPSHOT/deltaspike-documentation-1.8.0-SNAPSHOT.pom
[JENKINS] Archiving <https://builds.apache.org/job/DeltaSpike%20Deploy/ws/deltaspike/examples/jse-examples/pom.xml>
to org.apache.deltaspike.examples/deltaspike-jse-example/1.8.0-SNAPSHOT/deltaspike-jse-example-1.8.0-SNAPSHOT.pom
[JENKINS] Archiving <https://builds.apache.org/job/DeltaSpike%20Deploy/ws/deltaspike/examples/pom.xml>
to org.apache.deltaspike.examples/examples-project/1.8.0-SNAPSHOT/examples-project-1.8.0-SNAPSHOT.pom
[JENKINS] Archiving <https://builds.apache.org/job/DeltaSpike%20Deploy/ws/deltaspike/modules/jpa/pom.xml>
to org.apache.deltaspike.modules/jpa-module-project/1.8.0-SNAPSHOT/jpa-module-project-1.8.0-SNAPSHOT.pom
[JENKINS] Archiving <https://builds.apache.org/job/DeltaSpike%20Deploy/ws/deltaspike/modules/servlet/pom.xml>
to org.apache.deltaspike.modules/servlet-module-project/1.8.0-SNAPSHOT/servlet-module-project-1.8.0-SNAPSHOT.pom
[JENKINS] Archiving <https://builds.apache.org/job/DeltaSpike%20Deploy/ws/deltaspike/pom.xml>
to org.apache.deltaspike/deltaspike-project/1.8.0-SNAPSHOT/deltaspike-project-1.8.0-SNAPSHOT.pom
[JENKINS] Archiving <https://builds.apache.org/job/DeltaSpike%20Deploy/ws/pom.xml> to
org.apache.deltaspike/deltaspike/1.8.0-SNAPSHOT/deltaspike-1.8.0-SNAPSHOT.pom
[JENKINS] Archiving <https://builds.apache.org/job/DeltaSpike%20Deploy/ws/deltaspike/core/impl/pom.xml>
to org.apache.deltaspike.core/deltaspike-core-impl/1.8.0-SNAPSHOT/deltaspike-core-impl-1.8.0-SNAPSHOT.pom
[JENKINS] Archiving <https://builds.apache.org/job/DeltaSpike%20Deploy/ws/deltaspike/modules/partial-bean/pom.xml>
to org.apache.deltaspike.modules/partial-bean-module-project/1.8.0-SNAPSHOT/partial-bean-module-project-1.8.0-SNAPSHOT.pom
[JENKINS] Archiving <https://builds.apache.org/job/DeltaSpike%20Deploy/ws/deltaspike/cdictrl/impl-weld/pom.xml>
to org.apache.deltaspike.cdictrl/deltaspike-cdictrl-weld/1.8.0-SNAPSHOT/deltaspike-cdictrl-weld-1.8.0-SNAPSHOT.pom
[JENKINS] Archiving <https://builds.apache.org/job/DeltaSpike%20Deploy/ws/deltaspike/cdictrl/impl-owb/pom.xml>
to org.apache.deltaspike.cdictrl/deltaspike-cdictrl-owb/1.8.0-SNAPSHOT/deltaspike-cdictrl-owb-1.8.0-SNAPSHOT.pom
[JENKINS] Archiving <https://builds.apache.org/job/DeltaSpike%20Deploy/ws/deltaspike/modules/proxy/pom.xml>
to org.apache.deltaspike.modules/proxy-module-project/1.8.0-SNAPSHOT/proxy-module-project-1.8.0-SNAPSHOT.pom
[JENKINS] Archiving <https://builds.apache.org/job/DeltaSpike%20Deploy/ws/deltaspike/parent/pom.xml>
to org.apache.deltaspike/parent/1.8.0-SNAPSHOT/parent-1.8.0-SNAPSHOT.pom
Compressed 40.41 KB of artifacts by 79.2% relative to #1829
[JENKINS] Archiving <https://builds.apache.org/job/DeltaSpike%20Deploy/ws/deltaspike/modules/security/impl/pom.xml>
to org.apache.deltaspike.modules/deltaspike-security-module-impl/1.8.0-SNAPSHOT/deltaspike-security-module-impl-1.8.0-SNAPSHOT.pom
[JENKINS] Archiving <https://builds.apache.org/job/DeltaSpike%20Deploy/ws/deltaspike/modules/jpa/api/pom.xml>
to org.apache.deltaspike.modules/deltaspike-jpa-module-api/1.8.0-SNAPSHOT/deltaspike-jpa-module-api-1.8.0-SNAPSHOT.pom
[JENKINS] Archiving <https://builds.apache.org/job/DeltaSpike%20Deploy/ws/deltaspike/modules/proxy/impl-asm5/pom.xml>
to org.apache.deltaspike.modules/deltaspike-proxy-module-impl-asm5/1.8.0-SNAPSHOT/deltaspike-proxy-module-impl-asm5-1.8.0-SNAPSHOT.pom
[JENKINS] Archiving <https://builds.apache.org/job/DeltaSpike%20Deploy/ws/deltaspike/dist/bom/pom.xml>
to org.apache.deltaspike.distribution/distributions-bom/1.8.0-SNAPSHOT/distributions-bom-1.8.0-SNAPSHOT.pom
[JENKINS] Archiving <https://builds.apache.org/job/DeltaSpike%20Deploy/ws/deltaspike/modules/bean-validation/pom.xml>
to org.apache.deltaspike.modules/bean-validation-module-project/1.8.0-SNAPSHOT/bean-validation-module-project-1.8.0-SNAPSHOT.pom
[JENKINS] Archiving <https://builds.apache.org/job/DeltaSpike%20Deploy/ws/deltaspike/parent/code/pom.xml>
to org.apache.deltaspike/parent-code/1.8.0-SNAPSHOT/parent-code-1.8.0-SNAPSHOT.pom
[JENKINS] Archiving <https://builds.apache.org/job/DeltaSpike%20Deploy/ws/deltaspike/parent/code/target/parent-code-1.8.0-SNAPSHOT-tests.jar>
to org.apache.deltaspike/parent-code/1.8.0-20170409.134348-152/parent-code-1.8.0-20170409.134348-152-tests.jar
Compressed 98.28 KB of artifacts by 65.1% relative to #1829
[JENKINS] Archiving <https://builds.apache.org/job/DeltaSpike%20Deploy/ws/deltaspike/modules/jpa/impl/pom.xml>
to org.apache.deltaspike.modules/deltaspike-jpa-module-impl/1.8.0-SNAPSHOT/deltaspike-jpa-module-impl-1.8.0-SNAPSHOT.pom
[JENKINS] Archiving <https://builds.apache.org/job/DeltaSpike%20Deploy/ws/deltaspike/modules/partial-bean/impl/pom.xml>
to org.apache.deltaspike.modules/deltaspike-partial-bean-module-impl/1.8.0-SNAPSHOT/deltaspike-partial-bean-module-impl-1.8.0-SNAPSHOT.pom
[JENKINS] Archiving <https://builds.apache.org/job/DeltaSpike%20Deploy/ws/deltaspike/cdictrl/servlet/pom.xml>
to org.apache.deltaspike.cdictrl/deltaspike-cdictrl-servlet/1.8.0-SNAPSHOT/deltaspike-cdictrl-servlet-1.8.0-SNAPSHOT.pom
[JENKINS] Archiving <https://builds.apache.org/job/DeltaSpike%20Deploy/ws/deltaspike/modules/scheduler/api/pom.xml>
to org.apache.deltaspike.modules/deltaspike-scheduler-module-api/1.8.0-SNAPSHOT/deltaspike-scheduler-module-api-1.8.0-SNAPSHOT.pom
[JENKINS] Archiving <https://builds.apache.org/job/DeltaSpike%20Deploy/ws/deltaspike/modules/test-control/pom.xml>
to org.apache.deltaspike.modules/test-control-module-project/1.8.0-SNAPSHOT/test-control-module-project-1.8.0-SNAPSHOT.pom
[JENKINS] Archiving <https://builds.apache.org/job/DeltaSpike%20Deploy/ws/deltaspike/modules/scheduler/impl/pom.xml>
to org.apache.deltaspike.modules/deltaspike-scheduler-module-impl/1.8.0-SNAPSHOT/deltaspike-scheduler-module-impl-1.8.0-SNAPSHOT.pom
[JENKINS] Archiving <https://builds.apache.org/job/DeltaSpike%20Deploy/ws/deltaspike/examples/jsf-playground/pom.xml>
to org.apache.deltaspike.examples/deltaspike-jsf-playground/1.8.0-SNAPSHOT/deltaspike-jsf-playground-1.8.0-SNAPSHOT.pom
[JENKINS] Archiving <https://builds.apache.org/job/DeltaSpike%20Deploy/ws/deltaspike/modules/test-control/impl/pom.xml>
to org.apache.deltaspike.modules/deltaspike-test-control-module-impl/1.8.0-SNAPSHOT/deltaspike-test-control-module-impl-1.8.0-SNAPSHOT.pom
[JENKINS] Archiving <https://builds.apache.org/job/DeltaSpike%20Deploy/ws/deltaspike/checkstyle-rules/pom.xml>
to org.apache.deltaspike/checkstyle-rules/1.8.0-SNAPSHOT/checkstyle-rules-1.8.0-SNAPSHOT.pom
[JENKINS] Archiving <https://builds.apache.org/job/DeltaSpike%20Deploy/ws/deltaspike/checkstyle-rules/target/checkstyle-rules-1.8.0-SNAPSHOT.jar>
to org.apache.deltaspike/checkstyle-rules/1.8.0-20170409.134310-152/checkstyle-rules-1.8.0-20170409.134310-152.jar
[JENKINS] Archiving <https://builds.apache.org/job/DeltaSpike%20Deploy/ws/deltaspike/checkstyle-rules/target/checkstyle-rules-1.8.0-SNAPSHOT-sources.jar>
to org.apache.deltaspike/checkstyle-rules/1.8.0-20170409.134310-152/checkstyle-rules-1.8.0-20170409.134310-152-sources.jar
[JENKINS] Archiving <https://builds.apache.org/job/DeltaSpike%20Deploy/ws/deltaspike/modules/proxy/api/pom.xml>
to org.apache.deltaspike.modules/deltaspike-proxy-module-api/1.8.0-SNAPSHOT/deltaspike-proxy-module-api-1.8.0-SNAPSHOT.pom
[JENKINS] Archiving <https://builds.apache.org/job/DeltaSpike%20Deploy/ws/deltaspike/modules/servlet/api/pom.xml>
to org.apache.deltaspike.modules/deltaspike-servlet-module-api/1.8.0-SNAPSHOT/deltaspike-servlet-module-api-1.8.0-SNAPSHOT.pom
[JENKINS] Archiving <https://builds.apache.org/job/DeltaSpike%20Deploy/ws/deltaspike/examples/data-examples/pom.xml>
to org.apache.deltaspike.examples/deltaspike-data-examples/1.8.0-SNAPSHOT/deltaspike-data-examples-1.8.0-SNAPSHOT.pom
[JENKINS] Archiving <https://builds.apache.org/job/DeltaSpike%20Deploy/ws/deltaspike/core/api/pom.xml>
to org.apache.deltaspike.core/deltaspike-core-api/1.8.0-SNAPSHOT/deltaspike-core-api-1.8.0-SNAPSHOT.pom
[JENKINS] Archiving <https://builds.apache.org/job/DeltaSpike%20Deploy/ws/deltaspike/core/api/target/deltaspike-core-api-1.8.0-SNAPSHOT.jar>
to org.apache.deltaspike.core/deltaspike-core-api/1.8.0-20170409.134440-152/deltaspike-core-api-1.8.0-20170409.134440-152.jar
[JENKINS] Archiving <https://builds.apache.org/job/DeltaSpike%20Deploy/ws/deltaspike/core/api/target/deltaspike-core-api-1.8.0-SNAPSHOT-tests.jar>
to org.apache.deltaspike.core/deltaspike-core-api/1.8.0-20170409.134440-152/deltaspike-core-api-1.8.0-20170409.134440-152-tests.jar
[JENKINS] Archiving <https://builds.apache.org/job/DeltaSpike%20Deploy/ws/deltaspike/core/api/target/deltaspike-core-api-1.8.0-SNAPSHOT-sources.jar>
to org.apache.deltaspike.core/deltaspike-core-api/1.8.0-20170409.134440-152/deltaspike-core-api-1.8.0-20170409.134440-152-sources.jar
[JENKINS] Archiving <https://builds.apache.org/job/DeltaSpike%20Deploy/ws/deltaspike/examples/security-requested-page-after-login-picketlink/pom.xml>
to org.apache.deltaspike.examples/deltaspike-security-requested-page-after-login-picketlink/1.8.0-SNAPSHOT/deltaspike-security-requested-page-after-login-picketlink-1.8.0-SNAPSHOT.pom
[JENKINS] Archiving <https://builds.apache.org/job/DeltaSpike%20Deploy/ws/deltaspike/modules/bean-validation/api/pom.xml>
to org.apache.deltaspike.modules/deltaspike-bean-validation-module-api/1.8.0-SNAPSHOT/deltaspike-bean-validation-module-api-1.8.0-SNAPSHOT.pom
[JENKINS] Archiving <https://builds.apache.org/job/DeltaSpike%20Deploy/ws/deltaspike/examples/scheduler-playground/pom.xml>
to org.apache.deltaspike.examples/deltaspike-scheduler-example/1.8.0-SNAPSHOT/deltaspike-scheduler-example-1.8.0-SNAPSHOT.pom
[JENKINS] Archiving <https://builds.apache.org/job/DeltaSpike%20Deploy/ws/deltaspike/modules/pom.xml>
to org.apache.deltaspike.modules/modules-project/1.8.0-SNAPSHOT/modules-project-1.8.0-SNAPSHOT.pom
[JENKINS] Archiving <https://builds.apache.org/job/DeltaSpike%20Deploy/ws/deltaspike/modules/scheduler/pom.xml>
to org.apache.deltaspike.modules/scheduler-module-project/1.8.0-SNAPSHOT/scheduler-module-project-1.8.0-SNAPSHOT.pom
[JENKINS] Archiving <https://builds.apache.org/job/DeltaSpike%20Deploy/ws/deltaspike/test-utils/pom.xml>
to org.apache.deltaspike.test/test-utils/1.8.0-SNAPSHOT/test-utils-1.8.0-SNAPSHOT.pom
[JENKINS] Archiving <https://builds.apache.org/job/DeltaSpike%20Deploy/ws/deltaspike/test-utils/target/test-utils-1.8.0-SNAPSHOT.jar>
to org.apache.deltaspike.test/test-utils/1.8.0-20170409.134340-152/test-utils-1.8.0-20170409.134340-152.jar
[JENKINS] Archiving <https://builds.apache.org/job/DeltaSpike%20Deploy/ws/deltaspike/test-utils/target/test-utils-1.8.0-SNAPSHOT-sources.jar>
to org.apache.deltaspike.test/test-utils/1.8.0-20170409.134340-152/test-utils-1.8.0-20170409.134340-152-sources.jar
[JENKINS] Archiving <https://builds.apache.org/job/DeltaSpike%20Deploy/ws/deltaspike/modules/security/pom.xml>
to org.apache.deltaspike.modules/security-module-project/1.8.0-SNAPSHOT/security-module-project-1.8.0-SNAPSHOT.pom
[JENKINS] Archiving <https://builds.apache.org/job/DeltaSpike%20Deploy/ws/deltaspike/modules/jsf/api/pom.xml>
to org.apache.deltaspike.modules/deltaspike-jsf-module-api/1.8.0-SNAPSHOT/deltaspike-jsf-module-api-1.8.0-SNAPSHOT.pom
[JENKINS] Archiving <https://builds.apache.org/job/DeltaSpike%20Deploy/ws/deltaspike/modules/data/pom.xml>
to org.apache.deltaspike.modules/data-module-project/1.8.0-SNAPSHOT/data-module-project-1.8.0-SNAPSHOT.pom
[JENKINS] Archiving <https://builds.apache.org/job/DeltaSpike%20Deploy/ws/deltaspike/modules/servlet/impl/pom.xml>
to org.apache.deltaspike.modules/deltaspike-servlet-module-impl/1.8.0-SNAPSHOT/deltaspike-servlet-module-impl-1.8.0-SNAPSHOT.pom
[JENKINS] Archiving <https://builds.apache.org/job/DeltaSpike%20Deploy/ws/deltaspike/modules/test-control/api/pom.xml>
to org.apache.deltaspike.modules/deltaspike-test-control-module-api/1.8.0-SNAPSHOT/deltaspike-test-control-module-api-1.8.0-SNAPSHOT.pom
[JENKINS] Archiving <https://builds.apache.org/job/DeltaSpike%20Deploy/ws/deltaspike/cdictrl/impl-openejb/pom.xml>
to org.apache.deltaspike.cdictrl/deltaspike-cdictrl-openejb/1.8.0-SNAPSHOT/deltaspike-cdictrl-openejb-1.8.0-SNAPSHOT.pom
[JENKINS] Archiving <https://builds.apache.org/job/DeltaSpike%20Deploy/ws/deltaspike/examples/jsf-examples/pom.xml>
to org.apache.deltaspike.examples/deltaspike-jsf-example/1.8.0-SNAPSHOT/deltaspike-jsf-example-1.8.0-SNAPSHOT.pom
[JENKINS] Archiving <https://builds.apache.org/job/DeltaSpike%20Deploy/ws/deltaspike/modules/jsf/impl-ee6/pom.xml>
to org.apache.deltaspike.modules/deltaspike-jsf-module-impl-ee6/1.8.0-SNAPSHOT/deltaspike-jsf-module-impl-ee6-1.8.0-SNAPSHOT.pom
[JENKINS] Archiving <https://builds.apache.org/job/DeltaSpike%20Deploy/ws/deltaspike/examples/security-requested-page-after-login-cdi/pom.xml>
to org.apache.deltaspike.examples/deltaspike-security-requested-page-after-login-cdi/1.8.0-SNAPSHOT/deltaspike-security-requested-page-after-login-cdi-1.8.0-SNAPSHOT.pom
[JENKINS] Archiving <https://builds.apache.org/job/DeltaSpike%20Deploy/ws/deltaspike/core/pom.xml>
to org.apache.deltaspike.core/core-project/1.8.0-SNAPSHOT/core-project-1.8.0-SNAPSHOT.pom
[JENKINS] Archiving <https://builds.apache.org/job/DeltaSpike%20Deploy/ws/deltaspike/core/target/core-project-1.8.0-SNAPSHOT-tests.jar>
to org.apache.deltaspike.core/core-project/1.8.0-20170409.134353-152/core-project-1.8.0-20170409.134353-152-tests.jar
[JENKINS] Archiving <https://builds.apache.org/job/DeltaSpike%20Deploy/ws/deltaspike/dist/full/pom.xml>
to org.apache.deltaspike.distribution/distribution-full/1.8.0-SNAPSHOT/distribution-full-1.8.0-SNAPSHOT.pom
[JENKINS] Archiving <https://builds.apache.org/job/DeltaSpike%20Deploy/ws/site/pom.xml>
to org.apache.deltaspike/deltaspike-site/1.8.0-SNAPSHOT/deltaspike-site-1.8.0-SNAPSHOT.pom
Sending e-mails to: commits@deltaspike.apache.org
channel stopped

Mime
View raw message