deltaspike-commits mailing list archives

Site index · List index
Message view « Date » · « Thread »
Top « Date » · « Thread »
From Apache Jenkins Server <jenk...@builds.apache.org>
Subject Build failed in Jenkins: DeltaSpike Weld 2.0.0.SP1 #668
Date Sun, 02 Apr 2017 13:33:06 GMT
See <https://builds.apache.org/job/DeltaSpike%20Weld%202.0.0.SP1/668/display/redirect?page=changes>

Changes:

[struberg] update local buildscript to more recent versions

------------------------------------------
Started by upstream project "DeltaSpike for CDI 1.1 and 1.2" build number 51
originally caused by:
 Started by an SCM change
[EnvInject] - Loading node environment variables.
Building remotely on ubuntu-us1 (ubuntu) in workspace <https://builds.apache.org/job/DeltaSpike%20Weld%202.0.0.SP1/ws/>
 > git rev-parse --is-inside-work-tree # timeout=10
Fetching changes from the remote Git repository
 > git config remote.origin.url https://git-wip-us.apache.org/repos/asf/deltaspike.git
# timeout=10
Fetching upstream changes from https://git-wip-us.apache.org/repos/asf/deltaspike.git
 > git --version # timeout=10
 > git fetch --tags --progress https://git-wip-us.apache.org/repos/asf/deltaspike.git +refs/heads/*:refs/remotes/origin/*
 > git rev-parse origin/master^{commit} # timeout=10
Checking out Revision 7ff97717f201ea67bea4a99c9af47e50f948acb9 (origin/master)
 > git config core.sparsecheckout # timeout=10
 > git checkout -f 7ff97717f201ea67bea4a99c9af47e50f948acb9
 > git rev-list 853bd6ffca53f44d8bb482b1dbb330ec7b85c9b5 # timeout=10
Parsing POMs
Modules changed, recalculating dependency graph
Established TCP socket on 42054
maven3-agent.jar already up to date
maven3-interceptor.jar already up to date
maven3-interceptor-commons.jar already up to date
[DeltaSpike Weld 2.0.0.SP1] $ /home/jenkins/tools/java/latest1.7/bin/java -Xmx2g -Xms256m
-cp /home/jenkins/jenkins-slave/maven3-agent.jar:/home/jenkins/tools/maven/apache-maven-3.0.4/boot/plexus-classworlds-2.4.jar
org.jvnet.hudson.maven3.agent.Maven3Main /home/jenkins/tools/maven/apache-maven-3.0.4 /home/jenkins/jenkins-slave/slave.jar
/home/jenkins/jenkins-slave/maven3-interceptor.jar /home/jenkins/jenkins-slave/maven3-interceptor-commons.jar
42054
<===[JENKINS REMOTING CAPACITY]===>   channel started
Executing Maven:  -B -f <https://builds.apache.org/job/DeltaSpike%20Weld%202.0.0.SP1/ws/pom.xml>
-Dmaven.repo.local=/home/jenkins/jenkins-slave/maven-repositories/1 clean install -PWeld2
-Dweld.version=2.0.0.SP1
[INFO] Scanning for projects...
[ERROR] The build could not read 4 projects -> [Help 1]
[ERROR]   
[ERROR]   The project org.apache.deltaspike:parent-code:1.8.0-SNAPSHOT (<https://builds.apache.org/job/DeltaSpike%20Weld%202.0.0.SP1/ws/deltaspike/parent/code/pom.xml)>
has 1 error
[ERROR]     'dependencies.dependency.version' for org.jboss.weld:weld-core-impl:jar is missing.
@ line 437, column 29
[ERROR]   
[ERROR]   The project org.apache.deltaspike.core:core-project:1.8.0-SNAPSHOT (<https://builds.apache.org/job/DeltaSpike%20Weld%202.0.0.SP1/ws/deltaspike/core/pom.xml)>
has 1 error
[ERROR]     'dependencies.dependency.version' for org.jboss.weld:weld-core-impl:jar is missing.
@ org.apache.deltaspike:parent-code:1.8.0-SNAPSHOT, <https://builds.apache.org/job/DeltaSpike%20Weld%202.0.0.SP1/ws/deltaspike/parent/code/pom.xml,>
line 437, column 29
[ERROR]   
[ERROR]   The project org.apache.deltaspike.cdictrl:cdictrl-project:1.8.0-SNAPSHOT (<https://builds.apache.org/job/DeltaSpike%20Weld%202.0.0.SP1/ws/deltaspike/cdictrl/pom.xml)>
has 1 error
[ERROR]     'dependencies.dependency.version' for org.jboss.weld:weld-core-impl:jar is missing.
@ org.apache.deltaspike:parent-code:1.8.0-SNAPSHOT, <https://builds.apache.org/job/DeltaSpike%20Weld%202.0.0.SP1/ws/deltaspike/parent/code/pom.xml,>
line 437, column 29
[ERROR]   
[ERROR]   The project org.apache.deltaspike.modules:modules-project:1.8.0-SNAPSHOT (<https://builds.apache.org/job/DeltaSpike%20Weld%202.0.0.SP1/ws/deltaspike/modules/pom.xml)>
has 1 error
[ERROR]     'dependencies.dependency.version' for org.jboss.weld:weld-core-impl:jar is missing.
@ org.apache.deltaspike:parent-code:1.8.0-SNAPSHOT, <https://builds.apache.org/job/DeltaSpike%20Weld%202.0.0.SP1/ws/deltaspike/parent/code/pom.xml,>
line 437, column 29
[ERROR] 
[ERROR] To see the full stack trace of the errors, re-run Maven with the -e switch.
[ERROR] Re-run Maven using the -X switch to enable full debug logging.
[ERROR] 
[ERROR] For more information about the errors and possible solutions, please read the following
articles:
[ERROR] [Help 1] http://cwiki.apache.org/confluence/display/MAVEN/ProjectBuildingException
channel stopped

Mime
View raw message