deltaspike-commits mailing list archives

Site index · List index
Message view « Date » · « Thread »
Top « Date » · « Thread »
From Apache Jenkins Server <jenk...@builds.apache.org>
Subject Build failed in Jenkins: DeltaSpike_TomEE-SNAPSHOT #926
Date Tue, 15 Nov 2016 08:23:52 GMT
See <https://builds.apache.org/job/DeltaSpike_TomEE-SNAPSHOT/926/changes>

Changes:

[johndament] Setting master to 1.8.0-SNAPSHOT

------------------------------------------
[...truncated 194 lines...]
[INFO] Installing <https://builds.apache.org/job/DeltaSpike_TomEE-SNAPSHOT/ws/deltaspike/parent/pom.xml>
to /home/jenkins/jenkins-slave/maven-repositories/1/org/apache/deltaspike/parent/1.8.0-SNAPSHOT/parent-1.8.0-SNAPSHOT.pom
[INFO]                                                                         
[INFO] ------------------------------------------------------------------------
[INFO] Building Apache DeltaSpike Test-Utils 1.8.0-SNAPSHOT
[INFO] ------------------------------------------------------------------------
[INFO] 
[INFO] --- maven-clean-plugin:3.0.0:clean (default-clean) @ test-utils ---
[INFO] 
[INFO] --- maven-bundle-plugin:2.3.7:cleanVersions (versions) @ test-utils ---
[INFO] 
[INFO] --- maven-antrun-plugin:1.8:run (javadoc.resources) @ test-utils ---
[WARNING] Parameter tasks is deprecated, use target instead
[INFO] Executing tasks

main:
[INFO] Executed tasks
[INFO] 
[INFO] --- maven-remote-resources-plugin:1.5:process (process-resource-bundles) @ test-utils
---
[INFO] 
[INFO] --- maven-resources-plugin:2.7:resources (default-resources) @ test-utils ---
[INFO] Using 'UTF-8' encoding to copy filtered resources.
[INFO] Copying 3 resources
[INFO] Copying 3 resources
[INFO] 
[INFO] --- maven-compiler-plugin:2.5:compile (default-compile) @ test-utils ---
[INFO] Compiling 13 source files to <https://builds.apache.org/job/DeltaSpike_TomEE-SNAPSHOT/ws/deltaspike/test-utils/target/classes>
[INFO] 
[INFO] --- maven-resources-plugin:2.7:testResources (default-testResources) @ test-utils ---
[INFO] Using 'UTF-8' encoding to copy filtered resources.
[INFO] skip non existing resourceDirectory <https://builds.apache.org/job/DeltaSpike_TomEE-SNAPSHOT/ws/deltaspike/test-utils/src/test/resources>
[INFO] Copying 3 resources
[INFO] 
[INFO] --- maven-compiler-plugin:2.5:testCompile (default-testCompile) @ test-utils ---
[INFO] No sources to compile
[INFO] 
[INFO] --- maven-surefire-plugin:2.11:test (default-test) @ test-utils ---
[INFO] Surefire report directory: <https://builds.apache.org/job/DeltaSpike_TomEE-SNAPSHOT/ws/deltaspike/test-utils/target/surefire-reports>
[INFO] Using configured provider org.apache.maven.surefire.junitcore.JUnitCoreProvider

-------------------------------------------------------
 T E S T S
-------------------------------------------------------
Concurrency config is parallel='none', perCoreThreadCount=true, threadCount=2, useUnlimitedThreads=false

Results :

Tests run: 0, Failures: 0, Errors: 0, Skipped: 0

[JENKINS] Recording test results
[INFO] 
[INFO] --- maven-jar-plugin:2.4:jar (default-jar) @ test-utils ---
[INFO] Building jar: <https://builds.apache.org/job/DeltaSpike_TomEE-SNAPSHOT/ws/deltaspike/test-utils/target/test-utils-1.8.0-SNAPSHOT.jar>
[INFO] 
[INFO] --- maven-site-plugin:3.5.1:attach-descriptor (attach-descriptor) @ test-utils ---
[INFO] 
[INFO] >>> maven-source-plugin:3.0.0:jar (attach-sources) > generate-sources @
test-utils >>>
[INFO] 
[INFO] --- maven-bundle-plugin:2.3.7:cleanVersions (versions) @ test-utils ---
[INFO] 
[INFO] --- maven-antrun-plugin:1.8:run (javadoc.resources) @ test-utils ---
[WARNING] Parameter tasks is deprecated, use target instead
[INFO] Executing tasks

main:
[INFO] Executed tasks
[WARNING] Failed to getClass for org.apache.maven.plugins.source.SourceJarMojo
[INFO] 
[INFO] <<< maven-source-plugin:3.0.0:jar (attach-sources) < generate-sources @
test-utils <<<
[INFO] 
[INFO] --- maven-source-plugin:3.0.0:jar (attach-sources) @ test-utils ---
[INFO] Building jar: <https://builds.apache.org/job/DeltaSpike_TomEE-SNAPSHOT/ws/deltaspike/test-utils/target/test-utils-1.8.0-SNAPSHOT-sources.jar>
[INFO] 
[INFO] --- maven-checkstyle-plugin:2.9.1:check (verify-style) @ test-utils ---
[INFO] Starting audit...
Audit done.

[INFO] 
[INFO] --- maven-install-plugin:2.5.2:install (default-install) @ test-utils ---
[INFO] Installing <https://builds.apache.org/job/DeltaSpike_TomEE-SNAPSHOT/ws/deltaspike/test-utils/target/test-utils-1.8.0-SNAPSHOT.jar>
to /home/jenkins/jenkins-slave/maven-repositories/1/org/apache/deltaspike/test/test-utils/1.8.0-SNAPSHOT/test-utils-1.8.0-SNAPSHOT.jar
[INFO] Installing <https://builds.apache.org/job/DeltaSpike_TomEE-SNAPSHOT/ws/deltaspike/test-utils/pom.xml>
to /home/jenkins/jenkins-slave/maven-repositories/1/org/apache/deltaspike/test/test-utils/1.8.0-SNAPSHOT/test-utils-1.8.0-SNAPSHOT.pom
[INFO] Installing <https://builds.apache.org/job/DeltaSpike_TomEE-SNAPSHOT/ws/deltaspike/test-utils/target/test-utils-1.8.0-SNAPSHOT-sources.jar>
to /home/jenkins/jenkins-slave/maven-repositories/1/org/apache/deltaspike/test/test-utils/1.8.0-SNAPSHOT/test-utils-1.8.0-SNAPSHOT-sources.jar
[INFO]                                                                         
[INFO] ------------------------------------------------------------------------
[INFO] Building Apache DeltaSpike Code Parent 1.8.0-SNAPSHOT
[INFO] ------------------------------------------------------------------------
[INFO] Downloading: https://repository.apache.org/content/repositories/releases/org/apache/openejb/javaee-api/6.0-5/javaee-api-6.0-5.pom
[INFO] Downloaded: https://repository.apache.org/content/repositories/releases/org/apache/openejb/javaee-api/6.0-5/javaee-api-6.0-5.pom
(21 KB at 18.5 KB/sec)
[INFO] Downloading: https://repository.apache.org/content/repositories/snapshots/org/apache/openejb/apache-tomee/1.7.3-SNAPSHOT/maven-metadata.xml
[INFO] Downloading: https://repository.apache.org/content/repositories/releases/org/apache/openejb/apache-tomee/1.7.3-SNAPSHOT/maven-metadata.xml
[INFO] Downloading: http://repository.apache.org/snapshots/org/apache/openejb/apache-tomee/1.7.3-SNAPSHOT/maven-metadata.xml
[INFO] Downloading: https://repository.apache.org/content/repositories/releases/org/apache/openejb/apache-tomee/1.7.3-SNAPSHOT/apache-tomee-1.7.3-SNAPSHOT.pom
[INFO] Downloading: https://repository.apache.org/content/repositories/snapshots/org/apache/openejb/apache-tomee/1.7.3-SNAPSHOT/apache-tomee-1.7.3-SNAPSHOT.pom
[INFO] Downloading: http://repository.apache.org/snapshots/org/apache/openejb/apache-tomee/1.7.3-SNAPSHOT/apache-tomee-1.7.3-SNAPSHOT.pom
[WARNING] The POM for org.apache.openejb:apache-tomee:zip:webprofile:1.7.3-SNAPSHOT is missing,
no dependency information available
[INFO] Downloading: https://repository.apache.org/content/repositories/releases/org/apache/openejb/arquillian-tomee-remote/1.7.3-SNAPSHOT/maven-metadata.xml
[INFO] Downloading: https://repository.apache.org/content/repositories/snapshots/org/apache/openejb/arquillian-tomee-remote/1.7.3-SNAPSHOT/maven-metadata.xml
[INFO] Downloading: http://repository.apache.org/snapshots/org/apache/openejb/arquillian-tomee-remote/1.7.3-SNAPSHOT/maven-metadata.xml
[INFO] Downloading: https://repository.apache.org/content/repositories/releases/org/apache/openejb/arquillian-tomee-remote/1.7.3-SNAPSHOT/arquillian-tomee-remote-1.7.3-SNAPSHOT.pom
[INFO] Downloading: https://repository.apache.org/content/repositories/snapshots/org/apache/openejb/arquillian-tomee-remote/1.7.3-SNAPSHOT/arquillian-tomee-remote-1.7.3-SNAPSHOT.pom
[INFO] Downloading: http://repository.apache.org/snapshots/org/apache/openejb/arquillian-tomee-remote/1.7.3-SNAPSHOT/arquillian-tomee-remote-1.7.3-SNAPSHOT.pom
[WARNING] The POM for org.apache.openejb:arquillian-tomee-remote:jar:1.7.3-SNAPSHOT is missing,
no dependency information available
[INFO] Downloading: https://repository.apache.org/content/repositories/releases/org/apache/openejb/javaee-api/6.0-5/javaee-api-6.0-5.jar
[INFO] Downloading: https://repository.apache.org/content/repositories/releases/org/apache/openejb/apache-tomee/1.7.3-SNAPSHOT/apache-tomee-1.7.3-SNAPSHOT-webprofile.zip
[INFO] Downloading: https://repository.apache.org/content/repositories/releases/org/apache/openejb/arquillian-tomee-remote/1.7.3-SNAPSHOT/arquillian-tomee-remote-1.7.3-SNAPSHOT.jar
[INFO] Downloaded: https://repository.apache.org/content/repositories/releases/org/apache/openejb/javaee-api/6.0-5/javaee-api-6.0-5.jar
(966 KB at 917.8 KB/sec)
[INFO] Downloading: https://repository.apache.org/content/repositories/snapshots/org/apache/openejb/apache-tomee/1.7.3-SNAPSHOT/apache-tomee-1.7.3-SNAPSHOT-webprofile.zip
[INFO] Downloading: https://repository.apache.org/content/repositories/snapshots/org/apache/openejb/arquillian-tomee-remote/1.7.3-SNAPSHOT/arquillian-tomee-remote-1.7.3-SNAPSHOT.jar
[INFO] Downloading: http://repository.apache.org/snapshots/org/apache/openejb/apache-tomee/1.7.3-SNAPSHOT/apache-tomee-1.7.3-SNAPSHOT-webprofile.zip
[INFO] Downloading: http://repository.apache.org/snapshots/org/apache/openejb/arquillian-tomee-remote/1.7.3-SNAPSHOT/arquillian-tomee-remote-1.7.3-SNAPSHOT.jar
[INFO] ------------------------------------------------------------------------
[INFO] Reactor Summary:
[INFO] 
[INFO] Apache DeltaSpike .................................. SUCCESS [ 15.192 s]
[INFO] Apache DeltaSpike Sources .......................... SUCCESS [  7.319 s]
[INFO] Apache DeltaSpike CheckStyle-rules ................. SUCCESS [ 24.352 s]
[INFO] Apache DeltaSpike Parent ........................... SUCCESS [ 21.391 s]
[INFO] Apache DeltaSpike Test-Utils ....................... SUCCESS [ 14.510 s]
[INFO] Apache DeltaSpike Code Parent ...................... FAILURE [ 13.409 s]
[INFO] Apache DeltaSpike Core ............................. SKIPPED
[INFO] Apache DeltaSpike Core-API ......................... SKIPPED
[INFO] Apache DeltaSpike Core-Implementation .............. SKIPPED
[INFO] Apache DeltaSpike ContainerControl parent .......... SKIPPED
[INFO] Apache DeltaSpike CDI ContainerControl API ......... SKIPPED
[INFO] Apache DeltaSpike CDI ContainerControl TCK ......... SKIPPED
[INFO] Apache DeltaSpike CDI OpenEJB-ContainerControl ..... SKIPPED
[INFO] Apache DeltaSpike Modules .......................... SKIPPED
[INFO] Apache DeltaSpike Proxy-Module ..................... SKIPPED
[INFO] Apache DeltaSpike Proxy-Module API ................. SKIPPED
[INFO] Apache DeltaSpike Proxy-Module Impl ASM5 ........... SKIPPED
[INFO] Apache DeltaSpike Security-Module .................. SKIPPED
[INFO] Apache DeltaSpike Security-Module API .............. SKIPPED
[INFO] Apache DeltaSpike Security-Module Impl ............. SKIPPED
[INFO] Apache DeltaSpike JPA-Module ....................... SKIPPED
[INFO] Apache DeltaSpike JPA-Module API ................... SKIPPED
[INFO] Apache DeltaSpike JPA-Module Impl .................. SKIPPED
[INFO] Apache DeltaSpike Servlet-Module ................... SKIPPED
[INFO] Apache DeltaSpike Servlet-Module API ............... SKIPPED
[INFO] Apache DeltaSpike Servlet-Module Impl .............. SKIPPED
[INFO] Apache DeltaSpike JSF-Module ....................... SKIPPED
[INFO] Apache DeltaSpike JSF-Module API ................... SKIPPED
[INFO] Apache DeltaSpike JSF-Module Impl .................. SKIPPED
[INFO] Apache DeltaSpike JSF-Module Impl (EE6 only) ....... SKIPPED
[INFO] Apache DeltaSpike Partial-Bean-Module .............. SKIPPED
[INFO] Apache DeltaSpike Partial-Bean-Module API .......... SKIPPED
[INFO] Apache DeltaSpike Partial-Bean-Module Impl ......... SKIPPED
[INFO] Apache DeltaSpike BeanValidation-Module ............ SKIPPED
[INFO] Apache DeltaSpike BeanValidation-Module API ........ SKIPPED
[INFO] Apache DeltaSpike BeanValidation-Module Impl ....... SKIPPED
[INFO] Apache DeltaSpike Data-Module ...................... SKIPPED
[INFO] Apache DeltaSpike Data-Module API .................. SKIPPED
[INFO] Apache DeltaSpike Data-Module Impl ................. SKIPPED
[INFO] Apache DeltaSpike Scheduler-Module ................. SKIPPED
[INFO] Apache DeltaSpike Scheduler-Module API ............. SKIPPED
[INFO] Apache DeltaSpike Scheduler-Module Impl ............ SKIPPED
[INFO] Apache DeltaSpike Test-Control-Module .............. SKIPPED
[INFO] Apache DeltaSpike Test-Control-Module API .......... SKIPPED
[INFO] Apache DeltaSpike Test-Control-Module Impl ......... SKIPPED
[INFO] Apache DeltaSpike Examples ......................... SKIPPED
[INFO] Apache DeltaSpike Java-SE Examples ................. SKIPPED
[INFO] Apache DeltaSpike JSF Examples ..................... SKIPPED
[INFO] Apache DeltaSpike JSF Playground ................... SKIPPED
[INFO] Apache DeltaSpike Security Example CDI ............. SKIPPED
[INFO] Apache DeltaSpike Security Example PicketLink ...... SKIPPED
[INFO] Apache DeltaSpike Java-SE Scheduler Examples ....... SKIPPED
[INFO] Apache DeltaSpike JPA Examples ..................... SKIPPED
[INFO] Apache DeltaSpike Data Examples .................... SKIPPED
[INFO] Apache DeltaSpike Documentation .................... SKIPPED
[INFO] Apache DeltaSpike Site ............................. SKIPPED
[INFO] ------------------------------------------------------------------------
[INFO] BUILD FAILURE
[INFO] ------------------------------------------------------------------------
[INFO] Total time: 03:14 min
[INFO] Finished at: 2016-11-15T08:04:20+00:00
[INFO] Final Memory: 61M/908M
[INFO] ------------------------------------------------------------------------
Waiting for Jenkins to finish collecting data
[ERROR] Failed to execute goal on project parent-code: Could not resolve dependencies for
project org.apache.deltaspike:parent-code:pom:1.8.0-SNAPSHOT: The following artifacts could
not be resolved: org.apache.openejb:apache-tomee:zip:webprofile:1.7.3-SNAPSHOT, org.apache.openejb:arquillian-tomee-remote:jar:1.7.3-SNAPSHOT:
Could not find artifact org.apache.openejb:apache-tomee:zip:webprofile:1.7.3-SNAPSHOT in Apache
Repository (https://repository.apache.org/content/repositories/releases) -> [Help 1]
[ERROR] 
[ERROR] To see the full stack trace of the errors, re-run Maven with the -e switch.
[ERROR] Re-run Maven using the -X switch to enable full debug logging.
[ERROR] 
[ERROR] For more information about the errors and possible solutions, please read the following
articles:
[ERROR] [Help 1] http://cwiki.apache.org/confluence/display/MAVEN/DependencyResolutionException
[ERROR] 
[ERROR] After correcting the problems, you can resume the build with the command
[ERROR]   mvn <goals> -rf :parent-code
[JENKINS] Archiving <https://builds.apache.org/job/DeltaSpike_TomEE-SNAPSHOT/ws/deltaspike/cdictrl/tck/pom.xml>
to org.apache.deltaspike.test/deltaspike-cdictrl-tck/1.8.0-SNAPSHOT/deltaspike-cdictrl-tck-1.8.0-SNAPSHOT.pom
[JENKINS] Archiving <https://builds.apache.org/job/DeltaSpike_TomEE-SNAPSHOT/ws/deltaspike/modules/jsf/impl/pom.xml>
to org.apache.deltaspike.modules/deltaspike-jsf-module-impl/1.8.0-SNAPSHOT/deltaspike-jsf-module-impl-1.8.0-SNAPSHOT.pom
[JENKINS] Archiving <https://builds.apache.org/job/DeltaSpike_TomEE-SNAPSHOT/ws/deltaspike/modules/data/impl/pom.xml>
to org.apache.deltaspike.modules/deltaspike-data-module-impl/1.8.0-SNAPSHOT/deltaspike-data-module-impl-1.8.0-SNAPSHOT.pom
[JENKINS] Archiving <https://builds.apache.org/job/DeltaSpike_TomEE-SNAPSHOT/ws/deltaspike/modules/jsf/pom.xml>
to org.apache.deltaspike.modules/jsf-module-project/1.8.0-SNAPSHOT/jsf-module-project-1.8.0-SNAPSHOT.pom
[JENKINS] Archiving <https://builds.apache.org/job/DeltaSpike_TomEE-SNAPSHOT/ws/deltaspike/modules/bean-validation/impl/pom.xml>
to org.apache.deltaspike.modules/deltaspike-bean-validation-module-impl/1.8.0-SNAPSHOT/deltaspike-bean-validation-module-impl-1.8.0-SNAPSHOT.pom
[JENKINS] Archiving <https://builds.apache.org/job/DeltaSpike_TomEE-SNAPSHOT/ws/deltaspike/examples/jpa-examples/pom.xml>
to org.apache.deltaspike.examples/deltaspike-jpa-examples/1.8.0-SNAPSHOT/deltaspike-jpa-examples-1.8.0-SNAPSHOT.pom
No prior successful build to compare, so performing full copy of artifacts
[JENKINS] Archiving <https://builds.apache.org/job/DeltaSpike_TomEE-SNAPSHOT/ws/deltaspike/cdictrl/pom.xml>
to org.apache.deltaspike.cdictrl/cdictrl-project/1.8.0-SNAPSHOT/cdictrl-project-1.8.0-SNAPSHOT.pom
[JENKINS] Archiving <https://builds.apache.org/job/DeltaSpike_TomEE-SNAPSHOT/ws/deltaspike/modules/partial-bean/api/pom.xml>
to org.apache.deltaspike.modules/deltaspike-partial-bean-module-api/1.8.0-SNAPSHOT/deltaspike-partial-bean-module-api-1.8.0-SNAPSHOT.pom
[JENKINS] Archiving <https://builds.apache.org/job/DeltaSpike_TomEE-SNAPSHOT/ws/deltaspike/cdictrl/api/pom.xml>
to org.apache.deltaspike.cdictrl/deltaspike-cdictrl-api/1.8.0-SNAPSHOT/deltaspike-cdictrl-api-1.8.0-SNAPSHOT.pom
[JENKINS] Archiving <https://builds.apache.org/job/DeltaSpike_TomEE-SNAPSHOT/ws/deltaspike/modules/security/api/pom.xml>
to org.apache.deltaspike.modules/deltaspike-security-module-api/1.8.0-SNAPSHOT/deltaspike-security-module-api-1.8.0-SNAPSHOT.pom
[JENKINS] Archiving <https://builds.apache.org/job/DeltaSpike_TomEE-SNAPSHOT/ws/deltaspike/modules/data/api/pom.xml>
to org.apache.deltaspike.modules/deltaspike-data-module-api/1.8.0-SNAPSHOT/deltaspike-data-module-api-1.8.0-SNAPSHOT.pom
[JENKINS] Archiving <https://builds.apache.org/job/DeltaSpike_TomEE-SNAPSHOT/ws/documentation/pom.xml>
to org.apache.deltaspike/deltaspike-documentation/1.8.0-SNAPSHOT/deltaspike-documentation-1.8.0-SNAPSHOT.pom
[JENKINS] Archiving <https://builds.apache.org/job/DeltaSpike_TomEE-SNAPSHOT/ws/deltaspike/examples/jse-examples/pom.xml>
to org.apache.deltaspike.examples/deltaspike-jse-example/1.8.0-SNAPSHOT/deltaspike-jse-example-1.8.0-SNAPSHOT.pom
[JENKINS] Archiving <https://builds.apache.org/job/DeltaSpike_TomEE-SNAPSHOT/ws/deltaspike/examples/pom.xml>
to org.apache.deltaspike.examples/examples-project/1.8.0-SNAPSHOT/examples-project-1.8.0-SNAPSHOT.pom
[JENKINS] Archiving <https://builds.apache.org/job/DeltaSpike_TomEE-SNAPSHOT/ws/deltaspike/modules/jpa/pom.xml>
to org.apache.deltaspike.modules/jpa-module-project/1.8.0-SNAPSHOT/jpa-module-project-1.8.0-SNAPSHOT.pom
[JENKINS] Archiving <https://builds.apache.org/job/DeltaSpike_TomEE-SNAPSHOT/ws/deltaspike/modules/servlet/pom.xml>
to org.apache.deltaspike.modules/servlet-module-project/1.8.0-SNAPSHOT/servlet-module-project-1.8.0-SNAPSHOT.pom
[JENKINS] Archiving <https://builds.apache.org/job/DeltaSpike_TomEE-SNAPSHOT/ws/deltaspike/pom.xml>
to org.apache.deltaspike/deltaspike-project/1.8.0-SNAPSHOT/deltaspike-project-1.8.0-SNAPSHOT.pom
[JENKINS] Archiving <https://builds.apache.org/job/DeltaSpike_TomEE-SNAPSHOT/ws/pom.xml>
to org.apache.deltaspike/deltaspike/1.8.0-SNAPSHOT/deltaspike-1.8.0-SNAPSHOT.pom
[JENKINS] Archiving <https://builds.apache.org/job/DeltaSpike_TomEE-SNAPSHOT/ws/deltaspike/core/impl/pom.xml>
to org.apache.deltaspike.core/deltaspike-core-impl/1.8.0-SNAPSHOT/deltaspike-core-impl-1.8.0-SNAPSHOT.pom
[JENKINS] Archiving <https://builds.apache.org/job/DeltaSpike_TomEE-SNAPSHOT/ws/deltaspike/modules/partial-bean/pom.xml>
to org.apache.deltaspike.modules/partial-bean-module-project/1.8.0-SNAPSHOT/partial-bean-module-project-1.8.0-SNAPSHOT.pom
[JENKINS] Archiving <https://builds.apache.org/job/DeltaSpike_TomEE-SNAPSHOT/ws/deltaspike/modules/proxy/pom.xml>
to org.apache.deltaspike.modules/proxy-module-project/1.8.0-SNAPSHOT/proxy-module-project-1.8.0-SNAPSHOT.pom
[JENKINS] Archiving <https://builds.apache.org/job/DeltaSpike_TomEE-SNAPSHOT/ws/deltaspike/parent/pom.xml>
to org.apache.deltaspike/parent/1.8.0-SNAPSHOT/parent-1.8.0-SNAPSHOT.pom
[JENKINS] Archiving <https://builds.apache.org/job/DeltaSpike_TomEE-SNAPSHOT/ws/deltaspike/modules/security/impl/pom.xml>
to org.apache.deltaspike.modules/deltaspike-security-module-impl/1.8.0-SNAPSHOT/deltaspike-security-module-impl-1.8.0-SNAPSHOT.pom
[JENKINS] Archiving <https://builds.apache.org/job/DeltaSpike_TomEE-SNAPSHOT/ws/deltaspike/modules/jpa/api/pom.xml>
to org.apache.deltaspike.modules/deltaspike-jpa-module-api/1.8.0-SNAPSHOT/deltaspike-jpa-module-api-1.8.0-SNAPSHOT.pom
[JENKINS] Archiving <https://builds.apache.org/job/DeltaSpike_TomEE-SNAPSHOT/ws/deltaspike/modules/proxy/impl-asm5/pom.xml>
to org.apache.deltaspike.modules/deltaspike-proxy-module-impl-asm5/1.8.0-SNAPSHOT/deltaspike-proxy-module-impl-asm5-1.8.0-SNAPSHOT.pom
[JENKINS] Archiving <https://builds.apache.org/job/DeltaSpike_TomEE-SNAPSHOT/ws/deltaspike/modules/bean-validation/pom.xml>
to org.apache.deltaspike.modules/bean-validation-module-project/1.8.0-SNAPSHOT/bean-validation-module-project-1.8.0-SNAPSHOT.pom
[JENKINS] Archiving <https://builds.apache.org/job/DeltaSpike_TomEE-SNAPSHOT/ws/deltaspike/parent/code/pom.xml>
to org.apache.deltaspike/parent-code/1.8.0-SNAPSHOT/parent-code-1.8.0-SNAPSHOT.pom
Compressed 90.71 KB of artifacts by 35.3% relative to #903
[JENKINS] Archiving <https://builds.apache.org/job/DeltaSpike_TomEE-SNAPSHOT/ws/deltaspike/modules/jpa/impl/pom.xml>
to org.apache.deltaspike.modules/deltaspike-jpa-module-impl/1.8.0-SNAPSHOT/deltaspike-jpa-module-impl-1.8.0-SNAPSHOT.pom
[JENKINS] Archiving <https://builds.apache.org/job/DeltaSpike_TomEE-SNAPSHOT/ws/deltaspike/modules/partial-bean/impl/pom.xml>
to org.apache.deltaspike.modules/deltaspike-partial-bean-module-impl/1.8.0-SNAPSHOT/deltaspike-partial-bean-module-impl-1.8.0-SNAPSHOT.pom
[JENKINS] Archiving <https://builds.apache.org/job/DeltaSpike_TomEE-SNAPSHOT/ws/deltaspike/modules/scheduler/api/pom.xml>
to org.apache.deltaspike.modules/deltaspike-scheduler-module-api/1.8.0-SNAPSHOT/deltaspike-scheduler-module-api-1.8.0-SNAPSHOT.pom
[JENKINS] Archiving <https://builds.apache.org/job/DeltaSpike_TomEE-SNAPSHOT/ws/deltaspike/modules/test-control/pom.xml>
to org.apache.deltaspike.modules/test-control-module-project/1.8.0-SNAPSHOT/test-control-module-project-1.8.0-SNAPSHOT.pom
[JENKINS] Archiving <https://builds.apache.org/job/DeltaSpike_TomEE-SNAPSHOT/ws/deltaspike/modules/scheduler/impl/pom.xml>
to org.apache.deltaspike.modules/deltaspike-scheduler-module-impl/1.8.0-SNAPSHOT/deltaspike-scheduler-module-impl-1.8.0-SNAPSHOT.pom
[JENKINS] Archiving <https://builds.apache.org/job/DeltaSpike_TomEE-SNAPSHOT/ws/deltaspike/examples/jsf-playground/pom.xml>
to org.apache.deltaspike.examples/deltaspike-jsf-playground/1.8.0-SNAPSHOT/deltaspike-jsf-playground-1.8.0-SNAPSHOT.pom
[JENKINS] Archiving <https://builds.apache.org/job/DeltaSpike_TomEE-SNAPSHOT/ws/deltaspike/modules/test-control/impl/pom.xml>
to org.apache.deltaspike.modules/deltaspike-test-control-module-impl/1.8.0-SNAPSHOT/deltaspike-test-control-module-impl-1.8.0-SNAPSHOT.pom
[JENKINS] Archiving <https://builds.apache.org/job/DeltaSpike_TomEE-SNAPSHOT/ws/deltaspike/checkstyle-rules/pom.xml>
to org.apache.deltaspike/checkstyle-rules/1.8.0-SNAPSHOT/checkstyle-rules-1.8.0-SNAPSHOT.pom
[JENKINS] Archiving <https://builds.apache.org/job/DeltaSpike_TomEE-SNAPSHOT/ws/deltaspike/checkstyle-rules/target/checkstyle-rules-1.8.0-SNAPSHOT.jar>
to org.apache.deltaspike/checkstyle-rules/1.8.0-SNAPSHOT/checkstyle-rules-1.8.0-SNAPSHOT.jar
[JENKINS] Archiving <https://builds.apache.org/job/DeltaSpike_TomEE-SNAPSHOT/ws/deltaspike/modules/proxy/api/pom.xml>
to org.apache.deltaspike.modules/deltaspike-proxy-module-api/1.8.0-SNAPSHOT/deltaspike-proxy-module-api-1.8.0-SNAPSHOT.pom
[JENKINS] Archiving <https://builds.apache.org/job/DeltaSpike_TomEE-SNAPSHOT/ws/deltaspike/modules/servlet/api/pom.xml>
to org.apache.deltaspike.modules/deltaspike-servlet-module-api/1.8.0-SNAPSHOT/deltaspike-servlet-module-api-1.8.0-SNAPSHOT.pom
[JENKINS] Archiving <https://builds.apache.org/job/DeltaSpike_TomEE-SNAPSHOT/ws/deltaspike/examples/data-examples/pom.xml>
to org.apache.deltaspike.examples/deltaspike-data-examples/1.8.0-SNAPSHOT/deltaspike-data-examples-1.8.0-SNAPSHOT.pom
No prior successful build to compare, so performing full copy of artifacts
[JENKINS] Archiving <https://builds.apache.org/job/DeltaSpike_TomEE-SNAPSHOT/ws/deltaspike/core/api/pom.xml>
to org.apache.deltaspike.core/deltaspike-core-api/1.8.0-SNAPSHOT/deltaspike-core-api-1.8.0-SNAPSHOT.pom
[JENKINS] Archiving <https://builds.apache.org/job/DeltaSpike_TomEE-SNAPSHOT/ws/deltaspike/examples/security-requested-page-after-login-picketlink/pom.xml>
to org.apache.deltaspike.examples/deltaspike-security-requested-page-after-login-picketlink/1.8.0-SNAPSHOT/deltaspike-security-requested-page-after-login-picketlink-1.8.0-SNAPSHOT.pom
[JENKINS] Archiving <https://builds.apache.org/job/DeltaSpike_TomEE-SNAPSHOT/ws/deltaspike/modules/bean-validation/api/pom.xml>
to org.apache.deltaspike.modules/deltaspike-bean-validation-module-api/1.8.0-SNAPSHOT/deltaspike-bean-validation-module-api-1.8.0-SNAPSHOT.pom
[JENKINS] Archiving <https://builds.apache.org/job/DeltaSpike_TomEE-SNAPSHOT/ws/deltaspike/examples/scheduler-playground/pom.xml>
to org.apache.deltaspike.examples/deltaspike-scheduler-example/1.8.0-SNAPSHOT/deltaspike-scheduler-example-1.8.0-SNAPSHOT.pom
[JENKINS] Archiving <https://builds.apache.org/job/DeltaSpike_TomEE-SNAPSHOT/ws/deltaspike/modules/pom.xml>
to org.apache.deltaspike.modules/modules-project/1.8.0-SNAPSHOT/modules-project-1.8.0-SNAPSHOT.pom
[JENKINS] Archiving <https://builds.apache.org/job/DeltaSpike_TomEE-SNAPSHOT/ws/deltaspike/modules/scheduler/pom.xml>
to org.apache.deltaspike.modules/scheduler-module-project/1.8.0-SNAPSHOT/scheduler-module-project-1.8.0-SNAPSHOT.pom
[JENKINS] Archiving <https://builds.apache.org/job/DeltaSpike_TomEE-SNAPSHOT/ws/deltaspike/test-utils/pom.xml>
to org.apache.deltaspike.test/test-utils/1.8.0-SNAPSHOT/test-utils-1.8.0-SNAPSHOT.pom
[JENKINS] Archiving <https://builds.apache.org/job/DeltaSpike_TomEE-SNAPSHOT/ws/deltaspike/test-utils/target/test-utils-1.8.0-SNAPSHOT.jar>
to org.apache.deltaspike.test/test-utils/1.8.0-SNAPSHOT/test-utils-1.8.0-SNAPSHOT.jar
[JENKINS] Archiving <https://builds.apache.org/job/DeltaSpike_TomEE-SNAPSHOT/ws/deltaspike/test-utils/target/test-utils-1.8.0-SNAPSHOT-sources.jar>
to org.apache.deltaspike.test/test-utils/1.8.0-SNAPSHOT/test-utils-1.8.0-SNAPSHOT-sources.jar
[JENKINS] Archiving <https://builds.apache.org/job/DeltaSpike_TomEE-SNAPSHOT/ws/deltaspike/modules/security/pom.xml>
to org.apache.deltaspike.modules/security-module-project/1.8.0-SNAPSHOT/security-module-project-1.8.0-SNAPSHOT.pom
[JENKINS] Archiving <https://builds.apache.org/job/DeltaSpike_TomEE-SNAPSHOT/ws/deltaspike/modules/jsf/api/pom.xml>
to org.apache.deltaspike.modules/deltaspike-jsf-module-api/1.8.0-SNAPSHOT/deltaspike-jsf-module-api-1.8.0-SNAPSHOT.pom
[JENKINS] Archiving <https://builds.apache.org/job/DeltaSpike_TomEE-SNAPSHOT/ws/deltaspike/modules/data/pom.xml>
to org.apache.deltaspike.modules/data-module-project/1.8.0-SNAPSHOT/data-module-project-1.8.0-SNAPSHOT.pom
[JENKINS] Archiving <https://builds.apache.org/job/DeltaSpike_TomEE-SNAPSHOT/ws/deltaspike/modules/servlet/impl/pom.xml>
to org.apache.deltaspike.modules/deltaspike-servlet-module-impl/1.8.0-SNAPSHOT/deltaspike-servlet-module-impl-1.8.0-SNAPSHOT.pom
[JENKINS] Archiving <https://builds.apache.org/job/DeltaSpike_TomEE-SNAPSHOT/ws/deltaspike/modules/test-control/api/pom.xml>
to org.apache.deltaspike.modules/deltaspike-test-control-module-api/1.8.0-SNAPSHOT/deltaspike-test-control-module-api-1.8.0-SNAPSHOT.pom
[JENKINS] Archiving <https://builds.apache.org/job/DeltaSpike_TomEE-SNAPSHOT/ws/deltaspike/cdictrl/impl-openejb/pom.xml>
to org.apache.deltaspike.cdictrl/deltaspike-cdictrl-openejb/1.8.0-SNAPSHOT/deltaspike-cdictrl-openejb-1.8.0-SNAPSHOT.pom
[JENKINS] Archiving <https://builds.apache.org/job/DeltaSpike_TomEE-SNAPSHOT/ws/deltaspike/examples/jsf-examples/pom.xml>
to org.apache.deltaspike.examples/deltaspike-jsf-example/1.8.0-SNAPSHOT/deltaspike-jsf-example-1.8.0-SNAPSHOT.pom
[JENKINS] Archiving <https://builds.apache.org/job/DeltaSpike_TomEE-SNAPSHOT/ws/deltaspike/modules/jsf/impl-ee6/pom.xml>
to org.apache.deltaspike.modules/deltaspike-jsf-module-impl-ee6/1.8.0-SNAPSHOT/deltaspike-jsf-module-impl-ee6-1.8.0-SNAPSHOT.pom
[JENKINS] Archiving <https://builds.apache.org/job/DeltaSpike_TomEE-SNAPSHOT/ws/deltaspike/examples/security-requested-page-after-login-cdi/pom.xml>
to org.apache.deltaspike.examples/deltaspike-security-requested-page-after-login-cdi/1.8.0-SNAPSHOT/deltaspike-security-requested-page-after-login-cdi-1.8.0-SNAPSHOT.pom
[JENKINS] Archiving <https://builds.apache.org/job/DeltaSpike_TomEE-SNAPSHOT/ws/deltaspike/core/pom.xml>
to org.apache.deltaspike.core/core-project/1.8.0-SNAPSHOT/core-project-1.8.0-SNAPSHOT.pom
[JENKINS] Archiving <https://builds.apache.org/job/DeltaSpike_TomEE-SNAPSHOT/ws/site/pom.xml>
to org.apache.deltaspike/deltaspike-site/1.8.0-SNAPSHOT/deltaspike-site-1.8.0-SNAPSHOT.pom
channel stopped

Mime
View raw message