deltaspike-commits mailing list archives

Site index · List index
Message view « Date » · « Thread »
Top « Date » · « Thread »
From Apache Jenkins Server <jenk...@builds.apache.org>
Subject Build failed in Jenkins: DeltaSpike RAT-Check #2731
Date Sat, 15 Oct 2016 14:41:49 GMT
See <https://builds.apache.org/job/DeltaSpike%20RAT-Check/2731/changes>

Changes:

[johndament] DELTASPIKE-1203 jpa example

[johndament] DELTASPIKE-1203 redirect to list.xhtml when article saved

[johndament] DELTASPIKE-1201 add logout link to secured/home.xhtml

------------------------------------------
[...truncated 4613 lines...]
[INFO] Apache DeltaSpike Core-Implementation .............. SUCCESS [ 11.849 s]
[INFO] Apache DeltaSpike ContainerControl parent .......... SUCCESS [  3.365 s]
[INFO] Apache DeltaSpike CDI ContainerControl API ......... SUCCESS [  3.709 s]
[INFO] Apache DeltaSpike CDI ContainerControl TCK ......... SUCCESS [  3.836 s]
[INFO] Apache DeltaSpike CDI OWB-ContainerControl ......... SUCCESS [  4.333 s]
[INFO] Apache DeltaSpike CDI Weld-ContainerControl ........ SUCCESS [  7.063 s]
[INFO] Apache DeltaSpike CDI OpenEJB-ContainerControl ..... SUCCESS [ 10.679 s]
[INFO] Apache DeltaSpike CDI Servlet-ContainerControl ..... SUCCESS [  5.444 s]
[INFO] Apache DeltaSpike Modules .......................... SUCCESS [  3.581 s]
[INFO] Apache DeltaSpike Proxy-Module ..................... SUCCESS [  2.242 s]
[INFO] Apache DeltaSpike Proxy-Module API ................. SUCCESS [  4.868 s]
[INFO] Apache DeltaSpike Proxy-Module Impl ASM5 ........... SUCCESS [  6.456 s]
[INFO] Apache DeltaSpike Security-Module .................. SUCCESS [  3.749 s]
[INFO] Apache DeltaSpike Security-Module API .............. SUCCESS [  4.837 s]
[INFO] Apache DeltaSpike Security-Module Impl ............. SUCCESS [  5.266 s]
[INFO] Apache DeltaSpike JPA-Module ....................... SUCCESS [  2.679 s]
[INFO] Apache DeltaSpike JPA-Module API ................... SUCCESS [  6.550 s]
[INFO] Apache DeltaSpike JPA-Module Impl .................. SUCCESS [  5.777 s]
[INFO] Apache DeltaSpike Servlet-Module ................... SUCCESS [  2.236 s]
[INFO] Apache DeltaSpike Servlet-Module API ............... SUCCESS [  4.052 s]
[INFO] Apache DeltaSpike Servlet-Module Impl .............. SUCCESS [  5.711 s]
[INFO] Apache DeltaSpike JSF-Module ....................... SUCCESS [  3.183 s]
[INFO] Apache DeltaSpike JSF-Module API ................... SUCCESS [  4.602 s]
[INFO] Apache DeltaSpike JSF-Module Impl .................. SUCCESS [ 11.164 s]
[INFO] Apache DeltaSpike JSF-Module Impl (EE6 only) ....... SUCCESS [  6.074 s]
[INFO] Apache DeltaSpike Partial-Bean-Module .............. SUCCESS [  3.660 s]
[INFO] Apache DeltaSpike Partial-Bean-Module API .......... SUCCESS [  6.011 s]
[INFO] Apache DeltaSpike Partial-Bean-Module Impl ......... SUCCESS [  6.695 s]
[INFO] Apache DeltaSpike BeanValidation-Module ............ SUCCESS [  4.136 s]
[INFO] Apache DeltaSpike BeanValidation-Module API ........ SUCCESS [  3.914 s]
[INFO] Apache DeltaSpike BeanValidation-Module Impl ....... SUCCESS [  5.160 s]
[INFO] Apache DeltaSpike Data-Module ...................... SUCCESS [  3.417 s]
[INFO] Apache DeltaSpike Data-Module API .................. SUCCESS [  5.496 s]
[INFO] Apache DeltaSpike Data-Module Impl ................. SUCCESS [ 10.305 s]
[INFO] Apache DeltaSpike Data-Module Tests with Java 8 .... SUCCESS [  2.276 s]
[INFO] Apache DeltaSpike Scheduler-Module ................. SUCCESS [  2.474 s]
[INFO] Apache DeltaSpike Scheduler-Module API ............. SUCCESS [  5.023 s]
[INFO] Apache DeltaSpike Scheduler-Module Impl ............ SUCCESS [  5.151 s]
[INFO] Apache DeltaSpike Test-Control-Module .............. SUCCESS [  3.616 s]
[INFO] Apache DeltaSpike Test-Control-Module API .......... SUCCESS [  4.996 s]
[INFO] Apache DeltaSpike Test-Control-Module Impl ......... SUCCESS [  7.761 s]
[INFO] Apache DeltaSpike Examples ......................... SUCCESS [  4.092 s]
[INFO] Apache DeltaSpike Java-SE Examples ................. SUCCESS [  4.054 s]
[INFO] Apache DeltaSpike JSF Examples ..................... SUCCESS [  5.856 s]
[INFO] Apache DeltaSpike JSF Playground ................... SUCCESS [  5.045 s]
[INFO] Apache DeltaSpike Security Example CDI ............. SUCCESS [  6.262 s]
[INFO] Apache DeltaSpike Security Example PicketLink ...... SUCCESS [  9.320 s]
[INFO] Apache DeltaSpike Java-SE Scheduler Examples ....... SUCCESS [  6.380 s]
[INFO] Apache DeltaSpike JPA Examples ..................... FAILURE [  0.889 s]
[INFO] Apache DeltaSpike Documentation .................... SKIPPED
[INFO] Apache DeltaSpike Site ............................. SKIPPED
[INFO] ------------------------------------------------------------------------
[INFO] BUILD FAILURE
[INFO] ------------------------------------------------------------------------
[INFO] Total time: 08:07 min
[INFO] Finished at: 2016-10-15T14:38:25+00:00
[INFO] Final Memory: 144M/669M
[INFO] ------------------------------------------------------------------------
Waiting for Jenkins to finish collecting data
[ERROR] Failed to execute goal org.apache.rat:apache-rat-plugin:0.8:check (default) on project deltaspike-jpa-examples: Too many unapproved licenses: 1 -> [Help 1]
[ERROR] 
[ERROR] To see the full stack trace of the errors, re-run Maven with the -e switch.
[ERROR] Re-run Maven using the -X switch to enable full debug logging.
[ERROR] 
[ERROR] For more information about the errors and possible solutions, please read the following articles:
[ERROR] [Help 1] http://cwiki.apache.org/confluence/display/MAVEN/MojoFailureException
[ERROR] 
[ERROR] After correcting the problems, you can resume the build with the command
[ERROR]   mvn <goals> -rf :deltaspike-jpa-examples
[JENKINS] Archiving <https://builds.apache.org/job/DeltaSpike%20RAT-Check/ws/deltaspike/cdictrl/tck/pom.xml> to org.apache.deltaspike.test/deltaspike-cdictrl-tck/1.7.2-SNAPSHOT/deltaspike-cdictrl-tck-1.7.2-SNAPSHOT.pom
[JENKINS] Archiving <https://builds.apache.org/job/DeltaSpike%20RAT-Check/ws/deltaspike/cdictrl/tck/target/deltaspike-cdictrl-tck-1.7.2-SNAPSHOT.jar> to org.apache.deltaspike.test/deltaspike-cdictrl-tck/1.7.2-SNAPSHOT/deltaspike-cdictrl-tck-1.7.2-SNAPSHOT.jar
[JENKINS] Archiving <https://builds.apache.org/job/DeltaSpike%20RAT-Check/ws/deltaspike/cdictrl/tck/target/deltaspike-cdictrl-tck-1.7.2-SNAPSHOT-tests.jar> to org.apache.deltaspike.test/deltaspike-cdictrl-tck/1.7.2-SNAPSHOT/deltaspike-cdictrl-tck-1.7.2-SNAPSHOT-tests.jar
[JENKINS] Archiving <https://builds.apache.org/job/DeltaSpike%20RAT-Check/ws/deltaspike/cdictrl/tck/target/deltaspike-cdictrl-tck-1.7.2-SNAPSHOT-sources.jar> to org.apache.deltaspike.test/deltaspike-cdictrl-tck/1.7.2-SNAPSHOT/deltaspike-cdictrl-tck-1.7.2-SNAPSHOT-sources.jar
[JENKINS] Archiving <https://builds.apache.org/job/DeltaSpike%20RAT-Check/ws/deltaspike/modules/jsf/impl/pom.xml> to org.apache.deltaspike.modules/deltaspike-jsf-module-impl/1.7.2-SNAPSHOT/deltaspike-jsf-module-impl-1.7.2-SNAPSHOT.pom
[JENKINS] Archiving <https://builds.apache.org/job/DeltaSpike%20RAT-Check/ws/deltaspike/modules/jsf/impl/target/deltaspike-jsf-module-impl-1.7.2-SNAPSHOT.jar> to org.apache.deltaspike.modules/deltaspike-jsf-module-impl/1.7.2-SNAPSHOT/deltaspike-jsf-module-impl-1.7.2-SNAPSHOT.jar
[JENKINS] Archiving <https://builds.apache.org/job/DeltaSpike%20RAT-Check/ws/deltaspike/modules/jsf/impl/target/deltaspike-jsf-module-impl-1.7.2-SNAPSHOT-tests.jar> to org.apache.deltaspike.modules/deltaspike-jsf-module-impl/1.7.2-SNAPSHOT/deltaspike-jsf-module-impl-1.7.2-SNAPSHOT-tests.jar
[JENKINS] Archiving <https://builds.apache.org/job/DeltaSpike%20RAT-Check/ws/deltaspike/modules/jsf/impl/target/deltaspike-jsf-module-impl-1.7.2-SNAPSHOT-sources.jar> to org.apache.deltaspike.modules/deltaspike-jsf-module-impl/1.7.2-SNAPSHOT/deltaspike-jsf-module-impl-1.7.2-SNAPSHOT-sources.jar
[JENKINS] Archiving <https://builds.apache.org/job/DeltaSpike%20RAT-Check/ws/deltaspike/modules/data/impl/pom.xml> to org.apache.deltaspike.modules/deltaspike-data-module-impl/1.7.2-SNAPSHOT/deltaspike-data-module-impl-1.7.2-SNAPSHOT.pom
[JENKINS] Archiving <https://builds.apache.org/job/DeltaSpike%20RAT-Check/ws/deltaspike/modules/data/impl/target/deltaspike-data-module-impl-1.7.2-SNAPSHOT.jar> to org.apache.deltaspike.modules/deltaspike-data-module-impl/1.7.2-SNAPSHOT/deltaspike-data-module-impl-1.7.2-SNAPSHOT.jar
[JENKINS] Archiving <https://builds.apache.org/job/DeltaSpike%20RAT-Check/ws/deltaspike/modules/data/impl/target/deltaspike-data-module-impl-1.7.2-SNAPSHOT-tests.jar> to org.apache.deltaspike.modules/deltaspike-data-module-impl/1.7.2-SNAPSHOT/deltaspike-data-module-impl-1.7.2-SNAPSHOT-tests.jar
[JENKINS] Archiving <https://builds.apache.org/job/DeltaSpike%20RAT-Check/ws/deltaspike/modules/data/impl/target/deltaspike-data-module-impl-1.7.2-SNAPSHOT-sources.jar> to org.apache.deltaspike.modules/deltaspike-data-module-impl/1.7.2-SNAPSHOT/deltaspike-data-module-impl-1.7.2-SNAPSHOT-sources.jar
[JENKINS] Archiving <https://builds.apache.org/job/DeltaSpike%20RAT-Check/ws/deltaspike/modules/jsf/pom.xml> to org.apache.deltaspike.modules/jsf-module-project/1.7.2-SNAPSHOT/jsf-module-project-1.7.2-SNAPSHOT.pom
[JENKINS] Archiving <https://builds.apache.org/job/DeltaSpike%20RAT-Check/ws/deltaspike/modules/jsf/target/jsf-module-project-1.7.2-SNAPSHOT-tests.jar> to org.apache.deltaspike.modules/jsf-module-project/1.7.2-SNAPSHOT/jsf-module-project-1.7.2-SNAPSHOT-tests.jar
[JENKINS] Archiving <https://builds.apache.org/job/DeltaSpike%20RAT-Check/ws/deltaspike/modules/bean-validation/impl/pom.xml> to org.apache.deltaspike.modules/deltaspike-bean-validation-module-impl/1.7.2-SNAPSHOT/deltaspike-bean-validation-module-impl-1.7.2-SNAPSHOT.pom
[JENKINS] Archiving <https://builds.apache.org/job/DeltaSpike%20RAT-Check/ws/deltaspike/modules/bean-validation/impl/target/deltaspike-bean-validation-module-impl-1.7.2-SNAPSHOT.jar> to org.apache.deltaspike.modules/deltaspike-bean-validation-module-impl/1.7.2-SNAPSHOT/deltaspike-bean-validation-module-impl-1.7.2-SNAPSHOT.jar
[JENKINS] Archiving <https://builds.apache.org/job/DeltaSpike%20RAT-Check/ws/deltaspike/modules/bean-validation/impl/target/deltaspike-bean-validation-module-impl-1.7.2-SNAPSHOT-tests.jar> to org.apache.deltaspike.modules/deltaspike-bean-validation-module-impl/1.7.2-SNAPSHOT/deltaspike-bean-validation-module-impl-1.7.2-SNAPSHOT-tests.jar
[JENKINS] Archiving <https://builds.apache.org/job/DeltaSpike%20RAT-Check/ws/deltaspike/modules/bean-validation/impl/target/deltaspike-bean-validation-module-impl-1.7.2-SNAPSHOT-sources.jar> to org.apache.deltaspike.modules/deltaspike-bean-validation-module-impl/1.7.2-SNAPSHOT/deltaspike-bean-validation-module-impl-1.7.2-SNAPSHOT-sources.jar
[JENKINS] Archiving <https://builds.apache.org/job/DeltaSpike%20RAT-Check/ws/deltaspike/examples/jpa-examples/pom.xml> to org.apache.deltaspike.examples/deltaspike-jpa-examples/1.7.2-SNAPSHOT/deltaspike-jpa-examples-1.7.2-SNAPSHOT.pom
No prior successful build to compare, so performing full copy of artifacts
[JENKINS] Archiving <https://builds.apache.org/job/DeltaSpike%20RAT-Check/ws/deltaspike/cdictrl/pom.xml> to org.apache.deltaspike.cdictrl/cdictrl-project/1.7.2-SNAPSHOT/cdictrl-project-1.7.2-SNAPSHOT.pom
[JENKINS] Archiving <https://builds.apache.org/job/DeltaSpike%20RAT-Check/ws/deltaspike/cdictrl/target/cdictrl-project-1.7.2-SNAPSHOT-tests.jar> to org.apache.deltaspike.cdictrl/cdictrl-project/1.7.2-SNAPSHOT/cdictrl-project-1.7.2-SNAPSHOT-tests.jar
[JENKINS] Archiving <https://builds.apache.org/job/DeltaSpike%20RAT-Check/ws/deltaspike/modules/partial-bean/api/pom.xml> to org.apache.deltaspike.modules/deltaspike-partial-bean-module-api/1.7.2-SNAPSHOT/deltaspike-partial-bean-module-api-1.7.2-SNAPSHOT.pom
[JENKINS] Archiving <https://builds.apache.org/job/DeltaSpike%20RAT-Check/ws/deltaspike/modules/partial-bean/api/target/deltaspike-partial-bean-module-api-1.7.2-SNAPSHOT.jar> to org.apache.deltaspike.modules/deltaspike-partial-bean-module-api/1.7.2-SNAPSHOT/deltaspike-partial-bean-module-api-1.7.2-SNAPSHOT.jar
[JENKINS] Archiving <https://builds.apache.org/job/DeltaSpike%20RAT-Check/ws/deltaspike/modules/partial-bean/api/target/deltaspike-partial-bean-module-api-1.7.2-SNAPSHOT-tests.jar> to org.apache.deltaspike.modules/deltaspike-partial-bean-module-api/1.7.2-SNAPSHOT/deltaspike-partial-bean-module-api-1.7.2-SNAPSHOT-tests.jar
[JENKINS] Archiving <https://builds.apache.org/job/DeltaSpike%20RAT-Check/ws/deltaspike/modules/partial-bean/api/target/deltaspike-partial-bean-module-api-1.7.2-SNAPSHOT-sources.jar> to org.apache.deltaspike.modules/deltaspike-partial-bean-module-api/1.7.2-SNAPSHOT/deltaspike-partial-bean-module-api-1.7.2-SNAPSHOT-sources.jar
[JENKINS] Archiving <https://builds.apache.org/job/DeltaSpike%20RAT-Check/ws/deltaspike/cdictrl/api/pom.xml> to org.apache.deltaspike.cdictrl/deltaspike-cdictrl-api/1.7.2-SNAPSHOT/deltaspike-cdictrl-api-1.7.2-SNAPSHOT.pom
[JENKINS] Archiving <https://builds.apache.org/job/DeltaSpike%20RAT-Check/ws/deltaspike/cdictrl/api/target/deltaspike-cdictrl-api-1.7.2-SNAPSHOT.jar> to org.apache.deltaspike.cdictrl/deltaspike-cdictrl-api/1.7.2-SNAPSHOT/deltaspike-cdictrl-api-1.7.2-SNAPSHOT.jar
[JENKINS] Archiving <https://builds.apache.org/job/DeltaSpike%20RAT-Check/ws/deltaspike/cdictrl/api/target/deltaspike-cdictrl-api-1.7.2-SNAPSHOT-tests.jar> to org.apache.deltaspike.cdictrl/deltaspike-cdictrl-api/1.7.2-SNAPSHOT/deltaspike-cdictrl-api-1.7.2-SNAPSHOT-tests.jar
[JENKINS] Archiving <https://builds.apache.org/job/DeltaSpike%20RAT-Check/ws/deltaspike/cdictrl/api/target/deltaspike-cdictrl-api-1.7.2-SNAPSHOT-sources.jar> to org.apache.deltaspike.cdictrl/deltaspike-cdictrl-api/1.7.2-SNAPSHOT/deltaspike-cdictrl-api-1.7.2-SNAPSHOT-sources.jar
[JENKINS] Archiving <https://builds.apache.org/job/DeltaSpike%20RAT-Check/ws/deltaspike/modules/security/api/pom.xml> to org.apache.deltaspike.modules/deltaspike-security-module-api/1.7.2-SNAPSHOT/deltaspike-security-module-api-1.7.2-SNAPSHOT.pom
[JENKINS] Archiving <https://builds.apache.org/job/DeltaSpike%20RAT-Check/ws/deltaspike/modules/security/api/target/deltaspike-security-module-api-1.7.2-SNAPSHOT.jar> to org.apache.deltaspike.modules/deltaspike-security-module-api/1.7.2-SNAPSHOT/deltaspike-security-module-api-1.7.2-SNAPSHOT.jar
[JENKINS] Archiving <https://builds.apache.org/job/DeltaSpike%20RAT-Check/ws/deltaspike/modules/security/api/target/deltaspike-security-module-api-1.7.2-SNAPSHOT-tests.jar> to org.apache.deltaspike.modules/deltaspike-security-module-api/1.7.2-SNAPSHOT/deltaspike-security-module-api-1.7.2-SNAPSHOT-tests.jar
[JENKINS] Archiving <https://builds.apache.org/job/DeltaSpike%20RAT-Check/ws/deltaspike/modules/security/api/target/deltaspike-security-module-api-1.7.2-SNAPSHOT-sources.jar> to org.apache.deltaspike.modules/deltaspike-security-module-api/1.7.2-SNAPSHOT/deltaspike-security-module-api-1.7.2-SNAPSHOT-sources.jar
[JENKINS] Archiving <https://builds.apache.org/job/DeltaSpike%20RAT-Check/ws/deltaspike/modules/data/api/pom.xml> to org.apache.deltaspike.modules/deltaspike-data-module-api/1.7.2-SNAPSHOT/deltaspike-data-module-api-1.7.2-SNAPSHOT.pom
[JENKINS] Archiving <https://builds.apache.org/job/DeltaSpike%20RAT-Check/ws/deltaspike/modules/data/api/target/deltaspike-data-module-api-1.7.2-SNAPSHOT.jar> to org.apache.deltaspike.modules/deltaspike-data-module-api/1.7.2-SNAPSHOT/deltaspike-data-module-api-1.7.2-SNAPSHOT.jar
[JENKINS] Archiving <https://builds.apache.org/job/DeltaSpike%20RAT-Check/ws/deltaspike/modules/data/api/target/deltaspike-data-module-api-1.7.2-SNAPSHOT-tests.jar> to org.apache.deltaspike.modules/deltaspike-data-module-api/1.7.2-SNAPSHOT/deltaspike-data-module-api-1.7.2-SNAPSHOT-tests.jar
[JENKINS] Archiving <https://builds.apache.org/job/DeltaSpike%20RAT-Check/ws/deltaspike/modules/data/api/target/deltaspike-data-module-api-1.7.2-SNAPSHOT-sources.jar> to org.apache.deltaspike.modules/deltaspike-data-module-api/1.7.2-SNAPSHOT/deltaspike-data-module-api-1.7.2-SNAPSHOT-sources.jar
[JENKINS] Archiving <https://builds.apache.org/job/DeltaSpike%20RAT-Check/ws/documentation/pom.xml> to org.apache.deltaspike/deltaspike-documentation/1.7.2-SNAPSHOT/deltaspike-documentation-1.7.2-SNAPSHOT.pom
[JENKINS] Archiving <https://builds.apache.org/job/DeltaSpike%20RAT-Check/ws/deltaspike/examples/jse-examples/pom.xml> to org.apache.deltaspike.examples/deltaspike-jse-example/1.7.2-SNAPSHOT/deltaspike-jse-example-1.7.2-SNAPSHOT.pom
[JENKINS] Archiving <https://builds.apache.org/job/DeltaSpike%20RAT-Check/ws/deltaspike/examples/jse-examples/target/deltaspike-jse-example-1.7.2-SNAPSHOT.jar> to org.apache.deltaspike.examples/deltaspike-jse-example/1.7.2-SNAPSHOT/deltaspike-jse-example-1.7.2-SNAPSHOT.jar
[JENKINS] Archiving <https://builds.apache.org/job/DeltaSpike%20RAT-Check/ws/deltaspike/examples/jse-examples/target/deltaspike-jse-example-1.7.2-SNAPSHOT-sources.jar> to org.apache.deltaspike.examples/deltaspike-jse-example/1.7.2-SNAPSHOT/deltaspike-jse-example-1.7.2-SNAPSHOT-sources.jar
[JENKINS] Archiving <https://builds.apache.org/job/DeltaSpike%20RAT-Check/ws/deltaspike/examples/pom.xml> to org.apache.deltaspike.examples/examples-project/1.7.2-SNAPSHOT/examples-project-1.7.2-SNAPSHOT.pom
[JENKINS] Archiving <https://builds.apache.org/job/DeltaSpike%20RAT-Check/ws/deltaspike/modules/jpa/pom.xml> to org.apache.deltaspike.modules/jpa-module-project/1.7.2-SNAPSHOT/jpa-module-project-1.7.2-SNAPSHOT.pom
[JENKINS] Archiving <https://builds.apache.org/job/DeltaSpike%20RAT-Check/ws/deltaspike/modules/jpa/target/jpa-module-project-1.7.2-SNAPSHOT-tests.jar> to org.apache.deltaspike.modules/jpa-module-project/1.7.2-SNAPSHOT/jpa-module-project-1.7.2-SNAPSHOT-tests.jar
[JENKINS] Archiving <https://builds.apache.org/job/DeltaSpike%20RAT-Check/ws/deltaspike/modules/servlet/pom.xml> to org.apache.deltaspike.modules/servlet-module-project/1.7.2-SNAPSHOT/servlet-module-project-1.7.2-SNAPSHOT.pom
[JENKINS] Archiving <https://builds.apache.org/job/DeltaSpike%20RAT-Check/ws/deltaspike/modules/servlet/target/servlet-module-project-1.7.2-SNAPSHOT-tests.jar> to org.apache.deltaspike.modules/servlet-module-project/1.7.2-SNAPSHOT/servlet-module-project-1.7.2-SNAPSHOT-tests.jar
[JENKINS] Archiving <https://builds.apache.org/job/DeltaSpike%20RAT-Check/ws/deltaspike/pom.xml> to org.apache.deltaspike/deltaspike-project/1.7.2-SNAPSHOT/deltaspike-project-1.7.2-SNAPSHOT.pom
[JENKINS] Archiving <https://builds.apache.org/job/DeltaSpike%20RAT-Check/ws/pom.xml> to org.apache.deltaspike/deltaspike/1.7.2-SNAPSHOT/deltaspike-1.7.2-SNAPSHOT.pom
[JENKINS] Archiving <https://builds.apache.org/job/DeltaSpike%20RAT-Check/ws/deltaspike/core/impl/pom.xml> to org.apache.deltaspike.core/deltaspike-core-impl/1.7.2-SNAPSHOT/deltaspike-core-impl-1.7.2-SNAPSHOT.pom
[JENKINS] Archiving <https://builds.apache.org/job/DeltaSpike%20RAT-Check/ws/deltaspike/core/impl/target/deltaspike-core-impl-1.7.2-SNAPSHOT.jar> to org.apache.deltaspike.core/deltaspike-core-impl/1.7.2-SNAPSHOT/deltaspike-core-impl-1.7.2-SNAPSHOT.jar
[JENKINS] Archiving <https://builds.apache.org/job/DeltaSpike%20RAT-Check/ws/deltaspike/core/impl/target/deltaspike-core-impl-1.7.2-SNAPSHOT-tests.jar> to org.apache.deltaspike.core/deltaspike-core-impl/1.7.2-SNAPSHOT/deltaspike-core-impl-1.7.2-SNAPSHOT-tests.jar
[JENKINS] Archiving <https://builds.apache.org/job/DeltaSpike%20RAT-Check/ws/deltaspike/core/impl/target/deltaspike-core-impl-1.7.2-SNAPSHOT-sources.jar> to org.apache.deltaspike.core/deltaspike-core-impl/1.7.2-SNAPSHOT/deltaspike-core-impl-1.7.2-SNAPSHOT-sources.jar
[JENKINS] Archiving <https://builds.apache.org/job/DeltaSpike%20RAT-Check/ws/deltaspike/modules/partial-bean/pom.xml> to org.apache.deltaspike.modules/partial-bean-module-project/1.7.2-SNAPSHOT/partial-bean-module-project-1.7.2-SNAPSHOT.pom
[JENKINS] Archiving <https://builds.apache.org/job/DeltaSpike%20RAT-Check/ws/deltaspike/modules/partial-bean/target/partial-bean-module-project-1.7.2-SNAPSHOT-tests.jar> to org.apache.deltaspike.modules/partial-bean-module-project/1.7.2-SNAPSHOT/partial-bean-module-project-1.7.2-SNAPSHOT-tests.jar
[JENKINS] Archiving <https://builds.apache.org/job/DeltaSpike%20RAT-Check/ws/deltaspike/cdictrl/impl-weld/pom.xml> to org.apache.deltaspike.cdictrl/deltaspike-cdictrl-weld/1.7.2-SNAPSHOT/deltaspike-cdictrl-weld-1.7.2-SNAPSHOT.pom
[JENKINS] Archiving <https://builds.apache.org/job/DeltaSpike%20RAT-Check/ws/deltaspike/cdictrl/impl-weld/target/deltaspike-cdictrl-weld-1.7.2-SNAPSHOT.jar> to org.apache.deltaspike.cdictrl/deltaspike-cdictrl-weld/1.7.2-SNAPSHOT/deltaspike-cdictrl-weld-1.7.2-SNAPSHOT.jar
[JENKINS] Archiving <https://builds.apache.org/job/DeltaSpike%20RAT-Check/ws/deltaspike/cdictrl/impl-weld/target/deltaspike-cdictrl-weld-1.7.2-SNAPSHOT-tests.jar> to org.apache.deltaspike.cdictrl/deltaspike-cdictrl-weld/1.7.2-SNAPSHOT/deltaspike-cdictrl-weld-1.7.2-SNAPSHOT-tests.jar
[JENKINS] Archiving <https://builds.apache.org/job/DeltaSpike%20RAT-Check/ws/deltaspike/cdictrl/impl-weld/target/deltaspike-cdictrl-weld-1.7.2-SNAPSHOT-sources.jar> to org.apache.deltaspike.cdictrl/deltaspike-cdictrl-weld/1.7.2-SNAPSHOT/deltaspike-cdictrl-weld-1.7.2-SNAPSHOT-sources.jar
[JENKINS] Archiving <https://builds.apache.org/job/DeltaSpike%20RAT-Check/ws/deltaspike/cdictrl/impl-owb/pom.xml> to org.apache.deltaspike.cdictrl/deltaspike-cdictrl-owb/1.7.2-SNAPSHOT/deltaspike-cdictrl-owb-1.7.2-SNAPSHOT.pom
[JENKINS] Archiving <https://builds.apache.org/job/DeltaSpike%20RAT-Check/ws/deltaspike/cdictrl/impl-owb/target/deltaspike-cdictrl-owb-1.7.2-SNAPSHOT.jar> to org.apache.deltaspike.cdictrl/deltaspike-cdictrl-owb/1.7.2-SNAPSHOT/deltaspike-cdictrl-owb-1.7.2-SNAPSHOT.jar
[JENKINS] Archiving <https://builds.apache.org/job/DeltaSpike%20RAT-Check/ws/deltaspike/cdictrl/impl-owb/target/deltaspike-cdictrl-owb-1.7.2-SNAPSHOT-tests.jar> to org.apache.deltaspike.cdictrl/deltaspike-cdictrl-owb/1.7.2-SNAPSHOT/deltaspike-cdictrl-owb-1.7.2-SNAPSHOT-tests.jar
[JENKINS] Archiving <https://builds.apache.org/job/DeltaSpike%20RAT-Check/ws/deltaspike/cdictrl/impl-owb/target/deltaspike-cdictrl-owb-1.7.2-SNAPSHOT-sources.jar> to org.apache.deltaspike.cdictrl/deltaspike-cdictrl-owb/1.7.2-SNAPSHOT/deltaspike-cdictrl-owb-1.7.2-SNAPSHOT-sources.jar
[JENKINS] Archiving <https://builds.apache.org/job/DeltaSpike%20RAT-Check/ws/deltaspike/modules/proxy/pom.xml> to org.apache.deltaspike.modules/proxy-module-project/1.7.2-SNAPSHOT/proxy-module-project-1.7.2-SNAPSHOT.pom
[JENKINS] Archiving <https://builds.apache.org/job/DeltaSpike%20RAT-Check/ws/deltaspike/modules/proxy/target/proxy-module-project-1.7.2-SNAPSHOT-tests.jar> to org.apache.deltaspike.modules/proxy-module-project/1.7.2-SNAPSHOT/proxy-module-project-1.7.2-SNAPSHOT-tests.jar
[JENKINS] Archiving <https://builds.apache.org/job/DeltaSpike%20RAT-Check/ws/deltaspike/parent/pom.xml> to org.apache.deltaspike/parent/1.7.2-SNAPSHOT/parent-1.7.2-SNAPSHOT.pom
Compressed 40.41 KB of artifacts by 79.2% relative to #2730
[JENKINS] Archiving <https://builds.apache.org/job/DeltaSpike%20RAT-Check/ws/deltaspike/modules/security/impl/pom.xml> to org.apache.deltaspike.modules/deltaspike-security-module-impl/1.7.2-SNAPSHOT/deltaspike-security-module-impl-1.7.2-SNAPSHOT.pom
[JENKINS] Archiving <https://builds.apache.org/job/DeltaSpike%20RAT-Check/ws/deltaspike/modules/security/impl/target/deltaspike-security-module-impl-1.7.2-SNAPSHOT.jar> to org.apache.deltaspike.modules/deltaspike-security-module-impl/1.7.2-SNAPSHOT/deltaspike-security-module-impl-1.7.2-SNAPSHOT.jar
[JENKINS] Archiving <https://builds.apache.org/job/DeltaSpike%20RAT-Check/ws/deltaspike/modules/security/impl/target/deltaspike-security-module-impl-1.7.2-SNAPSHOT-tests.jar> to org.apache.deltaspike.modules/deltaspike-security-module-impl/1.7.2-SNAPSHOT/deltaspike-security-module-impl-1.7.2-SNAPSHOT-tests.jar
[JENKINS] Archiving <https://builds.apache.org/job/DeltaSpike%20RAT-Check/ws/deltaspike/modules/security/impl/target/deltaspike-security-module-impl-1.7.2-SNAPSHOT-sources.jar> to org.apache.deltaspike.modules/deltaspike-security-module-impl/1.7.2-SNAPSHOT/deltaspike-security-module-impl-1.7.2-SNAPSHOT-sources.jar
[JENKINS] Archiving <https://builds.apache.org/job/DeltaSpike%20RAT-Check/ws/deltaspike/modules/jpa/api/pom.xml> to org.apache.deltaspike.modules/deltaspike-jpa-module-api/1.7.2-SNAPSHOT/deltaspike-jpa-module-api-1.7.2-SNAPSHOT.pom
[JENKINS] Archiving <https://builds.apache.org/job/DeltaSpike%20RAT-Check/ws/deltaspike/modules/jpa/api/target/deltaspike-jpa-module-api-1.7.2-SNAPSHOT.jar> to org.apache.deltaspike.modules/deltaspike-jpa-module-api/1.7.2-SNAPSHOT/deltaspike-jpa-module-api-1.7.2-SNAPSHOT.jar
[JENKINS] Archiving <https://builds.apache.org/job/DeltaSpike%20RAT-Check/ws/deltaspike/modules/jpa/api/target/deltaspike-jpa-module-api-1.7.2-SNAPSHOT-tests.jar> to org.apache.deltaspike.modules/deltaspike-jpa-module-api/1.7.2-SNAPSHOT/deltaspike-jpa-module-api-1.7.2-SNAPSHOT-tests.jar
[JENKINS] Archiving <https://builds.apache.org/job/DeltaSpike%20RAT-Check/ws/deltaspike/modules/jpa/api/target/deltaspike-jpa-module-api-1.7.2-SNAPSHOT-sources.jar> to org.apache.deltaspike.modules/deltaspike-jpa-module-api/1.7.2-SNAPSHOT/deltaspike-jpa-module-api-1.7.2-SNAPSHOT-sources.jar
[JENKINS] Archiving <https://builds.apache.org/job/DeltaSpike%20RAT-Check/ws/deltaspike/modules/proxy/impl-asm5/pom.xml> to org.apache.deltaspike.modules/deltaspike-proxy-module-impl-asm5/1.7.2-SNAPSHOT/deltaspike-proxy-module-impl-asm5-1.7.2-SNAPSHOT.pom
[JENKINS] Archiving <https://builds.apache.org/job/DeltaSpike%20RAT-Check/ws/deltaspike/modules/proxy/impl-asm5/target/deltaspike-proxy-module-impl-asm5-1.7.2-SNAPSHOT.jar> to org.apache.deltaspike.modules/deltaspike-proxy-module-impl-asm5/1.7.2-SNAPSHOT/deltaspike-proxy-module-impl-asm5-1.7.2-SNAPSHOT.jar
[JENKINS] Archiving <https://builds.apache.org/job/DeltaSpike%20RAT-Check/ws/deltaspike/modules/proxy/impl-asm5/target/deltaspike-proxy-module-impl-asm5-1.7.2-SNAPSHOT-tests.jar> to org.apache.deltaspike.modules/deltaspike-proxy-module-impl-asm5/1.7.2-SNAPSHOT/deltaspike-proxy-module-impl-asm5-1.7.2-SNAPSHOT-tests.jar
[JENKINS] Archiving <https://builds.apache.org/job/DeltaSpike%20RAT-Check/ws/deltaspike/modules/proxy/impl-asm5/target/deltaspike-proxy-module-impl-asm5-1.7.2-SNAPSHOT-sources.jar> to org.apache.deltaspike.modules/deltaspike-proxy-module-impl-asm5/1.7.2-SNAPSHOT/deltaspike-proxy-module-impl-asm5-1.7.2-SNAPSHOT-sources.jar
[JENKINS] Archiving <https://builds.apache.org/job/DeltaSpike%20RAT-Check/ws/deltaspike/modules/bean-validation/pom.xml> to org.apache.deltaspike.modules/bean-validation-module-project/1.7.2-SNAPSHOT/bean-validation-module-project-1.7.2-SNAPSHOT.pom
[JENKINS] Archiving <https://builds.apache.org/job/DeltaSpike%20RAT-Check/ws/deltaspike/modules/bean-validation/target/bean-validation-module-project-1.7.2-SNAPSHOT-tests.jar> to org.apache.deltaspike.modules/bean-validation-module-project/1.7.2-SNAPSHOT/bean-validation-module-project-1.7.2-SNAPSHOT-tests.jar
[JENKINS] Archiving <https://builds.apache.org/job/DeltaSpike%20RAT-Check/ws/deltaspike/parent/code/pom.xml> to org.apache.deltaspike/parent-code/1.7.2-SNAPSHOT/parent-code-1.7.2-SNAPSHOT.pom
[JENKINS] Archiving <https://builds.apache.org/job/DeltaSpike%20RAT-Check/ws/deltaspike/parent/code/target/parent-code-1.7.2-SNAPSHOT-tests.jar> to org.apache.deltaspike/parent-code/1.7.2-SNAPSHOT/parent-code-1.7.2-SNAPSHOT-tests.jar
Compressed 98.21 KB of artifacts by 65.2% relative to #2730
[JENKINS] Archiving <https://builds.apache.org/job/DeltaSpike%20RAT-Check/ws/deltaspike/modules/jpa/impl/pom.xml> to org.apache.deltaspike.modules/deltaspike-jpa-module-impl/1.7.2-SNAPSHOT/deltaspike-jpa-module-impl-1.7.2-SNAPSHOT.pom
[JENKINS] Archiving <https://builds.apache.org/job/DeltaSpike%20RAT-Check/ws/deltaspike/modules/jpa/impl/target/deltaspike-jpa-module-impl-1.7.2-SNAPSHOT.jar> to org.apache.deltaspike.modules/deltaspike-jpa-module-impl/1.7.2-SNAPSHOT/deltaspike-jpa-module-impl-1.7.2-SNAPSHOT.jar
[JENKINS] Archiving <https://builds.apache.org/job/DeltaSpike%20RAT-Check/ws/deltaspike/modules/jpa/impl/target/deltaspike-jpa-module-impl-1.7.2-SNAPSHOT-tests.jar> to org.apache.deltaspike.modules/deltaspike-jpa-module-impl/1.7.2-SNAPSHOT/deltaspike-jpa-module-impl-1.7.2-SNAPSHOT-tests.jar
[JENKINS] Archiving <https://builds.apache.org/job/DeltaSpike%20RAT-Check/ws/deltaspike/modules/jpa/impl/target/deltaspike-jpa-module-impl-1.7.2-SNAPSHOT-sources.jar> to org.apache.deltaspike.modules/deltaspike-jpa-module-impl/1.7.2-SNAPSHOT/deltaspike-jpa-module-impl-1.7.2-SNAPSHOT-sources.jar
[JENKINS] Archiving <https://builds.apache.org/job/DeltaSpike%20RAT-Check/ws/deltaspike/modules/partial-bean/impl/pom.xml> to org.apache.deltaspike.modules/deltaspike-partial-bean-module-impl/1.7.2-SNAPSHOT/deltaspike-partial-bean-module-impl-1.7.2-SNAPSHOT.pom
[JENKINS] Archiving <https://builds.apache.org/job/DeltaSpike%20RAT-Check/ws/deltaspike/modules/partial-bean/impl/target/deltaspike-partial-bean-module-impl-1.7.2-SNAPSHOT.jar> to org.apache.deltaspike.modules/deltaspike-partial-bean-module-impl/1.7.2-SNAPSHOT/deltaspike-partial-bean-module-impl-1.7.2-SNAPSHOT.jar
[JENKINS] Archiving <https://builds.apache.org/job/DeltaSpike%20RAT-Check/ws/deltaspike/modules/partial-bean/impl/target/deltaspike-partial-bean-module-impl-1.7.2-SNAPSHOT-tests.jar> to org.apache.deltaspike.modules/deltaspike-partial-bean-module-impl/1.7.2-SNAPSHOT/deltaspike-partial-bean-module-impl-1.7.2-SNAPSHOT-tests.jar
[JENKINS] Archiving <https://builds.apache.org/job/DeltaSpike%20RAT-Check/ws/deltaspike/modules/partial-bean/impl/target/deltaspike-partial-bean-module-impl-1.7.2-SNAPSHOT-sources.jar> to org.apache.deltaspike.modules/deltaspike-partial-bean-module-impl/1.7.2-SNAPSHOT/deltaspike-partial-bean-module-impl-1.7.2-SNAPSHOT-sources.jar
[JENKINS] Archiving <https://builds.apache.org/job/DeltaSpike%20RAT-Check/ws/deltaspike/cdictrl/servlet/pom.xml> to org.apache.deltaspike.cdictrl/deltaspike-cdictrl-servlet/1.7.2-SNAPSHOT/deltaspike-cdictrl-servlet-1.7.2-SNAPSHOT.pom
[JENKINS] Archiving <https://builds.apache.org/job/DeltaSpike%20RAT-Check/ws/deltaspike/cdictrl/servlet/target/deltaspike-cdictrl-servlet-1.7.2-SNAPSHOT.jar> to org.apache.deltaspike.cdictrl/deltaspike-cdictrl-servlet/1.7.2-SNAPSHOT/deltaspike-cdictrl-servlet-1.7.2-SNAPSHOT.jar
[JENKINS] Archiving <https://builds.apache.org/job/DeltaSpike%20RAT-Check/ws/deltaspike/cdictrl/servlet/target/deltaspike-cdictrl-servlet-1.7.2-SNAPSHOT-tests.jar> to org.apache.deltaspike.cdictrl/deltaspike-cdictrl-servlet/1.7.2-SNAPSHOT/deltaspike-cdictrl-servlet-1.7.2-SNAPSHOT-tests.jar
[JENKINS] Archiving <https://builds.apache.org/job/DeltaSpike%20RAT-Check/ws/deltaspike/cdictrl/servlet/target/deltaspike-cdictrl-servlet-1.7.2-SNAPSHOT-sources.jar> to org.apache.deltaspike.cdictrl/deltaspike-cdictrl-servlet/1.7.2-SNAPSHOT/deltaspike-cdictrl-servlet-1.7.2-SNAPSHOT-sources.jar
[JENKINS] Archiving <https://builds.apache.org/job/DeltaSpike%20RAT-Check/ws/deltaspike/modules/scheduler/api/pom.xml> to org.apache.deltaspike.modules/deltaspike-scheduler-module-api/1.7.2-SNAPSHOT/deltaspike-scheduler-module-api-1.7.2-SNAPSHOT.pom
[JENKINS] Archiving <https://builds.apache.org/job/DeltaSpike%20RAT-Check/ws/deltaspike/modules/scheduler/api/target/deltaspike-scheduler-module-api-1.7.2-SNAPSHOT.jar> to org.apache.deltaspike.modules/deltaspike-scheduler-module-api/1.7.2-SNAPSHOT/deltaspike-scheduler-module-api-1.7.2-SNAPSHOT.jar
[JENKINS] Archiving <https://builds.apache.org/job/DeltaSpike%20RAT-Check/ws/deltaspike/modules/scheduler/api/target/deltaspike-scheduler-module-api-1.7.2-SNAPSHOT-tests.jar> to org.apache.deltaspike.modules/deltaspike-scheduler-module-api/1.7.2-SNAPSHOT/deltaspike-scheduler-module-api-1.7.2-SNAPSHOT-tests.jar
[JENKINS] Archiving <https://builds.apache.org/job/DeltaSpike%20RAT-Check/ws/deltaspike/modules/scheduler/api/target/deltaspike-scheduler-module-api-1.7.2-SNAPSHOT-sources.jar> to org.apache.deltaspike.modules/deltaspike-scheduler-module-api/1.7.2-SNAPSHOT/deltaspike-scheduler-module-api-1.7.2-SNAPSHOT-sources.jar
[JENKINS] Archiving <https://builds.apache.org/job/DeltaSpike%20RAT-Check/ws/deltaspike/modules/test-control/pom.xml> to org.apache.deltaspike.modules/test-control-module-project/1.7.2-SNAPSHOT/test-control-module-project-1.7.2-SNAPSHOT.pom
[JENKINS] Archiving <https://builds.apache.org/job/DeltaSpike%20RAT-Check/ws/deltaspike/modules/test-control/target/test-control-module-project-1.7.2-SNAPSHOT-tests.jar> to org.apache.deltaspike.modules/test-control-module-project/1.7.2-SNAPSHOT/test-control-module-project-1.7.2-SNAPSHOT-tests.jar
[JENKINS] Archiving <https://builds.apache.org/job/DeltaSpike%20RAT-Check/ws/deltaspike/modules/scheduler/impl/pom.xml> to org.apache.deltaspike.modules/deltaspike-scheduler-module-impl/1.7.2-SNAPSHOT/deltaspike-scheduler-module-impl-1.7.2-SNAPSHOT.pom
[JENKINS] Archiving <https://builds.apache.org/job/DeltaSpike%20RAT-Check/ws/deltaspike/modules/scheduler/impl/target/deltaspike-scheduler-module-impl-1.7.2-SNAPSHOT.jar> to org.apache.deltaspike.modules/deltaspike-scheduler-module-impl/1.7.2-SNAPSHOT/deltaspike-scheduler-module-impl-1.7.2-SNAPSHOT.jar
[JENKINS] Archiving <https://builds.apache.org/job/DeltaSpike%20RAT-Check/ws/deltaspike/modules/scheduler/impl/target/deltaspike-scheduler-module-impl-1.7.2-SNAPSHOT-tests.jar> to org.apache.deltaspike.modules/deltaspike-scheduler-module-impl/1.7.2-SNAPSHOT/deltaspike-scheduler-module-impl-1.7.2-SNAPSHOT-tests.jar
[JENKINS] Archiving <https://builds.apache.org/job/DeltaSpike%20RAT-Check/ws/deltaspike/modules/scheduler/impl/target/deltaspike-scheduler-module-impl-1.7.2-SNAPSHOT-sources.jar> to org.apache.deltaspike.modules/deltaspike-scheduler-module-impl/1.7.2-SNAPSHOT/deltaspike-scheduler-module-impl-1.7.2-SNAPSHOT-sources.jar
[JENKINS] Archiving <https://builds.apache.org/job/DeltaSpike%20RAT-Check/ws/deltaspike/examples/jsf-playground/pom.xml> to org.apache.deltaspike.examples/deltaspike-jsf-playground/1.7.2-SNAPSHOT/deltaspike-jsf-playground-1.7.2-SNAPSHOT.pom
[JENKINS] Archiving <https://builds.apache.org/job/DeltaSpike%20RAT-Check/ws/deltaspike/examples/jsf-playground/target/ds.war> to org.apache.deltaspike.examples/deltaspike-jsf-playground/1.7.2-SNAPSHOT/deltaspike-jsf-playground-1.7.2-SNAPSHOT.war
[JENKINS] Archiving <https://builds.apache.org/job/DeltaSpike%20RAT-Check/ws/deltaspike/examples/jsf-playground/target/ds-sources.jar> to org.apache.deltaspike.examples/deltaspike-jsf-playground/1.7.2-SNAPSHOT/deltaspike-jsf-playground-1.7.2-SNAPSHOT-sources.jar
[JENKINS] Archiving <https://builds.apache.org/job/DeltaSpike%20RAT-Check/ws/deltaspike/modules/test-control/impl/pom.xml> to org.apache.deltaspike.modules/deltaspike-test-control-module-impl/1.7.2-SNAPSHOT/deltaspike-test-control-module-impl-1.7.2-SNAPSHOT.pom
[JENKINS] Archiving <https://builds.apache.org/job/DeltaSpike%20RAT-Check/ws/deltaspike/modules/test-control/impl/target/deltaspike-test-control-module-impl-1.7.2-SNAPSHOT.jar> to org.apache.deltaspike.modules/deltaspike-test-control-module-impl/1.7.2-SNAPSHOT/deltaspike-test-control-module-impl-1.7.2-SNAPSHOT.jar
[JENKINS] Archiving <https://builds.apache.org/job/DeltaSpike%20RAT-Check/ws/deltaspike/modules/test-control/impl/target/deltaspike-test-control-module-impl-1.7.2-SNAPSHOT-tests.jar> to org.apache.deltaspike.modules/deltaspike-test-control-module-impl/1.7.2-SNAPSHOT/deltaspike-test-control-module-impl-1.7.2-SNAPSHOT-tests.jar
[JENKINS] Archiving <https://builds.apache.org/job/DeltaSpike%20RAT-Check/ws/deltaspike/modules/test-control/impl/target/deltaspike-test-control-module-impl-1.7.2-SNAPSHOT-sources.jar> to org.apache.deltaspike.modules/deltaspike-test-control-module-impl/1.7.2-SNAPSHOT/deltaspike-test-control-module-impl-1.7.2-SNAPSHOT-sources.jar
[JENKINS] Archiving <https://builds.apache.org/job/DeltaSpike%20RAT-Check/ws/deltaspike/checkstyle-rules/pom.xml> to org.apache.deltaspike/checkstyle-rules/1.7.2-SNAPSHOT/checkstyle-rules-1.7.2-SNAPSHOT.pom
[JENKINS] Archiving <https://builds.apache.org/job/DeltaSpike%20RAT-Check/ws/deltaspike/checkstyle-rules/target/checkstyle-rules-1.7.2-SNAPSHOT.jar> to org.apache.deltaspike/checkstyle-rules/1.7.2-SNAPSHOT/checkstyle-rules-1.7.2-SNAPSHOT.jar
[JENKINS] Archiving <https://builds.apache.org/job/DeltaSpike%20RAT-Check/ws/deltaspike/modules/proxy/api/pom.xml> to org.apache.deltaspike.modules/deltaspike-proxy-module-api/1.7.2-SNAPSHOT/deltaspike-proxy-module-api-1.7.2-SNAPSHOT.pom
[JENKINS] Archiving <https://builds.apache.org/job/DeltaSpike%20RAT-Check/ws/deltaspike/modules/proxy/api/target/deltaspike-proxy-module-api-1.7.2-SNAPSHOT.jar> to org.apache.deltaspike.modules/deltaspike-proxy-module-api/1.7.2-SNAPSHOT/deltaspike-proxy-module-api-1.7.2-SNAPSHOT.jar
[JENKINS] Archiving <https://builds.apache.org/job/DeltaSpike%20RAT-Check/ws/deltaspike/modules/proxy/api/target/deltaspike-proxy-module-api-1.7.2-SNAPSHOT-tests.jar> to org.apache.deltaspike.modules/deltaspike-proxy-module-api/1.7.2-SNAPSHOT/deltaspike-proxy-module-api-1.7.2-SNAPSHOT-tests.jar
[JENKINS] Archiving <https://builds.apache.org/job/DeltaSpike%20RAT-Check/ws/deltaspike/modules/proxy/api/target/deltaspike-proxy-module-api-1.7.2-SNAPSHOT-sources.jar> to org.apache.deltaspike.modules/deltaspike-proxy-module-api/1.7.2-SNAPSHOT/deltaspike-proxy-module-api-1.7.2-SNAPSHOT-sources.jar
[JENKINS] Archiving <https://builds.apache.org/job/DeltaSpike%20RAT-Check/ws/deltaspike/modules/servlet/api/pom.xml> to org.apache.deltaspike.modules/deltaspike-servlet-module-api/1.7.2-SNAPSHOT/deltaspike-servlet-module-api-1.7.2-SNAPSHOT.pom
[JENKINS] Archiving <https://builds.apache.org/job/DeltaSpike%20RAT-Check/ws/deltaspike/modules/servlet/api/target/deltaspike-servlet-module-api-1.7.2-SNAPSHOT.jar> to org.apache.deltaspike.modules/deltaspike-servlet-module-api/1.7.2-SNAPSHOT/deltaspike-servlet-module-api-1.7.2-SNAPSHOT.jar
[JENKINS] Archiving <https://builds.apache.org/job/DeltaSpike%20RAT-Check/ws/deltaspike/modules/servlet/api/target/deltaspike-servlet-module-api-1.7.2-SNAPSHOT-tests.jar> to org.apache.deltaspike.modules/deltaspike-servlet-module-api/1.7.2-SNAPSHOT/deltaspike-servlet-module-api-1.7.2-SNAPSHOT-tests.jar
[JENKINS] Archiving <https://builds.apache.org/job/DeltaSpike%20RAT-Check/ws/deltaspike/modules/servlet/api/target/deltaspike-servlet-module-api-1.7.2-SNAPSHOT-sources.jar> to org.apache.deltaspike.modules/deltaspike-servlet-module-api/1.7.2-SNAPSHOT/deltaspike-servlet-module-api-1.7.2-SNAPSHOT-sources.jar
[JENKINS] Archiving <https://builds.apache.org/job/DeltaSpike%20RAT-Check/ws/deltaspike/core/api/pom.xml> to org.apache.deltaspike.core/deltaspike-core-api/1.7.2-SNAPSHOT/deltaspike-core-api-1.7.2-SNAPSHOT.pom
[JENKINS] Archiving <https://builds.apache.org/job/DeltaSpike%20RAT-Check/ws/deltaspike/core/api/target/deltaspike-core-api-1.7.2-SNAPSHOT.jar> to org.apache.deltaspike.core/deltaspike-core-api/1.7.2-SNAPSHOT/deltaspike-core-api-1.7.2-SNAPSHOT.jar
[JENKINS] Archiving <https://builds.apache.org/job/DeltaSpike%20RAT-Check/ws/deltaspike/core/api/target/deltaspike-core-api-1.7.2-SNAPSHOT-tests.jar> to org.apache.deltaspike.core/deltaspike-core-api/1.7.2-SNAPSHOT/deltaspike-core-api-1.7.2-SNAPSHOT-tests.jar
[JENKINS] Archiving <https://builds.apache.org/job/DeltaSpike%20RAT-Check/ws/deltaspike/core/api/target/deltaspike-core-api-1.7.2-SNAPSHOT-sources.jar> to org.apache.deltaspike.core/deltaspike-core-api/1.7.2-SNAPSHOT/deltaspike-core-api-1.7.2-SNAPSHOT-sources.jar
[JENKINS] Archiving <https://builds.apache.org/job/DeltaSpike%20RAT-Check/ws/deltaspike/examples/security-requested-page-after-login-picketlink/pom.xml> to org.apache.deltaspike.examples/deltaspike-security-requested-page-after-login-picketlink/1.7.2-SNAPSHOT/deltaspike-security-requested-page-after-login-picketlink-1.7.2-SNAPSHOT.pom
[JENKINS] Archiving <https://builds.apache.org/job/DeltaSpike%20RAT-Check/ws/deltaspike/examples/security-requested-page-after-login-picketlink/target/deltaspike-security-requested-page-after-login-picketlink.war> to org.apache.deltaspike.examples/deltaspike-security-requested-page-after-login-picketlink/1.7.2-SNAPSHOT/deltaspike-security-requested-page-after-login-picketlink-1.7.2-SNAPSHOT.war
[JENKINS] Archiving <https://builds.apache.org/job/DeltaSpike%20RAT-Check/ws/deltaspike/examples/security-requested-page-after-login-picketlink/target/deltaspike-security-requested-page-after-login-picketlink-sources.jar> to org.apache.deltaspike.examples/deltaspike-security-requested-page-after-login-picketlink/1.7.2-SNAPSHOT/deltaspike-security-requested-page-after-login-picketlink-1.7.2-SNAPSHOT-sources.jar
Compressed 2.29 MB of artifacts by 64.2% relative to #2730
[JENKINS] Archiving <https://builds.apache.org/job/DeltaSpike%20RAT-Check/ws/deltaspike/modules/bean-validation/api/pom.xml> to org.apache.deltaspike.modules/deltaspike-bean-validation-module-api/1.7.2-SNAPSHOT/deltaspike-bean-validation-module-api-1.7.2-SNAPSHOT.pom
[JENKINS] Archiving <https://builds.apache.org/job/DeltaSpike%20RAT-Check/ws/deltaspike/modules/bean-validation/api/target/deltaspike-bean-validation-module-api-1.7.2-SNAPSHOT.jar> to org.apache.deltaspike.modules/deltaspike-bean-validation-module-api/1.7.2-SNAPSHOT/deltaspike-bean-validation-module-api-1.7.2-SNAPSHOT.jar
[JENKINS] Archiving <https://builds.apache.org/job/DeltaSpike%20RAT-Check/ws/deltaspike/modules/bean-validation/api/target/deltaspike-bean-validation-module-api-1.7.2-SNAPSHOT-tests.jar> to org.apache.deltaspike.modules/deltaspike-bean-validation-module-api/1.7.2-SNAPSHOT/deltaspike-bean-validation-module-api-1.7.2-SNAPSHOT-tests.jar
[JENKINS] Archiving <https://builds.apache.org/job/DeltaSpike%20RAT-Check/ws/deltaspike/modules/bean-validation/api/target/deltaspike-bean-validation-module-api-1.7.2-SNAPSHOT-sources.jar> to org.apache.deltaspike.modules/deltaspike-bean-validation-module-api/1.7.2-SNAPSHOT/deltaspike-bean-validation-module-api-1.7.2-SNAPSHOT-sources.jar
[JENKINS] Archiving <https://builds.apache.org/job/DeltaSpike%20RAT-Check/ws/deltaspike/examples/scheduler-playground/pom.xml> to org.apache.deltaspike.examples/deltaspike-scheduler-example/1.7.2-SNAPSHOT/deltaspike-scheduler-example-1.7.2-SNAPSHOT.pom
[JENKINS] Archiving <https://builds.apache.org/job/DeltaSpike%20RAT-Check/ws/deltaspike/examples/scheduler-playground/target/deltaspike-scheduler-example-1.7.2-SNAPSHOT.jar> to org.apache.deltaspike.examples/deltaspike-scheduler-example/1.7.2-SNAPSHOT/deltaspike-scheduler-example-1.7.2-SNAPSHOT.jar
[JENKINS] Archiving <https://builds.apache.org/job/DeltaSpike%20RAT-Check/ws/deltaspike/examples/scheduler-playground/target/deltaspike-scheduler-example-1.7.2-SNAPSHOT-sources.jar> to org.apache.deltaspike.examples/deltaspike-scheduler-example/1.7.2-SNAPSHOT/deltaspike-scheduler-example-1.7.2-SNAPSHOT-sources.jar
[JENKINS] Archiving <https://builds.apache.org/job/DeltaSpike%20RAT-Check/ws/deltaspike/modules/pom.xml> to org.apache.deltaspike.modules/modules-project/1.7.2-SNAPSHOT/modules-project-1.7.2-SNAPSHOT.pom
[JENKINS] Archiving <https://builds.apache.org/job/DeltaSpike%20RAT-Check/ws/deltaspike/modules/target/modules-project-1.7.2-SNAPSHOT-tests.jar> to org.apache.deltaspike.modules/modules-project/1.7.2-SNAPSHOT/modules-project-1.7.2-SNAPSHOT-tests.jar
[JENKINS] Archiving <https://builds.apache.org/job/DeltaSpike%20RAT-Check/ws/deltaspike/modules/scheduler/pom.xml> to org.apache.deltaspike.modules/scheduler-module-project/1.7.2-SNAPSHOT/scheduler-module-project-1.7.2-SNAPSHOT.pom
[JENKINS] Archiving <https://builds.apache.org/job/DeltaSpike%20RAT-Check/ws/deltaspike/modules/scheduler/target/scheduler-module-project-1.7.2-SNAPSHOT-tests.jar> to org.apache.deltaspike.modules/scheduler-module-project/1.7.2-SNAPSHOT/scheduler-module-project-1.7.2-SNAPSHOT-tests.jar
[JENKINS] Archiving <https://builds.apache.org/job/DeltaSpike%20RAT-Check/ws/deltaspike/test-utils/pom.xml> to org.apache.deltaspike.test/test-utils/1.7.2-SNAPSHOT/test-utils-1.7.2-SNAPSHOT.pom
[JENKINS] Archiving <https://builds.apache.org/job/DeltaSpike%20RAT-Check/ws/deltaspike/test-utils/target/test-utils-1.7.2-SNAPSHOT.jar> to org.apache.deltaspike.test/test-utils/1.7.2-SNAPSHOT/test-utils-1.7.2-SNAPSHOT.jar
[JENKINS] Archiving <https://builds.apache.org/job/DeltaSpike%20RAT-Check/ws/deltaspike/test-utils/target/test-utils-1.7.2-SNAPSHOT-sources.jar> to org.apache.deltaspike.test/test-utils/1.7.2-SNAPSHOT/test-utils-1.7.2-SNAPSHOT-sources.jar
[JENKINS] Archiving <https://builds.apache.org/job/DeltaSpike%20RAT-Check/ws/deltaspike/modules/security/pom.xml> to org.apache.deltaspike.modules/security-module-project/1.7.2-SNAPSHOT/security-module-project-1.7.2-SNAPSHOT.pom
[JENKINS] Archiving <https://builds.apache.org/job/DeltaSpike%20RAT-Check/ws/deltaspike/modules/security/target/security-module-project-1.7.2-SNAPSHOT-tests.jar> to org.apache.deltaspike.modules/security-module-project/1.7.2-SNAPSHOT/security-module-project-1.7.2-SNAPSHOT-tests.jar
[JENKINS] Archiving <https://builds.apache.org/job/DeltaSpike%20RAT-Check/ws/deltaspike/modules/jsf/api/pom.xml> to org.apache.deltaspike.modules/deltaspike-jsf-module-api/1.7.2-SNAPSHOT/deltaspike-jsf-module-api-1.7.2-SNAPSHOT.pom
[JENKINS] Archiving <https://builds.apache.org/job/DeltaSpike%20RAT-Check/ws/deltaspike/modules/jsf/api/target/deltaspike-jsf-module-api-1.7.2-SNAPSHOT.jar> to org.apache.deltaspike.modules/deltaspike-jsf-module-api/1.7.2-SNAPSHOT/deltaspike-jsf-module-api-1.7.2-SNAPSHOT.jar
[JENKINS] Archiving <https://builds.apache.org/job/DeltaSpike%20RAT-Check/ws/deltaspike/modules/jsf/api/target/deltaspike-jsf-module-api-1.7.2-SNAPSHOT-tests.jar> to org.apache.deltaspike.modules/deltaspike-jsf-module-api/1.7.2-SNAPSHOT/deltaspike-jsf-module-api-1.7.2-SNAPSHOT-tests.jar
[JENKINS] Archiving <https://builds.apache.org/job/DeltaSpike%20RAT-Check/ws/deltaspike/modules/jsf/api/target/deltaspike-jsf-module-api-1.7.2-SNAPSHOT-sources.jar> to org.apache.deltaspike.modules/deltaspike-jsf-module-api/1.7.2-SNAPSHOT/deltaspike-jsf-module-api-1.7.2-SNAPSHOT-sources.jar
[JENKINS] Archiving <https://builds.apache.org/job/DeltaSpike%20RAT-Check/ws/deltaspike/modules/data/pom.xml> to org.apache.deltaspike.modules/data-module-project/1.7.2-SNAPSHOT/data-module-project-1.7.2-SNAPSHOT.pom
[JENKINS] Archiving <https://builds.apache.org/job/DeltaSpike%20RAT-Check/ws/deltaspike/modules/data/target/data-module-project-1.7.2-SNAPSHOT-tests.jar> to org.apache.deltaspike.modules/data-module-project/1.7.2-SNAPSHOT/data-module-project-1.7.2-SNAPSHOT-tests.jar
[JENKINS] Archiving <https://builds.apache.org/job/DeltaSpike%20RAT-Check/ws/deltaspike/modules/servlet/impl/pom.xml> to org.apache.deltaspike.modules/deltaspike-servlet-module-impl/1.7.2-SNAPSHOT/deltaspike-servlet-module-impl-1.7.2-SNAPSHOT.pom
[JENKINS] Archiving <https://builds.apache.org/job/DeltaSpike%20RAT-Check/ws/deltaspike/modules/servlet/impl/target/deltaspike-servlet-module-impl-1.7.2-SNAPSHOT.jar> to org.apache.deltaspike.modules/deltaspike-servlet-module-impl/1.7.2-SNAPSHOT/deltaspike-servlet-module-impl-1.7.2-SNAPSHOT.jar
[JENKINS] Archiving <https://builds.apache.org/job/DeltaSpike%20RAT-Check/ws/deltaspike/modules/servlet/impl/target/deltaspike-servlet-module-impl-1.7.2-SNAPSHOT-tests.jar> to org.apache.deltaspike.modules/deltaspike-servlet-module-impl/1.7.2-SNAPSHOT/deltaspike-servlet-module-impl-1.7.2-SNAPSHOT-tests.jar
[JENKINS] Archiving <https://builds.apache.org/job/DeltaSpike%20RAT-Check/ws/deltaspike/modules/servlet/impl/target/deltaspike-servlet-module-impl-1.7.2-SNAPSHOT-sources.jar> to org.apache.deltaspike.modules/deltaspike-servlet-module-impl/1.7.2-SNAPSHOT/deltaspike-servlet-module-impl-1.7.2-SNAPSHOT-sources.jar
[JENKINS] Archiving <https://builds.apache.org/job/DeltaSpike%20RAT-Check/ws/deltaspike/modules/test-control/api/pom.xml> to org.apache.deltaspike.modules/deltaspike-test-control-module-api/1.7.2-SNAPSHOT/deltaspike-test-control-module-api-1.7.2-SNAPSHOT.pom
[JENKINS] Archiving <https://builds.apache.org/job/DeltaSpike%20RAT-Check/ws/deltaspike/modules/test-control/api/target/deltaspike-test-control-module-api-1.7.2-SNAPSHOT.jar> to org.apache.deltaspike.modules/deltaspike-test-control-module-api/1.7.2-SNAPSHOT/deltaspike-test-control-module-api-1.7.2-SNAPSHOT.jar
[JENKINS] Archiving <https://builds.apache.org/job/DeltaSpike%20RAT-Check/ws/deltaspike/modules/test-control/api/target/deltaspike-test-control-module-api-1.7.2-SNAPSHOT-tests.jar> to org.apache.deltaspike.modules/deltaspike-test-control-module-api/1.7.2-SNAPSHOT/deltaspike-test-control-module-api-1.7.2-SNAPSHOT-tests.jar
[JENKINS] Archiving <https://builds.apache.org/job/DeltaSpike%20RAT-Check/ws/deltaspike/modules/test-control/api/target/deltaspike-test-control-module-api-1.7.2-SNAPSHOT-sources.jar> to org.apache.deltaspike.modules/deltaspike-test-control-module-api/1.7.2-SNAPSHOT/deltaspike-test-control-module-api-1.7.2-SNAPSHOT-sources.jar
[JENKINS] Archiving <https://builds.apache.org/job/DeltaSpike%20RAT-Check/ws/deltaspike/cdictrl/impl-openejb/pom.xml> to org.apache.deltaspike.cdictrl/deltaspike-cdictrl-openejb/1.7.2-SNAPSHOT/deltaspike-cdictrl-openejb-1.7.2-SNAPSHOT.pom
[JENKINS] Archiving <https://builds.apache.org/job/DeltaSpike%20RAT-Check/ws/deltaspike/cdictrl/impl-openejb/target/deltaspike-cdictrl-openejb-1.7.2-SNAPSHOT.jar> to org.apache.deltaspike.cdictrl/deltaspike-cdictrl-openejb/1.7.2-SNAPSHOT/deltaspike-cdictrl-openejb-1.7.2-SNAPSHOT.jar
[JENKINS] Archiving <https://builds.apache.org/job/DeltaSpike%20RAT-Check/ws/deltaspike/cdictrl/impl-openejb/target/deltaspike-cdictrl-openejb-1.7.2-SNAPSHOT-tests.jar> to org.apache.deltaspike.cdictrl/deltaspike-cdictrl-openejb/1.7.2-SNAPSHOT/deltaspike-cdictrl-openejb-1.7.2-SNAPSHOT-tests.jar
[JENKINS] Archiving <https://builds.apache.org/job/DeltaSpike%20RAT-Check/ws/deltaspike/cdictrl/impl-openejb/target/deltaspike-cdictrl-openejb-1.7.2-SNAPSHOT-sources.jar> to org.apache.deltaspike.cdictrl/deltaspike-cdictrl-openejb/1.7.2-SNAPSHOT/deltaspike-cdictrl-openejb-1.7.2-SNAPSHOT-sources.jar
[JENKINS] Archiving <https://builds.apache.org/job/DeltaSpike%20RAT-Check/ws/deltaspike/examples/jsf-examples/pom.xml> to org.apache.deltaspike.examples/deltaspike-jsf-example/1.7.2-SNAPSHOT/deltaspike-jsf-example-1.7.2-SNAPSHOT.pom
[JENKINS] Archiving <https://builds.apache.org/job/DeltaSpike%20RAT-Check/ws/deltaspike/examples/jsf-examples/target/ds.war> to org.apache.deltaspike.examples/deltaspike-jsf-example/1.7.2-SNAPSHOT/deltaspike-jsf-example-1.7.2-SNAPSHOT.war
[JENKINS] Archiving <https://builds.apache.org/job/DeltaSpike%20RAT-Check/ws/deltaspike/examples/jsf-examples/target/ds-sources.jar> to org.apache.deltaspike.examples/deltaspike-jsf-example/1.7.2-SNAPSHOT/deltaspike-jsf-example-1.7.2-SNAPSHOT-sources.jar
[JENKINS] Archiving <https://builds.apache.org/job/DeltaSpike%20RAT-Check/ws/deltaspike/modules/jsf/impl-ee6/pom.xml> to org.apache.deltaspike.modules/deltaspike-jsf-module-impl-ee6/1.7.2-SNAPSHOT/deltaspike-jsf-module-impl-ee6-1.7.2-SNAPSHOT.pom
[JENKINS] Archiving <https://builds.apache.org/job/DeltaSpike%20RAT-Check/ws/deltaspike/modules/jsf/impl-ee6/target/deltaspike-jsf-module-impl-ee6-1.7.2-SNAPSHOT.jar> to org.apache.deltaspike.modules/deltaspike-jsf-module-impl-ee6/1.7.2-SNAPSHOT/deltaspike-jsf-module-impl-ee6-1.7.2-SNAPSHOT.jar
[JENKINS] Archiving <https://builds.apache.org/job/DeltaSpike%20RAT-Check/ws/deltaspike/modules/jsf/impl-ee6/target/deltaspike-jsf-module-impl-ee6-1.7.2-SNAPSHOT-tests.jar> to org.apache.deltaspike.modules/deltaspike-jsf-module-impl-ee6/1.7.2-SNAPSHOT/deltaspike-jsf-module-impl-ee6-1.7.2-SNAPSHOT-tests.jar
[JENKINS] Archiving <https://builds.apache.org/job/DeltaSpike%20RAT-Check/ws/deltaspike/modules/jsf/impl-ee6/target/deltaspike-jsf-module-impl-ee6-1.7.2-SNAPSHOT-sources.jar> to org.apache.deltaspike.modules/deltaspike-jsf-module-impl-ee6/1.7.2-SNAPSHOT/deltaspike-jsf-module-impl-ee6-1.7.2-SNAPSHOT-sources.jar
[JENKINS] Archiving <https://builds.apache.org/job/DeltaSpike%20RAT-Check/ws/deltaspike/examples/security-requested-page-after-login-cdi/pom.xml> to org.apache.deltaspike.examples/deltaspike-security-requested-page-after-login-cdi/1.7.2-SNAPSHOT/deltaspike-security-requested-page-after-login-cdi-1.7.2-SNAPSHOT.pom
[JENKINS] Archiving <https://builds.apache.org/job/DeltaSpike%20RAT-Check/ws/deltaspike/examples/security-requested-page-after-login-cdi/target/deltaspike-security-requested-page-after-login-cdi.war> to org.apache.deltaspike.examples/deltaspike-security-requested-page-after-login-cdi/1.7.2-SNAPSHOT/deltaspike-security-requested-page-after-login-cdi-1.7.2-SNAPSHOT.war
[JENKINS] Archiving <https://builds.apache.org/job/DeltaSpike%20RAT-Check/ws/deltaspike/examples/security-requested-page-after-login-cdi/target/deltaspike-security-requested-page-after-login-cdi-sources.jar> to org.apache.deltaspike.examples/deltaspike-security-requested-page-after-login-cdi/1.7.2-SNAPSHOT/deltaspike-security-requested-page-after-login-cdi-1.7.2-SNAPSHOT-sources.jar
[JENKINS] Archiving <https://builds.apache.org/job/DeltaSpike%20RAT-Check/ws/deltaspike/core/pom.xml> to org.apache.deltaspike.core/core-project/1.7.2-SNAPSHOT/core-project-1.7.2-SNAPSHOT.pom
[JENKINS] Archiving <https://builds.apache.org/job/DeltaSpike%20RAT-Check/ws/deltaspike/core/target/core-project-1.7.2-SNAPSHOT-tests.jar> to org.apache.deltaspike.core/core-project/1.7.2-SNAPSHOT/core-project-1.7.2-SNAPSHOT-tests.jar
[JENKINS] Archiving <https://builds.apache.org/job/DeltaSpike%20RAT-Check/ws/site/pom.xml> to org.apache.deltaspike/deltaspike-site/1.7.2-SNAPSHOT/deltaspike-site-1.7.2-SNAPSHOT.pom
Sending e-mails to: commits@deltaspike.apache.org
channel stopped

Mime
View raw message