deltaspike-commits mailing list archives

Site index · List index
Message view « Date » · « Thread »
Top « Date » · « Thread »
From Apache Jenkins Server <jenk...@builds.apache.org>
Subject Build failed in Jenkins: DeltaSpike_Wildfly_10.1 #18
Date Mon, 31 Oct 2016 08:51:14 GMT
See <https://builds.apache.org/job/DeltaSpike_Wildfly_10.1/18/changes>

Changes:

[johndament] DELTASPIKE-1209: Update Data Module documentation

[johndament] DELTASPIKE-1210: DelegateQueryHandler Javadoc fix

[johndament] DELTASPIKE-1211: Fix SingleResultType Javadoc link

------------------------------------------
[...truncated 3393 lines...]
[INFO] 
[INFO] --- maven-resources-plugin:2.7:testResources (default-testResources) @ deltaspike-data-module-test-java8
---
[INFO] Using 'UTF-8' encoding to copy filtered resources.
[INFO] skip non existing resourceDirectory <https://builds.apache.org/job/DeltaSpike_Wildfly_10.1/ws/deltaspike/modules/data/test-java8/src/test/resources>
[INFO] Copying 1 resource
[INFO] Copying 3 resources
[INFO] 
[INFO] --- maven-compiler-plugin:2.3.2:testCompile (default-testCompile) @ deltaspike-data-module-test-java8
---
[INFO] Compiling 7 source files to <https://builds.apache.org/job/DeltaSpike_Wildfly_10.1/ws/deltaspike/modules/data/test-java8/target/test-classes>
[INFO] 
[INFO] --- maven-dependency-plugin:2.4:unpack (unpack-wf) @ deltaspike-data-module-test-java8
---
[INFO] Configured Artifact: org.wildfly:wildfly-dist:10.1.0.Final:zip
[INFO] Unpacking /home/jenkins/jenkins-slave/maven-repositories/1/org/wildfly/wildfly-dist/10.1.0.Final/wildfly-dist-10.1.0.Final.zip
to /tmp/deltaspike-arquillian-containers with includes "" and excludes ""
[INFO] 
[INFO] --- maven-surefire-plugin:2.11:test (default-test) @ deltaspike-data-module-test-java8
---
[INFO] Surefire report directory: <https://builds.apache.org/job/DeltaSpike_Wildfly_10.1/ws/deltaspike/modules/data/test-java8/target/surefire-reports>
[INFO] Using configured provider org.apache.maven.surefire.junitcore.JUnitCoreProvider

-------------------------------------------------------
 T E S T S
-------------------------------------------------------
Java HotSpot(TM) 64-Bit Server VM warning: ignoring option MaxPermSize=256m; support was removed
in 8.0
Concurrency config is parallel='none', perCoreThreadCount=true, threadCount=2, useUnlimitedThreads=false
Running org.apache.deltaspike.data.test.java8.test.Java8Test
Tests run: 1, Failures: 0, Errors: 1, Skipped: 0, Time elapsed: 0 sec <<< FAILURE!

Results :

Tests in error: 
  org.apache.deltaspike.data.test.java8.test.Java8Test: The server is already running! Managed
containers do not support connecting to running server instances due to the possible harmful
effect of connecting to the wrong server. Please stop server before running or change to another
type of container.(..)

Tests run: 1, Failures: 0, Errors: 1, Skipped: 0

[INFO] ------------------------------------------------------------------------
[INFO] Reactor Summary:
[INFO] 
[INFO] Apache DeltaSpike .................................. SUCCESS [  7.559 s]
[INFO] Apache DeltaSpike Sources .......................... SUCCESS [  0.524 s]
[INFO] Apache DeltaSpike CheckStyle-rules ................. SUCCESS [  6.288 s]
[INFO] Apache DeltaSpike Parent ........................... SUCCESS [  5.542 s]
[INFO] Apache DeltaSpike Test-Utils ....................... SUCCESS [  9.129 s]
[INFO] Apache DeltaSpike Code Parent ...................... SUCCESS [ 41.573 s]
[INFO] Apache DeltaSpike Core ............................. SUCCESS [ 10.086 s]
[INFO] Apache DeltaSpike Core-API ......................... SUCCESS [ 39.943 s]
[INFO] Apache DeltaSpike Core-Implementation .............. SUCCESS [ 22.132 s]
[INFO] Apache DeltaSpike ContainerControl parent .......... SUCCESS [ 11.119 s]
[INFO] Apache DeltaSpike CDI ContainerControl API ......... SUCCESS [ 12.632 s]
[INFO] Apache DeltaSpike CDI Weld-ContainerControl ........ SUCCESS [ 12.532 s]
[INFO] Apache DeltaSpike Modules .......................... SUCCESS [  8.933 s]
[INFO] Apache DeltaSpike Proxy-Module ..................... SUCCESS [  8.466 s]
[INFO] Apache DeltaSpike Proxy-Module API ................. SUCCESS [ 15.302 s]
[INFO] Apache DeltaSpike Proxy-Module Impl ASM5 ........... SUCCESS [ 17.939 s]
[INFO] Apache DeltaSpike Security-Module .................. SUCCESS [  9.174 s]
[INFO] Apache DeltaSpike Security-Module API .............. SUCCESS [ 15.865 s]
[INFO] Apache DeltaSpike Security-Module Impl ............. SUCCESS [ 19.012 s]
[INFO] Apache DeltaSpike JPA-Module ....................... SUCCESS [ 10.311 s]
[INFO] Apache DeltaSpike JPA-Module API ................... SUCCESS [ 10.913 s]
[INFO] Apache DeltaSpike JPA-Module Impl .................. SUCCESS [ 16.642 s]
[INFO] Apache DeltaSpike Servlet-Module ................... SUCCESS [ 10.760 s]
[INFO] Apache DeltaSpike Servlet-Module API ............... SUCCESS [ 11.667 s]
[INFO] Apache DeltaSpike Servlet-Module Impl .............. SUCCESS [ 17.111 s]
[INFO] Apache DeltaSpike JSF-Module ....................... SUCCESS [ 10.968 s]
[INFO] Apache DeltaSpike JSF-Module API ................... SUCCESS [ 12.831 s]
[INFO] Apache DeltaSpike JSF-Module Impl .................. SUCCESS [ 30.595 s]
[INFO] Apache DeltaSpike JSF-Module Impl (EE6 only) ....... SUCCESS [ 17.391 s]
[INFO] Apache DeltaSpike Partial-Bean-Module .............. SUCCESS [ 11.035 s]
[INFO] Apache DeltaSpike Partial-Bean-Module API .......... SUCCESS [ 13.880 s]
[INFO] Apache DeltaSpike Partial-Bean-Module Impl ......... SUCCESS [ 20.191 s]
[INFO] Apache DeltaSpike BeanValidation-Module ............ SUCCESS [  8.474 s]
[INFO] Apache DeltaSpike BeanValidation-Module API ........ SUCCESS [ 10.744 s]
[INFO] Apache DeltaSpike BeanValidation-Module Impl ....... SUCCESS [ 17.377 s]
[INFO] Apache DeltaSpike Data-Module ...................... SUCCESS [ 10.676 s]
[INFO] Apache DeltaSpike Data-Module API .................. SUCCESS [ 16.544 s]
[INFO] Apache DeltaSpike Data-Module Impl ................. SUCCESS [ 31.919 s]
[INFO] Apache DeltaSpike Data-Module Tests with Java 8 .... FAILURE [ 10.729 s]
[INFO] Apache DeltaSpike Scheduler-Module ................. SKIPPED
[INFO] Apache DeltaSpike Scheduler-Module API ............. SKIPPED
[INFO] Apache DeltaSpike Scheduler-Module Impl ............ SKIPPED
[INFO] Apache DeltaSpike Test-Control-Module .............. SKIPPED
[INFO] Apache DeltaSpike Test-Control-Module API .......... SKIPPED
[INFO] Apache DeltaSpike Test-Control-Module Impl ......... SKIPPED
[INFO] Apache DeltaSpike Examples ......................... SKIPPED
[INFO] Apache DeltaSpike Java-SE Examples ................. SKIPPED
[INFO] Apache DeltaSpike JSF Examples ..................... SKIPPED
[INFO] Apache DeltaSpike JSF Playground ................... SKIPPED
[INFO] Apache DeltaSpike Security Example CDI ............. SKIPPED
[INFO] Apache DeltaSpike Security Example PicketLink ...... SKIPPED
[INFO] Apache DeltaSpike Java-SE Scheduler Examples ....... SKIPPED
[INFO] Apache DeltaSpike JPA Examples ..................... SKIPPED
[INFO] Apache DeltaSpike Data Examples .................... SKIPPED
[INFO] Apache DeltaSpike Documentation .................... SKIPPED
[INFO] Apache DeltaSpike Site ............................. SKIPPED
[INFO] ------------------------------------------------------------------------
[INFO] BUILD FAILURE
[INFO] ------------------------------------------------------------------------
[INFO] Total time: 12:52 min
[INFO] Finished at: 2016-10-31T08:31:23+00:00
[INFO] Final Memory: 133M/943M
[INFO] ------------------------------------------------------------------------
Waiting for Jenkins to finish collecting data
[ERROR] Failed to execute goal org.apache.maven.plugins:maven-surefire-plugin:2.11:test (default-test)
on project deltaspike-data-module-test-java8: There are test failures.
[ERROR] 
[ERROR] Please refer to <https://builds.apache.org/job/DeltaSpike_Wildfly_10.1/ws/deltaspike/modules/data/test-java8/target/surefire-reports>
for the individual test results.
[ERROR] -> [Help 1]
[ERROR] 
[ERROR] To see the full stack trace of the errors, re-run Maven with the -e switch.
[ERROR] Re-run Maven using the -X switch to enable full debug logging.
[ERROR] 
[ERROR] For more information about the errors and possible solutions, please read the following
articles:
[ERROR] [Help 1] http://cwiki.apache.org/confluence/display/MAVEN/MojoFailureException
[ERROR] 
[ERROR] After correcting the problems, you can resume the build with the command
[ERROR]   mvn <goals> -rf :deltaspike-data-module-test-java8
[JENKINS] Archiving <https://builds.apache.org/job/DeltaSpike_Wildfly_10.1/ws/deltaspike/modules/jsf/impl/pom.xml>
to org.apache.deltaspike.modules/deltaspike-jsf-module-impl/1.7.2-SNAPSHOT/deltaspike-jsf-module-impl-1.7.2-SNAPSHOT.pom
[JENKINS] Archiving <https://builds.apache.org/job/DeltaSpike_Wildfly_10.1/ws/deltaspike/modules/jsf/impl/target/deltaspike-jsf-module-impl-1.7.2-SNAPSHOT.jar>
to org.apache.deltaspike.modules/deltaspike-jsf-module-impl/1.7.2-SNAPSHOT/deltaspike-jsf-module-impl-1.7.2-SNAPSHOT.jar
[JENKINS] Archiving <https://builds.apache.org/job/DeltaSpike_Wildfly_10.1/ws/deltaspike/modules/jsf/impl/target/deltaspike-jsf-module-impl-1.7.2-SNAPSHOT-tests.jar>
to org.apache.deltaspike.modules/deltaspike-jsf-module-impl/1.7.2-SNAPSHOT/deltaspike-jsf-module-impl-1.7.2-SNAPSHOT-tests.jar
[JENKINS] Archiving <https://builds.apache.org/job/DeltaSpike_Wildfly_10.1/ws/deltaspike/modules/jsf/impl/target/deltaspike-jsf-module-impl-1.7.2-SNAPSHOT-sources.jar>
to org.apache.deltaspike.modules/deltaspike-jsf-module-impl/1.7.2-SNAPSHOT/deltaspike-jsf-module-impl-1.7.2-SNAPSHOT-sources.jar
[JENKINS] Archiving <https://builds.apache.org/job/DeltaSpike_Wildfly_10.1/ws/deltaspike/modules/data/impl/pom.xml>
to org.apache.deltaspike.modules/deltaspike-data-module-impl/1.7.2-SNAPSHOT/deltaspike-data-module-impl-1.7.2-SNAPSHOT.pom
[JENKINS] Archiving <https://builds.apache.org/job/DeltaSpike_Wildfly_10.1/ws/deltaspike/modules/data/impl/target/deltaspike-data-module-impl-1.7.2-SNAPSHOT.jar>
to org.apache.deltaspike.modules/deltaspike-data-module-impl/1.7.2-SNAPSHOT/deltaspike-data-module-impl-1.7.2-SNAPSHOT.jar
[JENKINS] Archiving <https://builds.apache.org/job/DeltaSpike_Wildfly_10.1/ws/deltaspike/modules/data/impl/target/deltaspike-data-module-impl-1.7.2-SNAPSHOT-tests.jar>
to org.apache.deltaspike.modules/deltaspike-data-module-impl/1.7.2-SNAPSHOT/deltaspike-data-module-impl-1.7.2-SNAPSHOT-tests.jar
[JENKINS] Archiving <https://builds.apache.org/job/DeltaSpike_Wildfly_10.1/ws/deltaspike/modules/data/impl/target/deltaspike-data-module-impl-1.7.2-SNAPSHOT-sources.jar>
to org.apache.deltaspike.modules/deltaspike-data-module-impl/1.7.2-SNAPSHOT/deltaspike-data-module-impl-1.7.2-SNAPSHOT-sources.jar
[JENKINS] Archiving <https://builds.apache.org/job/DeltaSpike_Wildfly_10.1/ws/deltaspike/modules/jsf/pom.xml>
to org.apache.deltaspike.modules/jsf-module-project/1.7.2-SNAPSHOT/jsf-module-project-1.7.2-SNAPSHOT.pom
[JENKINS] Archiving <https://builds.apache.org/job/DeltaSpike_Wildfly_10.1/ws/deltaspike/modules/jsf/target/jsf-module-project-1.7.2-SNAPSHOT-tests.jar>
to org.apache.deltaspike.modules/jsf-module-project/1.7.2-SNAPSHOT/jsf-module-project-1.7.2-SNAPSHOT-tests.jar
[JENKINS] Archiving <https://builds.apache.org/job/DeltaSpike_Wildfly_10.1/ws/deltaspike/modules/bean-validation/impl/pom.xml>
to org.apache.deltaspike.modules/deltaspike-bean-validation-module-impl/1.7.2-SNAPSHOT/deltaspike-bean-validation-module-impl-1.7.2-SNAPSHOT.pom
[JENKINS] Archiving <https://builds.apache.org/job/DeltaSpike_Wildfly_10.1/ws/deltaspike/modules/bean-validation/impl/target/deltaspike-bean-validation-module-impl-1.7.2-SNAPSHOT.jar>
to org.apache.deltaspike.modules/deltaspike-bean-validation-module-impl/1.7.2-SNAPSHOT/deltaspike-bean-validation-module-impl-1.7.2-SNAPSHOT.jar
[JENKINS] Archiving <https://builds.apache.org/job/DeltaSpike_Wildfly_10.1/ws/deltaspike/modules/bean-validation/impl/target/deltaspike-bean-validation-module-impl-1.7.2-SNAPSHOT-tests.jar>
to org.apache.deltaspike.modules/deltaspike-bean-validation-module-impl/1.7.2-SNAPSHOT/deltaspike-bean-validation-module-impl-1.7.2-SNAPSHOT-tests.jar
[JENKINS] Archiving <https://builds.apache.org/job/DeltaSpike_Wildfly_10.1/ws/deltaspike/modules/bean-validation/impl/target/deltaspike-bean-validation-module-impl-1.7.2-SNAPSHOT-sources.jar>
to org.apache.deltaspike.modules/deltaspike-bean-validation-module-impl/1.7.2-SNAPSHOT/deltaspike-bean-validation-module-impl-1.7.2-SNAPSHOT-sources.jar
[JENKINS] Archiving <https://builds.apache.org/job/DeltaSpike_Wildfly_10.1/ws/deltaspike/examples/jpa-examples/pom.xml>
to org.apache.deltaspike.examples/deltaspike-jpa-examples/1.7.2-SNAPSHOT/deltaspike-jpa-examples-1.7.2-SNAPSHOT.pom
[JENKINS] Archiving <https://builds.apache.org/job/DeltaSpike_Wildfly_10.1/ws/deltaspike/cdictrl/pom.xml>
to org.apache.deltaspike.cdictrl/cdictrl-project/1.7.2-SNAPSHOT/cdictrl-project-1.7.2-SNAPSHOT.pom
[JENKINS] Archiving <https://builds.apache.org/job/DeltaSpike_Wildfly_10.1/ws/deltaspike/cdictrl/target/cdictrl-project-1.7.2-SNAPSHOT-tests.jar>
to org.apache.deltaspike.cdictrl/cdictrl-project/1.7.2-SNAPSHOT/cdictrl-project-1.7.2-SNAPSHOT-tests.jar
[JENKINS] Archiving <https://builds.apache.org/job/DeltaSpike_Wildfly_10.1/ws/deltaspike/modules/partial-bean/api/pom.xml>
to org.apache.deltaspike.modules/deltaspike-partial-bean-module-api/1.7.2-SNAPSHOT/deltaspike-partial-bean-module-api-1.7.2-SNAPSHOT.pom
[JENKINS] Archiving <https://builds.apache.org/job/DeltaSpike_Wildfly_10.1/ws/deltaspike/modules/partial-bean/api/target/deltaspike-partial-bean-module-api-1.7.2-SNAPSHOT.jar>
to org.apache.deltaspike.modules/deltaspike-partial-bean-module-api/1.7.2-SNAPSHOT/deltaspike-partial-bean-module-api-1.7.2-SNAPSHOT.jar
[JENKINS] Archiving <https://builds.apache.org/job/DeltaSpike_Wildfly_10.1/ws/deltaspike/modules/partial-bean/api/target/deltaspike-partial-bean-module-api-1.7.2-SNAPSHOT-tests.jar>
to org.apache.deltaspike.modules/deltaspike-partial-bean-module-api/1.7.2-SNAPSHOT/deltaspike-partial-bean-module-api-1.7.2-SNAPSHOT-tests.jar
[JENKINS] Archiving <https://builds.apache.org/job/DeltaSpike_Wildfly_10.1/ws/deltaspike/modules/partial-bean/api/target/deltaspike-partial-bean-module-api-1.7.2-SNAPSHOT-sources.jar>
to org.apache.deltaspike.modules/deltaspike-partial-bean-module-api/1.7.2-SNAPSHOT/deltaspike-partial-bean-module-api-1.7.2-SNAPSHOT-sources.jar
[JENKINS] Archiving <https://builds.apache.org/job/DeltaSpike_Wildfly_10.1/ws/deltaspike/cdictrl/api/pom.xml>
to org.apache.deltaspike.cdictrl/deltaspike-cdictrl-api/1.7.2-SNAPSHOT/deltaspike-cdictrl-api-1.7.2-SNAPSHOT.pom
[JENKINS] Archiving <https://builds.apache.org/job/DeltaSpike_Wildfly_10.1/ws/deltaspike/cdictrl/api/target/deltaspike-cdictrl-api-1.7.2-SNAPSHOT.jar>
to org.apache.deltaspike.cdictrl/deltaspike-cdictrl-api/1.7.2-SNAPSHOT/deltaspike-cdictrl-api-1.7.2-SNAPSHOT.jar
[JENKINS] Archiving <https://builds.apache.org/job/DeltaSpike_Wildfly_10.1/ws/deltaspike/cdictrl/api/target/deltaspike-cdictrl-api-1.7.2-SNAPSHOT-tests.jar>
to org.apache.deltaspike.cdictrl/deltaspike-cdictrl-api/1.7.2-SNAPSHOT/deltaspike-cdictrl-api-1.7.2-SNAPSHOT-tests.jar
[JENKINS] Archiving <https://builds.apache.org/job/DeltaSpike_Wildfly_10.1/ws/deltaspike/cdictrl/api/target/deltaspike-cdictrl-api-1.7.2-SNAPSHOT-sources.jar>
to org.apache.deltaspike.cdictrl/deltaspike-cdictrl-api/1.7.2-SNAPSHOT/deltaspike-cdictrl-api-1.7.2-SNAPSHOT-sources.jar
[JENKINS] Archiving <https://builds.apache.org/job/DeltaSpike_Wildfly_10.1/ws/deltaspike/modules/security/api/pom.xml>
to org.apache.deltaspike.modules/deltaspike-security-module-api/1.7.2-SNAPSHOT/deltaspike-security-module-api-1.7.2-SNAPSHOT.pom
[JENKINS] Archiving <https://builds.apache.org/job/DeltaSpike_Wildfly_10.1/ws/deltaspike/modules/security/api/target/deltaspike-security-module-api-1.7.2-SNAPSHOT.jar>
to org.apache.deltaspike.modules/deltaspike-security-module-api/1.7.2-SNAPSHOT/deltaspike-security-module-api-1.7.2-SNAPSHOT.jar
[JENKINS] Archiving <https://builds.apache.org/job/DeltaSpike_Wildfly_10.1/ws/deltaspike/modules/security/api/target/deltaspike-security-module-api-1.7.2-SNAPSHOT-tests.jar>
to org.apache.deltaspike.modules/deltaspike-security-module-api/1.7.2-SNAPSHOT/deltaspike-security-module-api-1.7.2-SNAPSHOT-tests.jar
[JENKINS] Archiving <https://builds.apache.org/job/DeltaSpike_Wildfly_10.1/ws/deltaspike/modules/security/api/target/deltaspike-security-module-api-1.7.2-SNAPSHOT-sources.jar>
to org.apache.deltaspike.modules/deltaspike-security-module-api/1.7.2-SNAPSHOT/deltaspike-security-module-api-1.7.2-SNAPSHOT-sources.jar
[JENKINS] Archiving <https://builds.apache.org/job/DeltaSpike_Wildfly_10.1/ws/deltaspike/modules/data/api/pom.xml>
to org.apache.deltaspike.modules/deltaspike-data-module-api/1.7.2-SNAPSHOT/deltaspike-data-module-api-1.7.2-SNAPSHOT.pom
[JENKINS] Archiving <https://builds.apache.org/job/DeltaSpike_Wildfly_10.1/ws/deltaspike/modules/data/api/target/deltaspike-data-module-api-1.7.2-SNAPSHOT.jar>
to org.apache.deltaspike.modules/deltaspike-data-module-api/1.7.2-SNAPSHOT/deltaspike-data-module-api-1.7.2-SNAPSHOT.jar
[JENKINS] Archiving <https://builds.apache.org/job/DeltaSpike_Wildfly_10.1/ws/deltaspike/modules/data/api/target/deltaspike-data-module-api-1.7.2-SNAPSHOT-tests.jar>
to org.apache.deltaspike.modules/deltaspike-data-module-api/1.7.2-SNAPSHOT/deltaspike-data-module-api-1.7.2-SNAPSHOT-tests.jar
[JENKINS] Archiving <https://builds.apache.org/job/DeltaSpike_Wildfly_10.1/ws/deltaspike/modules/data/api/target/deltaspike-data-module-api-1.7.2-SNAPSHOT-sources.jar>
to org.apache.deltaspike.modules/deltaspike-data-module-api/1.7.2-SNAPSHOT/deltaspike-data-module-api-1.7.2-SNAPSHOT-sources.jar
[JENKINS] Archiving <https://builds.apache.org/job/DeltaSpike_Wildfly_10.1/ws/documentation/pom.xml>
to org.apache.deltaspike/deltaspike-documentation/1.7.2-SNAPSHOT/deltaspike-documentation-1.7.2-SNAPSHOT.pom
[JENKINS] Archiving <https://builds.apache.org/job/DeltaSpike_Wildfly_10.1/ws/deltaspike/examples/jse-examples/pom.xml>
to org.apache.deltaspike.examples/deltaspike-jse-example/1.7.2-SNAPSHOT/deltaspike-jse-example-1.7.2-SNAPSHOT.pom
[JENKINS] Archiving <https://builds.apache.org/job/DeltaSpike_Wildfly_10.1/ws/deltaspike/examples/pom.xml>
to org.apache.deltaspike.examples/examples-project/1.7.2-SNAPSHOT/examples-project-1.7.2-SNAPSHOT.pom
[JENKINS] Archiving <https://builds.apache.org/job/DeltaSpike_Wildfly_10.1/ws/deltaspike/modules/jpa/pom.xml>
to org.apache.deltaspike.modules/jpa-module-project/1.7.2-SNAPSHOT/jpa-module-project-1.7.2-SNAPSHOT.pom
[JENKINS] Archiving <https://builds.apache.org/job/DeltaSpike_Wildfly_10.1/ws/deltaspike/modules/jpa/target/jpa-module-project-1.7.2-SNAPSHOT-tests.jar>
to org.apache.deltaspike.modules/jpa-module-project/1.7.2-SNAPSHOT/jpa-module-project-1.7.2-SNAPSHOT-tests.jar
[JENKINS] Archiving <https://builds.apache.org/job/DeltaSpike_Wildfly_10.1/ws/deltaspike/modules/servlet/pom.xml>
to org.apache.deltaspike.modules/servlet-module-project/1.7.2-SNAPSHOT/servlet-module-project-1.7.2-SNAPSHOT.pom
[JENKINS] Archiving <https://builds.apache.org/job/DeltaSpike_Wildfly_10.1/ws/deltaspike/modules/servlet/target/servlet-module-project-1.7.2-SNAPSHOT-tests.jar>
to org.apache.deltaspike.modules/servlet-module-project/1.7.2-SNAPSHOT/servlet-module-project-1.7.2-SNAPSHOT-tests.jar
[JENKINS] Archiving <https://builds.apache.org/job/DeltaSpike_Wildfly_10.1/ws/deltaspike/pom.xml>
to org.apache.deltaspike/deltaspike-project/1.7.2-SNAPSHOT/deltaspike-project-1.7.2-SNAPSHOT.pom
[JENKINS] Archiving <https://builds.apache.org/job/DeltaSpike_Wildfly_10.1/ws/pom.xml>
to org.apache.deltaspike/deltaspike/1.7.2-SNAPSHOT/deltaspike-1.7.2-SNAPSHOT.pom
[JENKINS] Archiving <https://builds.apache.org/job/DeltaSpike_Wildfly_10.1/ws/deltaspike/core/impl/pom.xml>
to org.apache.deltaspike.core/deltaspike-core-impl/1.7.2-SNAPSHOT/deltaspike-core-impl-1.7.2-SNAPSHOT.pom
[JENKINS] Archiving <https://builds.apache.org/job/DeltaSpike_Wildfly_10.1/ws/deltaspike/core/impl/target/deltaspike-core-impl-1.7.2-SNAPSHOT.jar>
to org.apache.deltaspike.core/deltaspike-core-impl/1.7.2-SNAPSHOT/deltaspike-core-impl-1.7.2-SNAPSHOT.jar
[JENKINS] Archiving <https://builds.apache.org/job/DeltaSpike_Wildfly_10.1/ws/deltaspike/core/impl/target/deltaspike-core-impl-1.7.2-SNAPSHOT-tests.jar>
to org.apache.deltaspike.core/deltaspike-core-impl/1.7.2-SNAPSHOT/deltaspike-core-impl-1.7.2-SNAPSHOT-tests.jar
[JENKINS] Archiving <https://builds.apache.org/job/DeltaSpike_Wildfly_10.1/ws/deltaspike/core/impl/target/deltaspike-core-impl-1.7.2-SNAPSHOT-sources.jar>
to org.apache.deltaspike.core/deltaspike-core-impl/1.7.2-SNAPSHOT/deltaspike-core-impl-1.7.2-SNAPSHOT-sources.jar
[JENKINS] Archiving <https://builds.apache.org/job/DeltaSpike_Wildfly_10.1/ws/deltaspike/modules/partial-bean/pom.xml>
to org.apache.deltaspike.modules/partial-bean-module-project/1.7.2-SNAPSHOT/partial-bean-module-project-1.7.2-SNAPSHOT.pom
[JENKINS] Archiving <https://builds.apache.org/job/DeltaSpike_Wildfly_10.1/ws/deltaspike/modules/partial-bean/target/partial-bean-module-project-1.7.2-SNAPSHOT-tests.jar>
to org.apache.deltaspike.modules/partial-bean-module-project/1.7.2-SNAPSHOT/partial-bean-module-project-1.7.2-SNAPSHOT-tests.jar
[JENKINS] Archiving <https://builds.apache.org/job/DeltaSpike_Wildfly_10.1/ws/deltaspike/cdictrl/impl-weld/pom.xml>
to org.apache.deltaspike.cdictrl/deltaspike-cdictrl-weld/1.7.2-SNAPSHOT/deltaspike-cdictrl-weld-1.7.2-SNAPSHOT.pom
[JENKINS] Archiving <https://builds.apache.org/job/DeltaSpike_Wildfly_10.1/ws/deltaspike/cdictrl/impl-weld/target/deltaspike-cdictrl-weld-1.7.2-SNAPSHOT.jar>
to org.apache.deltaspike.cdictrl/deltaspike-cdictrl-weld/1.7.2-SNAPSHOT/deltaspike-cdictrl-weld-1.7.2-SNAPSHOT.jar
[JENKINS] Archiving <https://builds.apache.org/job/DeltaSpike_Wildfly_10.1/ws/deltaspike/cdictrl/impl-weld/target/deltaspike-cdictrl-weld-1.7.2-SNAPSHOT-tests.jar>
to org.apache.deltaspike.cdictrl/deltaspike-cdictrl-weld/1.7.2-SNAPSHOT/deltaspike-cdictrl-weld-1.7.2-SNAPSHOT-tests.jar
[JENKINS] Archiving <https://builds.apache.org/job/DeltaSpike_Wildfly_10.1/ws/deltaspike/cdictrl/impl-weld/target/deltaspike-cdictrl-weld-1.7.2-SNAPSHOT-sources.jar>
to org.apache.deltaspike.cdictrl/deltaspike-cdictrl-weld/1.7.2-SNAPSHOT/deltaspike-cdictrl-weld-1.7.2-SNAPSHOT-sources.jar
[JENKINS] Archiving <https://builds.apache.org/job/DeltaSpike_Wildfly_10.1/ws/deltaspike/modules/proxy/pom.xml>
to org.apache.deltaspike.modules/proxy-module-project/1.7.2-SNAPSHOT/proxy-module-project-1.7.2-SNAPSHOT.pom
[JENKINS] Archiving <https://builds.apache.org/job/DeltaSpike_Wildfly_10.1/ws/deltaspike/modules/proxy/target/proxy-module-project-1.7.2-SNAPSHOT-tests.jar>
to org.apache.deltaspike.modules/proxy-module-project/1.7.2-SNAPSHOT/proxy-module-project-1.7.2-SNAPSHOT-tests.jar
[JENKINS] Archiving <https://builds.apache.org/job/DeltaSpike_Wildfly_10.1/ws/deltaspike/parent/pom.xml>
to org.apache.deltaspike/parent/1.7.2-SNAPSHOT/parent-1.7.2-SNAPSHOT.pom
Compressed 40.41 KB of artifacts by 79.2% relative to #17
[JENKINS] Archiving <https://builds.apache.org/job/DeltaSpike_Wildfly_10.1/ws/deltaspike/modules/security/impl/pom.xml>
to org.apache.deltaspike.modules/deltaspike-security-module-impl/1.7.2-SNAPSHOT/deltaspike-security-module-impl-1.7.2-SNAPSHOT.pom
[JENKINS] Archiving <https://builds.apache.org/job/DeltaSpike_Wildfly_10.1/ws/deltaspike/modules/security/impl/target/deltaspike-security-module-impl-1.7.2-SNAPSHOT.jar>
to org.apache.deltaspike.modules/deltaspike-security-module-impl/1.7.2-SNAPSHOT/deltaspike-security-module-impl-1.7.2-SNAPSHOT.jar
[JENKINS] Archiving <https://builds.apache.org/job/DeltaSpike_Wildfly_10.1/ws/deltaspike/modules/security/impl/target/deltaspike-security-module-impl-1.7.2-SNAPSHOT-tests.jar>
to org.apache.deltaspike.modules/deltaspike-security-module-impl/1.7.2-SNAPSHOT/deltaspike-security-module-impl-1.7.2-SNAPSHOT-tests.jar
[JENKINS] Archiving <https://builds.apache.org/job/DeltaSpike_Wildfly_10.1/ws/deltaspike/modules/security/impl/target/deltaspike-security-module-impl-1.7.2-SNAPSHOT-sources.jar>
to org.apache.deltaspike.modules/deltaspike-security-module-impl/1.7.2-SNAPSHOT/deltaspike-security-module-impl-1.7.2-SNAPSHOT-sources.jar
[JENKINS] Archiving <https://builds.apache.org/job/DeltaSpike_Wildfly_10.1/ws/deltaspike/modules/jpa/api/pom.xml>
to org.apache.deltaspike.modules/deltaspike-jpa-module-api/1.7.2-SNAPSHOT/deltaspike-jpa-module-api-1.7.2-SNAPSHOT.pom
[JENKINS] Archiving <https://builds.apache.org/job/DeltaSpike_Wildfly_10.1/ws/deltaspike/modules/jpa/api/target/deltaspike-jpa-module-api-1.7.2-SNAPSHOT.jar>
to org.apache.deltaspike.modules/deltaspike-jpa-module-api/1.7.2-SNAPSHOT/deltaspike-jpa-module-api-1.7.2-SNAPSHOT.jar
[JENKINS] Archiving <https://builds.apache.org/job/DeltaSpike_Wildfly_10.1/ws/deltaspike/modules/jpa/api/target/deltaspike-jpa-module-api-1.7.2-SNAPSHOT-tests.jar>
to org.apache.deltaspike.modules/deltaspike-jpa-module-api/1.7.2-SNAPSHOT/deltaspike-jpa-module-api-1.7.2-SNAPSHOT-tests.jar
[JENKINS] Archiving <https://builds.apache.org/job/DeltaSpike_Wildfly_10.1/ws/deltaspike/modules/jpa/api/target/deltaspike-jpa-module-api-1.7.2-SNAPSHOT-sources.jar>
to org.apache.deltaspike.modules/deltaspike-jpa-module-api/1.7.2-SNAPSHOT/deltaspike-jpa-module-api-1.7.2-SNAPSHOT-sources.jar
[JENKINS] Archiving <https://builds.apache.org/job/DeltaSpike_Wildfly_10.1/ws/deltaspike/modules/proxy/impl-asm5/pom.xml>
to org.apache.deltaspike.modules/deltaspike-proxy-module-impl-asm5/1.7.2-SNAPSHOT/deltaspike-proxy-module-impl-asm5-1.7.2-SNAPSHOT.pom
[JENKINS] Archiving <https://builds.apache.org/job/DeltaSpike_Wildfly_10.1/ws/deltaspike/modules/proxy/impl-asm5/target/deltaspike-proxy-module-impl-asm5-1.7.2-SNAPSHOT.jar>
to org.apache.deltaspike.modules/deltaspike-proxy-module-impl-asm5/1.7.2-SNAPSHOT/deltaspike-proxy-module-impl-asm5-1.7.2-SNAPSHOT.jar
[JENKINS] Archiving <https://builds.apache.org/job/DeltaSpike_Wildfly_10.1/ws/deltaspike/modules/proxy/impl-asm5/target/deltaspike-proxy-module-impl-asm5-1.7.2-SNAPSHOT-tests.jar>
to org.apache.deltaspike.modules/deltaspike-proxy-module-impl-asm5/1.7.2-SNAPSHOT/deltaspike-proxy-module-impl-asm5-1.7.2-SNAPSHOT-tests.jar
[JENKINS] Archiving <https://builds.apache.org/job/DeltaSpike_Wildfly_10.1/ws/deltaspike/modules/proxy/impl-asm5/target/deltaspike-proxy-module-impl-asm5-1.7.2-SNAPSHOT-sources.jar>
to org.apache.deltaspike.modules/deltaspike-proxy-module-impl-asm5/1.7.2-SNAPSHOT/deltaspike-proxy-module-impl-asm5-1.7.2-SNAPSHOT-sources.jar
[JENKINS] Archiving <https://builds.apache.org/job/DeltaSpike_Wildfly_10.1/ws/deltaspike/modules/bean-validation/pom.xml>
to org.apache.deltaspike.modules/bean-validation-module-project/1.7.2-SNAPSHOT/bean-validation-module-project-1.7.2-SNAPSHOT.pom
[JENKINS] Archiving <https://builds.apache.org/job/DeltaSpike_Wildfly_10.1/ws/deltaspike/modules/bean-validation/target/bean-validation-module-project-1.7.2-SNAPSHOT-tests.jar>
to org.apache.deltaspike.modules/bean-validation-module-project/1.7.2-SNAPSHOT/bean-validation-module-project-1.7.2-SNAPSHOT-tests.jar
[JENKINS] Archiving <https://builds.apache.org/job/DeltaSpike_Wildfly_10.1/ws/deltaspike/parent/code/pom.xml>
to org.apache.deltaspike/parent-code/1.7.2-SNAPSHOT/parent-code-1.7.2-SNAPSHOT.pom
[JENKINS] Archiving <https://builds.apache.org/job/DeltaSpike_Wildfly_10.1/ws/deltaspike/parent/code/target/parent-code-1.7.2-SNAPSHOT-tests.jar>
to org.apache.deltaspike/parent-code/1.7.2-SNAPSHOT/parent-code-1.7.2-SNAPSHOT-tests.jar
Compressed 98.21 KB of artifacts by 65.2% relative to #17
[JENKINS] Archiving <https://builds.apache.org/job/DeltaSpike_Wildfly_10.1/ws/deltaspike/modules/jpa/impl/pom.xml>
to org.apache.deltaspike.modules/deltaspike-jpa-module-impl/1.7.2-SNAPSHOT/deltaspike-jpa-module-impl-1.7.2-SNAPSHOT.pom
[JENKINS] Archiving <https://builds.apache.org/job/DeltaSpike_Wildfly_10.1/ws/deltaspike/modules/jpa/impl/target/deltaspike-jpa-module-impl-1.7.2-SNAPSHOT.jar>
to org.apache.deltaspike.modules/deltaspike-jpa-module-impl/1.7.2-SNAPSHOT/deltaspike-jpa-module-impl-1.7.2-SNAPSHOT.jar
[JENKINS] Archiving <https://builds.apache.org/job/DeltaSpike_Wildfly_10.1/ws/deltaspike/modules/jpa/impl/target/deltaspike-jpa-module-impl-1.7.2-SNAPSHOT-tests.jar>
to org.apache.deltaspike.modules/deltaspike-jpa-module-impl/1.7.2-SNAPSHOT/deltaspike-jpa-module-impl-1.7.2-SNAPSHOT-tests.jar
[JENKINS] Archiving <https://builds.apache.org/job/DeltaSpike_Wildfly_10.1/ws/deltaspike/modules/jpa/impl/target/deltaspike-jpa-module-impl-1.7.2-SNAPSHOT-sources.jar>
to org.apache.deltaspike.modules/deltaspike-jpa-module-impl/1.7.2-SNAPSHOT/deltaspike-jpa-module-impl-1.7.2-SNAPSHOT-sources.jar
[JENKINS] Archiving <https://builds.apache.org/job/DeltaSpike_Wildfly_10.1/ws/deltaspike/modules/partial-bean/impl/pom.xml>
to org.apache.deltaspike.modules/deltaspike-partial-bean-module-impl/1.7.2-SNAPSHOT/deltaspike-partial-bean-module-impl-1.7.2-SNAPSHOT.pom
[JENKINS] Archiving <https://builds.apache.org/job/DeltaSpike_Wildfly_10.1/ws/deltaspike/modules/partial-bean/impl/target/deltaspike-partial-bean-module-impl-1.7.2-SNAPSHOT.jar>
to org.apache.deltaspike.modules/deltaspike-partial-bean-module-impl/1.7.2-SNAPSHOT/deltaspike-partial-bean-module-impl-1.7.2-SNAPSHOT.jar
[JENKINS] Archiving <https://builds.apache.org/job/DeltaSpike_Wildfly_10.1/ws/deltaspike/modules/partial-bean/impl/target/deltaspike-partial-bean-module-impl-1.7.2-SNAPSHOT-tests.jar>
to org.apache.deltaspike.modules/deltaspike-partial-bean-module-impl/1.7.2-SNAPSHOT/deltaspike-partial-bean-module-impl-1.7.2-SNAPSHOT-tests.jar
[JENKINS] Archiving <https://builds.apache.org/job/DeltaSpike_Wildfly_10.1/ws/deltaspike/modules/partial-bean/impl/target/deltaspike-partial-bean-module-impl-1.7.2-SNAPSHOT-sources.jar>
to org.apache.deltaspike.modules/deltaspike-partial-bean-module-impl/1.7.2-SNAPSHOT/deltaspike-partial-bean-module-impl-1.7.2-SNAPSHOT-sources.jar
[JENKINS] Archiving <https://builds.apache.org/job/DeltaSpike_Wildfly_10.1/ws/deltaspike/modules/scheduler/api/pom.xml>
to org.apache.deltaspike.modules/deltaspike-scheduler-module-api/1.7.2-SNAPSHOT/deltaspike-scheduler-module-api-1.7.2-SNAPSHOT.pom
[JENKINS] Archiving <https://builds.apache.org/job/DeltaSpike_Wildfly_10.1/ws/deltaspike/modules/test-control/pom.xml>
to org.apache.deltaspike.modules/test-control-module-project/1.7.2-SNAPSHOT/test-control-module-project-1.7.2-SNAPSHOT.pom
[JENKINS] Archiving <https://builds.apache.org/job/DeltaSpike_Wildfly_10.1/ws/deltaspike/modules/scheduler/impl/pom.xml>
to org.apache.deltaspike.modules/deltaspike-scheduler-module-impl/1.7.2-SNAPSHOT/deltaspike-scheduler-module-impl-1.7.2-SNAPSHOT.pom
[JENKINS] Archiving <https://builds.apache.org/job/DeltaSpike_Wildfly_10.1/ws/deltaspike/examples/jsf-playground/pom.xml>
to org.apache.deltaspike.examples/deltaspike-jsf-playground/1.7.2-SNAPSHOT/deltaspike-jsf-playground-1.7.2-SNAPSHOT.pom
[JENKINS] Archiving <https://builds.apache.org/job/DeltaSpike_Wildfly_10.1/ws/deltaspike/modules/test-control/impl/pom.xml>
to org.apache.deltaspike.modules/deltaspike-test-control-module-impl/1.7.2-SNAPSHOT/deltaspike-test-control-module-impl-1.7.2-SNAPSHOT.pom
[JENKINS] Archiving <https://builds.apache.org/job/DeltaSpike_Wildfly_10.1/ws/deltaspike/checkstyle-rules/pom.xml>
to org.apache.deltaspike/checkstyle-rules/1.7.2-SNAPSHOT/checkstyle-rules-1.7.2-SNAPSHOT.pom
[JENKINS] Archiving <https://builds.apache.org/job/DeltaSpike_Wildfly_10.1/ws/deltaspike/checkstyle-rules/target/checkstyle-rules-1.7.2-SNAPSHOT.jar>
to org.apache.deltaspike/checkstyle-rules/1.7.2-SNAPSHOT/checkstyle-rules-1.7.2-SNAPSHOT.jar
[JENKINS] Archiving <https://builds.apache.org/job/DeltaSpike_Wildfly_10.1/ws/deltaspike/modules/proxy/api/pom.xml>
to org.apache.deltaspike.modules/deltaspike-proxy-module-api/1.7.2-SNAPSHOT/deltaspike-proxy-module-api-1.7.2-SNAPSHOT.pom
[JENKINS] Archiving <https://builds.apache.org/job/DeltaSpike_Wildfly_10.1/ws/deltaspike/modules/proxy/api/target/deltaspike-proxy-module-api-1.7.2-SNAPSHOT.jar>
to org.apache.deltaspike.modules/deltaspike-proxy-module-api/1.7.2-SNAPSHOT/deltaspike-proxy-module-api-1.7.2-SNAPSHOT.jar
[JENKINS] Archiving <https://builds.apache.org/job/DeltaSpike_Wildfly_10.1/ws/deltaspike/modules/proxy/api/target/deltaspike-proxy-module-api-1.7.2-SNAPSHOT-tests.jar>
to org.apache.deltaspike.modules/deltaspike-proxy-module-api/1.7.2-SNAPSHOT/deltaspike-proxy-module-api-1.7.2-SNAPSHOT-tests.jar
[JENKINS] Archiving <https://builds.apache.org/job/DeltaSpike_Wildfly_10.1/ws/deltaspike/modules/proxy/api/target/deltaspike-proxy-module-api-1.7.2-SNAPSHOT-sources.jar>
to org.apache.deltaspike.modules/deltaspike-proxy-module-api/1.7.2-SNAPSHOT/deltaspike-proxy-module-api-1.7.2-SNAPSHOT-sources.jar
[JENKINS] Archiving <https://builds.apache.org/job/DeltaSpike_Wildfly_10.1/ws/deltaspike/modules/servlet/api/pom.xml>
to org.apache.deltaspike.modules/deltaspike-servlet-module-api/1.7.2-SNAPSHOT/deltaspike-servlet-module-api-1.7.2-SNAPSHOT.pom
[JENKINS] Archiving <https://builds.apache.org/job/DeltaSpike_Wildfly_10.1/ws/deltaspike/modules/servlet/api/target/deltaspike-servlet-module-api-1.7.2-SNAPSHOT.jar>
to org.apache.deltaspike.modules/deltaspike-servlet-module-api/1.7.2-SNAPSHOT/deltaspike-servlet-module-api-1.7.2-SNAPSHOT.jar
[JENKINS] Archiving <https://builds.apache.org/job/DeltaSpike_Wildfly_10.1/ws/deltaspike/modules/servlet/api/target/deltaspike-servlet-module-api-1.7.2-SNAPSHOT-tests.jar>
to org.apache.deltaspike.modules/deltaspike-servlet-module-api/1.7.2-SNAPSHOT/deltaspike-servlet-module-api-1.7.2-SNAPSHOT-tests.jar
[JENKINS] Archiving <https://builds.apache.org/job/DeltaSpike_Wildfly_10.1/ws/deltaspike/modules/servlet/api/target/deltaspike-servlet-module-api-1.7.2-SNAPSHOT-sources.jar>
to org.apache.deltaspike.modules/deltaspike-servlet-module-api/1.7.2-SNAPSHOT/deltaspike-servlet-module-api-1.7.2-SNAPSHOT-sources.jar
[JENKINS] Archiving <https://builds.apache.org/job/DeltaSpike_Wildfly_10.1/ws/deltaspike/examples/data-examples/pom.xml>
to org.apache.deltaspike.examples/deltaspike-data-examples/1.7.2-SNAPSHOT/deltaspike-data-examples-1.7.2-SNAPSHOT.pom
[JENKINS] Archiving <https://builds.apache.org/job/DeltaSpike_Wildfly_10.1/ws/deltaspike/core/api/pom.xml>
to org.apache.deltaspike.core/deltaspike-core-api/1.7.2-SNAPSHOT/deltaspike-core-api-1.7.2-SNAPSHOT.pom
[JENKINS] Archiving <https://builds.apache.org/job/DeltaSpike_Wildfly_10.1/ws/deltaspike/core/api/target/deltaspike-core-api-1.7.2-SNAPSHOT.jar>
to org.apache.deltaspike.core/deltaspike-core-api/1.7.2-SNAPSHOT/deltaspike-core-api-1.7.2-SNAPSHOT.jar
[JENKINS] Archiving <https://builds.apache.org/job/DeltaSpike_Wildfly_10.1/ws/deltaspike/core/api/target/deltaspike-core-api-1.7.2-SNAPSHOT-tests.jar>
to org.apache.deltaspike.core/deltaspike-core-api/1.7.2-SNAPSHOT/deltaspike-core-api-1.7.2-SNAPSHOT-tests.jar
[JENKINS] Archiving <https://builds.apache.org/job/DeltaSpike_Wildfly_10.1/ws/deltaspike/core/api/target/deltaspike-core-api-1.7.2-SNAPSHOT-sources.jar>
to org.apache.deltaspike.core/deltaspike-core-api/1.7.2-SNAPSHOT/deltaspike-core-api-1.7.2-SNAPSHOT-sources.jar
[JENKINS] Archiving <https://builds.apache.org/job/DeltaSpike_Wildfly_10.1/ws/deltaspike/examples/security-requested-page-after-login-picketlink/pom.xml>
to org.apache.deltaspike.examples/deltaspike-security-requested-page-after-login-picketlink/1.7.2-SNAPSHOT/deltaspike-security-requested-page-after-login-picketlink-1.7.2-SNAPSHOT.pom
[JENKINS] Archiving <https://builds.apache.org/job/DeltaSpike_Wildfly_10.1/ws/deltaspike/modules/bean-validation/api/pom.xml>
to org.apache.deltaspike.modules/deltaspike-bean-validation-module-api/1.7.2-SNAPSHOT/deltaspike-bean-validation-module-api-1.7.2-SNAPSHOT.pom
[JENKINS] Archiving <https://builds.apache.org/job/DeltaSpike_Wildfly_10.1/ws/deltaspike/modules/bean-validation/api/target/deltaspike-bean-validation-module-api-1.7.2-SNAPSHOT.jar>
to org.apache.deltaspike.modules/deltaspike-bean-validation-module-api/1.7.2-SNAPSHOT/deltaspike-bean-validation-module-api-1.7.2-SNAPSHOT.jar
[JENKINS] Archiving <https://builds.apache.org/job/DeltaSpike_Wildfly_10.1/ws/deltaspike/modules/bean-validation/api/target/deltaspike-bean-validation-module-api-1.7.2-SNAPSHOT-tests.jar>
to org.apache.deltaspike.modules/deltaspike-bean-validation-module-api/1.7.2-SNAPSHOT/deltaspike-bean-validation-module-api-1.7.2-SNAPSHOT-tests.jar
[JENKINS] Archiving <https://builds.apache.org/job/DeltaSpike_Wildfly_10.1/ws/deltaspike/modules/bean-validation/api/target/deltaspike-bean-validation-module-api-1.7.2-SNAPSHOT-sources.jar>
to org.apache.deltaspike.modules/deltaspike-bean-validation-module-api/1.7.2-SNAPSHOT/deltaspike-bean-validation-module-api-1.7.2-SNAPSHOT-sources.jar
[JENKINS] Archiving <https://builds.apache.org/job/DeltaSpike_Wildfly_10.1/ws/deltaspike/examples/scheduler-playground/pom.xml>
to org.apache.deltaspike.examples/deltaspike-scheduler-example/1.7.2-SNAPSHOT/deltaspike-scheduler-example-1.7.2-SNAPSHOT.pom
[JENKINS] Archiving <https://builds.apache.org/job/DeltaSpike_Wildfly_10.1/ws/deltaspike/modules/pom.xml>
to org.apache.deltaspike.modules/modules-project/1.7.2-SNAPSHOT/modules-project-1.7.2-SNAPSHOT.pom
[JENKINS] Archiving <https://builds.apache.org/job/DeltaSpike_Wildfly_10.1/ws/deltaspike/modules/target/modules-project-1.7.2-SNAPSHOT-tests.jar>
to org.apache.deltaspike.modules/modules-project/1.7.2-SNAPSHOT/modules-project-1.7.2-SNAPSHOT-tests.jar
[JENKINS] Archiving <https://builds.apache.org/job/DeltaSpike_Wildfly_10.1/ws/deltaspike/modules/scheduler/pom.xml>
to org.apache.deltaspike.modules/scheduler-module-project/1.7.2-SNAPSHOT/scheduler-module-project-1.7.2-SNAPSHOT.pom
[JENKINS] Archiving <https://builds.apache.org/job/DeltaSpike_Wildfly_10.1/ws/deltaspike/test-utils/pom.xml>
to org.apache.deltaspike.test/test-utils/1.7.2-SNAPSHOT/test-utils-1.7.2-SNAPSHOT.pom
[JENKINS] Archiving <https://builds.apache.org/job/DeltaSpike_Wildfly_10.1/ws/deltaspike/test-utils/target/test-utils-1.7.2-SNAPSHOT.jar>
to org.apache.deltaspike.test/test-utils/1.7.2-SNAPSHOT/test-utils-1.7.2-SNAPSHOT.jar
[JENKINS] Archiving <https://builds.apache.org/job/DeltaSpike_Wildfly_10.1/ws/deltaspike/test-utils/target/test-utils-1.7.2-SNAPSHOT-sources.jar>
to org.apache.deltaspike.test/test-utils/1.7.2-SNAPSHOT/test-utils-1.7.2-SNAPSHOT-sources.jar
[JENKINS] Archiving <https://builds.apache.org/job/DeltaSpike_Wildfly_10.1/ws/deltaspike/modules/security/pom.xml>
to org.apache.deltaspike.modules/security-module-project/1.7.2-SNAPSHOT/security-module-project-1.7.2-SNAPSHOT.pom
[JENKINS] Archiving <https://builds.apache.org/job/DeltaSpike_Wildfly_10.1/ws/deltaspike/modules/security/target/security-module-project-1.7.2-SNAPSHOT-tests.jar>
to org.apache.deltaspike.modules/security-module-project/1.7.2-SNAPSHOT/security-module-project-1.7.2-SNAPSHOT-tests.jar
[JENKINS] Archiving <https://builds.apache.org/job/DeltaSpike_Wildfly_10.1/ws/deltaspike/modules/jsf/api/pom.xml>
to org.apache.deltaspike.modules/deltaspike-jsf-module-api/1.7.2-SNAPSHOT/deltaspike-jsf-module-api-1.7.2-SNAPSHOT.pom
[JENKINS] Archiving <https://builds.apache.org/job/DeltaSpike_Wildfly_10.1/ws/deltaspike/modules/jsf/api/target/deltaspike-jsf-module-api-1.7.2-SNAPSHOT.jar>
to org.apache.deltaspike.modules/deltaspike-jsf-module-api/1.7.2-SNAPSHOT/deltaspike-jsf-module-api-1.7.2-SNAPSHOT.jar
[JENKINS] Archiving <https://builds.apache.org/job/DeltaSpike_Wildfly_10.1/ws/deltaspike/modules/jsf/api/target/deltaspike-jsf-module-api-1.7.2-SNAPSHOT-tests.jar>
to org.apache.deltaspike.modules/deltaspike-jsf-module-api/1.7.2-SNAPSHOT/deltaspike-jsf-module-api-1.7.2-SNAPSHOT-tests.jar
[JENKINS] Archiving <https://builds.apache.org/job/DeltaSpike_Wildfly_10.1/ws/deltaspike/modules/jsf/api/target/deltaspike-jsf-module-api-1.7.2-SNAPSHOT-sources.jar>
to org.apache.deltaspike.modules/deltaspike-jsf-module-api/1.7.2-SNAPSHOT/deltaspike-jsf-module-api-1.7.2-SNAPSHOT-sources.jar
[JENKINS] Archiving <https://builds.apache.org/job/DeltaSpike_Wildfly_10.1/ws/deltaspike/modules/data/pom.xml>
to org.apache.deltaspike.modules/data-module-project/1.7.2-SNAPSHOT/data-module-project-1.7.2-SNAPSHOT.pom
[JENKINS] Archiving <https://builds.apache.org/job/DeltaSpike_Wildfly_10.1/ws/deltaspike/modules/data/target/data-module-project-1.7.2-SNAPSHOT-tests.jar>
to org.apache.deltaspike.modules/data-module-project/1.7.2-SNAPSHOT/data-module-project-1.7.2-SNAPSHOT-tests.jar
[JENKINS] Archiving <https://builds.apache.org/job/DeltaSpike_Wildfly_10.1/ws/deltaspike/modules/servlet/impl/pom.xml>
to org.apache.deltaspike.modules/deltaspike-servlet-module-impl/1.7.2-SNAPSHOT/deltaspike-servlet-module-impl-1.7.2-SNAPSHOT.pom
[JENKINS] Archiving <https://builds.apache.org/job/DeltaSpike_Wildfly_10.1/ws/deltaspike/modules/servlet/impl/target/deltaspike-servlet-module-impl-1.7.2-SNAPSHOT.jar>
to org.apache.deltaspike.modules/deltaspike-servlet-module-impl/1.7.2-SNAPSHOT/deltaspike-servlet-module-impl-1.7.2-SNAPSHOT.jar
[JENKINS] Archiving <https://builds.apache.org/job/DeltaSpike_Wildfly_10.1/ws/deltaspike/modules/servlet/impl/target/deltaspike-servlet-module-impl-1.7.2-SNAPSHOT-tests.jar>
to org.apache.deltaspike.modules/deltaspike-servlet-module-impl/1.7.2-SNAPSHOT/deltaspike-servlet-module-impl-1.7.2-SNAPSHOT-tests.jar
[JENKINS] Archiving <https://builds.apache.org/job/DeltaSpike_Wildfly_10.1/ws/deltaspike/modules/servlet/impl/target/deltaspike-servlet-module-impl-1.7.2-SNAPSHOT-sources.jar>
to org.apache.deltaspike.modules/deltaspike-servlet-module-impl/1.7.2-SNAPSHOT/deltaspike-servlet-module-impl-1.7.2-SNAPSHOT-sources.jar
[JENKINS] Archiving <https://builds.apache.org/job/DeltaSpike_Wildfly_10.1/ws/deltaspike/modules/test-control/api/pom.xml>
to org.apache.deltaspike.modules/deltaspike-test-control-module-api/1.7.2-SNAPSHOT/deltaspike-test-control-module-api-1.7.2-SNAPSHOT.pom
[JENKINS] Archiving <https://builds.apache.org/job/DeltaSpike_Wildfly_10.1/ws/deltaspike/examples/jsf-examples/pom.xml>
to org.apache.deltaspike.examples/deltaspike-jsf-example/1.7.2-SNAPSHOT/deltaspike-jsf-example-1.7.2-SNAPSHOT.pom
[JENKINS] Archiving <https://builds.apache.org/job/DeltaSpike_Wildfly_10.1/ws/deltaspike/modules/jsf/impl-ee6/pom.xml>
to org.apache.deltaspike.modules/deltaspike-jsf-module-impl-ee6/1.7.2-SNAPSHOT/deltaspike-jsf-module-impl-ee6-1.7.2-SNAPSHOT.pom
[JENKINS] Archiving <https://builds.apache.org/job/DeltaSpike_Wildfly_10.1/ws/deltaspike/modules/jsf/impl-ee6/target/deltaspike-jsf-module-impl-ee6-1.7.2-SNAPSHOT.jar>
to org.apache.deltaspike.modules/deltaspike-jsf-module-impl-ee6/1.7.2-SNAPSHOT/deltaspike-jsf-module-impl-ee6-1.7.2-SNAPSHOT.jar
[JENKINS] Archiving <https://builds.apache.org/job/DeltaSpike_Wildfly_10.1/ws/deltaspike/modules/jsf/impl-ee6/target/deltaspike-jsf-module-impl-ee6-1.7.2-SNAPSHOT-tests.jar>
to org.apache.deltaspike.modules/deltaspike-jsf-module-impl-ee6/1.7.2-SNAPSHOT/deltaspike-jsf-module-impl-ee6-1.7.2-SNAPSHOT-tests.jar
[JENKINS] Archiving <https://builds.apache.org/job/DeltaSpike_Wildfly_10.1/ws/deltaspike/modules/jsf/impl-ee6/target/deltaspike-jsf-module-impl-ee6-1.7.2-SNAPSHOT-sources.jar>
to org.apache.deltaspike.modules/deltaspike-jsf-module-impl-ee6/1.7.2-SNAPSHOT/deltaspike-jsf-module-impl-ee6-1.7.2-SNAPSHOT-sources.jar
[JENKINS] Archiving <https://builds.apache.org/job/DeltaSpike_Wildfly_10.1/ws/deltaspike/examples/security-requested-page-after-login-cdi/pom.xml>
to org.apache.deltaspike.examples/deltaspike-security-requested-page-after-login-cdi/1.7.2-SNAPSHOT/deltaspike-security-requested-page-after-login-cdi-1.7.2-SNAPSHOT.pom
[JENKINS] Archiving <https://builds.apache.org/job/DeltaSpike_Wildfly_10.1/ws/deltaspike/core/pom.xml>
to org.apache.deltaspike.core/core-project/1.7.2-SNAPSHOT/core-project-1.7.2-SNAPSHOT.pom
[JENKINS] Archiving <https://builds.apache.org/job/DeltaSpike_Wildfly_10.1/ws/deltaspike/core/target/core-project-1.7.2-SNAPSHOT-tests.jar>
to org.apache.deltaspike.core/core-project/1.7.2-SNAPSHOT/core-project-1.7.2-SNAPSHOT-tests.jar
[JENKINS] Archiving <https://builds.apache.org/job/DeltaSpike_Wildfly_10.1/ws/site/pom.xml>
to org.apache.deltaspike/deltaspike-site/1.7.2-SNAPSHOT/deltaspike-site-1.7.2-SNAPSHOT.pom
channel stopped

Mime
View raw message