deltaspike-commits mailing list archives

Site index · List index
Message view « Date » · « Thread »
Top « Date » · « Thread »
From Apache Jenkins Server <jenk...@builds.apache.org>
Subject Build failed in Jenkins: DeltaSpike Weld 2.0.0 #677
Date Fri, 23 Sep 2016 03:51:55 GMT
See <https://builds.apache.org/job/DeltaSpike%20Weld%202.0.0/677/changes>

Changes:

[manovotn] DELTASPIKE-1024 correction for Wildfly managed profiles.

------------------------------------------
Started by upstream project "DeltaSpike for CDI 1.1 and 1.2" build number 37
originally caused by:
 Started by an SCM change
[EnvInject] - Loading node environment variables.
Building remotely on jenkins-test-864 (Ubuntu ubuntu jenkins-cloud-8GB jenkins-cloud-4GB cloud-slave)
in workspace <https://builds.apache.org/job/DeltaSpike%20Weld%202.0.0/ws/>
Cloning the remote Git repository
Cloning repository https://git-wip-us.apache.org/repos/asf/deltaspike.git
 > git init <https://builds.apache.org/job/DeltaSpike%20Weld%202.0.0/ws/> # timeout=10
Fetching upstream changes from https://git-wip-us.apache.org/repos/asf/deltaspike.git
 > git --version # timeout=10
 > git -c core.askpass=true fetch --tags --progress https://git-wip-us.apache.org/repos/asf/deltaspike.git
+refs/heads/*:refs/remotes/origin/*
 > git config remote.origin.url https://git-wip-us.apache.org/repos/asf/deltaspike.git
# timeout=10
 > git config --add remote.origin.fetch +refs/heads/*:refs/remotes/origin/* # timeout=10
 > git config remote.origin.url https://git-wip-us.apache.org/repos/asf/deltaspike.git
# timeout=10
Fetching upstream changes from https://git-wip-us.apache.org/repos/asf/deltaspike.git
 > git -c core.askpass=true fetch --tags --progress https://git-wip-us.apache.org/repos/asf/deltaspike.git
+refs/heads/*:refs/remotes/origin/*
 > git rev-parse origin/master^{commit} # timeout=10
Checking out Revision 3fed4bfb910abf3e58b8e12fd6cead76aaddad9a (origin/master)
 > git config core.sparsecheckout # timeout=10
 > git checkout -f 3fed4bfb910abf3e58b8e12fd6cead76aaddad9a
 > git rev-list 573c1c88d217468d2589c17d665ae933cdd8eb1d # timeout=10
Parsing POMs
Failed to transfer Could not find artifact org.jboss.weld:weld-core-bom:pom:2.3.4.Final in
Apache Repository (https://repository.apache.org/content/repositories/releases)
Failed to transfer Could not find artifact org.jboss.weld:weld-core-bom:pom:2.3.4.Final in
Apache Snapshot Repository (https://repository.apache.org/content/repositories/snapshots)
Downloaded artifact http://repo.maven.apache.org/maven2/org/jboss/weld/weld-core-bom/2.3.4.Final/weld-core-bom-2.3.4.Final.pom
Failed to transfer Could not find artifact org.jboss.weld:weld-api-bom:pom:2.3.SP2 in Apache
Repository (https://repository.apache.org/content/repositories/releases)
Failed to transfer Could not find artifact org.jboss.weld:weld-api-bom:pom:2.3.SP2 in Apache
Snapshot Repository (https://repository.apache.org/content/repositories/snapshots)
Downloaded artifact http://repo.maven.apache.org/maven2/org/jboss/weld/weld-api-bom/2.3.SP2/weld-api-bom-2.3.SP2.pom
Modules changed, recalculating dependency graph
Established TCP socket on 36710
Copied maven3-agent.jar
Copied maven3-interceptor.jar
maven3-interceptor-commons.jar already up to date
[DeltaSpike Weld 2.0.0] $ /home/jenkins/tools/java/latest1.7/bin/java -Xmx2g -Xms256m -XX:MaxPermSize=512m
-cp /home/jenkins/jenkins-slave/maven3-agent.jar:/home/jenkins/tools/maven/apache-maven-3.0.4/boot/plexus-classworlds-2.4.jar
org.jvnet.hudson.maven3.agent.Maven3Main /home/jenkins/tools/maven/apache-maven-3.0.4 /home/jenkins/jenkins-slave/slave.jar
/home/jenkins/jenkins-slave/maven3-interceptor.jar /home/jenkins/jenkins-slave/maven3-interceptor-commons.jar
36710
<===[JENKINS REMOTING CAPACITY]===>   channel started
Executing Maven:  -B -f <https://builds.apache.org/job/DeltaSpike%20Weld%202.0.0/ws/pom.xml>
-Dmaven.repo.local=/home/jenkins/jenkins-slave/maven-repositories/0 clean install -PWeld2
-Dweld.version=2.0.0.Final
[INFO] Scanning for projects...
Downloading: https://repository.apache.org/content/repositories/releases/org/jboss/weld/weld-core-bom/2.0.0.Final/weld-core-bom-2.0.0.Final.pom
Downloading: https://repository.apache.org/content/repositories/snapshots/org/jboss/weld/weld-core-bom/2.0.0.Final/weld-core-bom-2.0.0.Final.pom
Downloading: http://repo.maven.apache.org/maven2/org/jboss/weld/weld-core-bom/2.0.0.Final/weld-core-bom-2.0.0.Final.pom
Downloaded: http://repo.maven.apache.org/maven2/org/jboss/weld/weld-core-bom/2.0.0.Final/weld-core-bom-2.0.0.Final.pom
(7 KB at 305.5 KB/sec)
Downloading: https://repository.apache.org/content/repositories/releases/org/jboss/weld/weld-core-parent/2.0.0.Final/weld-core-parent-2.0.0.Final.pom
Downloading: https://repository.apache.org/content/repositories/snapshots/org/jboss/weld/weld-core-parent/2.0.0.Final/weld-core-parent-2.0.0.Final.pom
Downloading: http://repository.jboss.org/nexus/content/groups/public/org/jboss/weld/weld-core-parent/2.0.0.Final/weld-core-parent-2.0.0.Final.pom
Downloaded: http://repository.jboss.org/nexus/content/groups/public/org/jboss/weld/weld-core-parent/2.0.0.Final/weld-core-parent-2.0.0.Final.pom
(29 KB at 58.0 KB/sec)
Downloading: https://repository.apache.org/content/repositories/releases/org/jboss/weld/weld-parent/23/weld-parent-23.pom
Downloading: https://repository.apache.org/content/repositories/snapshots/org/jboss/weld/weld-parent/23/weld-parent-23.pom
Downloading: http://repository.jboss.org/nexus/content/groups/public/org/jboss/weld/weld-parent/23/weld-parent-23.pom
Downloaded: http://repository.jboss.org/nexus/content/groups/public/org/jboss/weld/weld-parent/23/weld-parent-23.pom
(33 KB at 162.1 KB/sec)
Downloading: https://repository.apache.org/content/repositories/releases/org/jboss/weld/weld-api-bom/2.0.Final/weld-api-bom-2.0.Final.pom
Downloading: https://repository.apache.org/content/repositories/snapshots/org/jboss/weld/weld-api-bom/2.0.Final/weld-api-bom-2.0.Final.pom
Downloading: http://repository.jboss.org/nexus/content/groups/public/org/jboss/weld/weld-api-bom/2.0.Final/weld-api-bom-2.0.Final.pom
Downloaded: http://repository.jboss.org/nexus/content/groups/public/org/jboss/weld/weld-api-bom/2.0.Final/weld-api-bom-2.0.Final.pom
(6 KB at 36.2 KB/sec)
Downloading: https://repository.apache.org/content/repositories/releases/org/jboss/weld/weld-parent/22/weld-parent-22.pom
Downloading: https://repository.apache.org/content/repositories/snapshots/org/jboss/weld/weld-parent/22/weld-parent-22.pom
Downloading: http://repository.jboss.org/nexus/content/groups/public/org/jboss/weld/weld-parent/22/weld-parent-22.pom
Downloaded: http://repository.jboss.org/nexus/content/groups/public/org/jboss/weld/weld-parent/22/weld-parent-22.pom
(33 KB at 228.5 KB/sec)
[ERROR] The build could not read 4 projects -> [Help 1]
[ERROR]   
[ERROR]   The project org.apache.deltaspike:parent-code:1.7.2-SNAPSHOT (<https://builds.apache.org/job/DeltaSpike%20Weld%202.0.0/ws/deltaspike/parent/code/pom.xml)>
has 1 error
[ERROR]     'dependencies.dependency.version' for org.jboss.weld:weld-core-impl:jar is missing.
@ line 437, column 29
[ERROR]   
[ERROR]   The project org.apache.deltaspike.core:core-project:1.7.2-SNAPSHOT (<https://builds.apache.org/job/DeltaSpike%20Weld%202.0.0/ws/deltaspike/core/pom.xml)>
has 1 error
[ERROR]     'dependencies.dependency.version' for org.jboss.weld:weld-core-impl:jar is missing.
@ org.apache.deltaspike:parent-code:1.7.2-SNAPSHOT, <https://builds.apache.org/job/DeltaSpike%20Weld%202.0.0/ws/deltaspike/parent/code/pom.xml,>
line 437, column 29
[ERROR]   
[ERROR]   The project org.apache.deltaspike.cdictrl:cdictrl-project:1.7.2-SNAPSHOT (<https://builds.apache.org/job/DeltaSpike%20Weld%202.0.0/ws/deltaspike/cdictrl/pom.xml)>
has 1 error
[ERROR]     'dependencies.dependency.version' for org.jboss.weld:weld-core-impl:jar is missing.
@ org.apache.deltaspike:parent-code:1.7.2-SNAPSHOT, <https://builds.apache.org/job/DeltaSpike%20Weld%202.0.0/ws/deltaspike/parent/code/pom.xml,>
line 437, column 29
[ERROR]   
[ERROR]   The project org.apache.deltaspike.modules:modules-project:1.7.2-SNAPSHOT (<https://builds.apache.org/job/DeltaSpike%20Weld%202.0.0/ws/deltaspike/modules/pom.xml)>
has 1 error
[ERROR]     'dependencies.dependency.version' for org.jboss.weld:weld-core-impl:jar is missing.
@ org.apache.deltaspike:parent-code:1.7.2-SNAPSHOT, <https://builds.apache.org/job/DeltaSpike%20Weld%202.0.0/ws/deltaspike/parent/code/pom.xml,>
line 437, column 29
[ERROR] 
[ERROR] To see the full stack trace of the errors, re-run Maven with the -e switch.
[ERROR] Re-run Maven using the -X switch to enable full debug logging.
[ERROR] 
[ERROR] For more information about the errors and possible solutions, please read the following
articles:
[ERROR] [Help 1] http://cwiki.apache.org/confluence/display/MAVEN/ProjectBuildingException
channel stopped

Mime
View raw message