deltaspike-commits mailing list archives

Site index · List index
Message view « Date » · « Thread »
Top « Date » · « Thread »
From Apache Jenkins Server <jenk...@builds.apache.org>
Subject Build failed in Jenkins: DeltaSpike_Wildfly_10 #121
Date Fri, 05 Aug 2016 10:39:33 GMT
See <https://builds.apache.org/job/DeltaSpike_Wildfly_10/121/>

------------------------------------------
[...truncated 3519 lines...]
[INFO] --- maven-resources-plugin:2.7:testResources (default-testResources) @ deltaspike-data-module-test-java8
---
[INFO] Using 'UTF-8' encoding to copy filtered resources.
[INFO] skip non existing resourceDirectory <https://builds.apache.org/job/DeltaSpike_Wildfly_10/ws/deltaspike/modules/data/test-java8/src/test/resources>
[INFO] Copying 1 resource
[INFO] Copying 3 resources
[INFO] 
[INFO] --- maven-compiler-plugin:2.3.2:testCompile (default-testCompile) @ deltaspike-data-module-test-java8
---
[INFO] Compiling 7 source files to <https://builds.apache.org/job/DeltaSpike_Wildfly_10/ws/deltaspike/modules/data/test-java8/target/test-classes>
[INFO] 
[INFO] --- maven-dependency-plugin:2.4:unpack (unpack-wf) @ deltaspike-data-module-test-java8
---
[INFO] Configured Artifact: org.wildfly:wildfly-dist:10.0.0.Final:zip
[INFO] Unpacking /home/jenkins/jenkins-slave/maven-repositories/1/org/wildfly/wildfly-dist/10.0.0.Final/wildfly-dist-10.0.0.Final.zip
to /tmp/deltaspike-arquillian-containers with includes "" and excludes ""
[INFO] 
[INFO] --- maven-surefire-plugin:2.11:test (default-test) @ deltaspike-data-module-test-java8
---
[INFO] Surefire report directory: <https://builds.apache.org/job/DeltaSpike_Wildfly_10/ws/deltaspike/modules/data/test-java8/target/surefire-reports>
[INFO] Using configured provider org.apache.maven.surefire.junitcore.JUnitCoreProvider

-------------------------------------------------------
 T E S T S
-------------------------------------------------------
Java HotSpot(TM) 64-Bit Server VM warning: ignoring option MaxPermSize=256m; support was removed
in 8.0
Concurrency config is parallel='none', perCoreThreadCount=true, threadCount=2, useUnlimitedThreads=false
Running org.apache.deltaspike.data.test.java8.test.Java8Test
Tests run: 1, Failures: 0, Errors: 1, Skipped: 0, Time elapsed: 0 sec <<< FAILURE!

Results :

Tests in error: 
  org.apache.deltaspike.data.test.java8.test.Java8Test: The server is already running! Managed
containers do not support connecting to running server instances due to the possible harmful
effect of connecting to the wrong server. Please stop server before running or change to another
type of container.(..)

Tests run: 1, Failures: 0, Errors: 1, Skipped: 0

[INFO] ------------------------------------------------------------------------
[INFO] Reactor Summary:
[INFO] 
[INFO] Apache DeltaSpike .................................. SUCCESS [  4.301 s]
[INFO] Apache DeltaSpike Sources .......................... SUCCESS [  0.557 s]
[INFO] Apache DeltaSpike CheckStyle-rules ................. SUCCESS [  1.942 s]
[INFO] Apache DeltaSpike Parent ........................... SUCCESS [  5.376 s]
[INFO] Apache DeltaSpike Test-Utils ....................... SUCCESS [  7.507 s]
[INFO] Apache DeltaSpike Code Parent ...................... SUCCESS [ 19.484 s]
[INFO] Apache DeltaSpike Core ............................. SUCCESS [  6.707 s]
[INFO] Apache DeltaSpike Core-API ......................... SUCCESS [ 20.728 s]
[INFO] Apache DeltaSpike Core-Implementation .............. SUCCESS [ 16.194 s]
[INFO] Apache DeltaSpike ContainerControl parent .......... SUCCESS [  5.190 s]
[INFO] Apache DeltaSpike CDI ContainerControl API ......... SUCCESS [  9.518 s]
[INFO] Apache DeltaSpike CDI Weld-ContainerControl ........ SUCCESS [  9.854 s]
[INFO] Apache DeltaSpike Modules .......................... SUCCESS [  5.958 s]
[INFO] Apache DeltaSpike Proxy-Module ..................... SUCCESS [  5.371 s]
[INFO] Apache DeltaSpike Proxy-Module API ................. SUCCESS [  9.562 s]
[INFO] Apache DeltaSpike Proxy-Module Impl ASM5 ........... SUCCESS [  8.726 s]
[INFO] Apache DeltaSpike Security-Module .................. SUCCESS [  5.265 s]
[INFO] Apache DeltaSpike Security-Module API .............. SUCCESS [  5.970 s]
[INFO] Apache DeltaSpike Security-Module Impl ............. SUCCESS [  8.974 s]
[INFO] Apache DeltaSpike JPA-Module ....................... SUCCESS [  5.933 s]
[INFO] Apache DeltaSpike JPA-Module API ................... SUCCESS [  7.078 s]
[INFO] Apache DeltaSpike JPA-Module Impl .................. SUCCESS [  8.567 s]
[INFO] Apache DeltaSpike Servlet-Module ................... SUCCESS [  4.604 s]
[INFO] Apache DeltaSpike Servlet-Module API ............... SUCCESS [  6.567 s]
[INFO] Apache DeltaSpike Servlet-Module Impl .............. SUCCESS [ 10.102 s]
[INFO] Apache DeltaSpike JSF-Module ....................... SUCCESS [  5.257 s]
[INFO] Apache DeltaSpike JSF-Module API ................... SUCCESS [  7.476 s]
[INFO] Apache DeltaSpike JSF-Module Impl .................. SUCCESS [ 17.313 s]
[INFO] Apache DeltaSpike JSF-Module Impl (EE6 only) ....... SUCCESS [ 10.121 s]
[INFO] Apache DeltaSpike Partial-Bean-Module .............. SUCCESS [  6.416 s]
[INFO] Apache DeltaSpike Partial-Bean-Module API .......... SUCCESS [  6.041 s]
[INFO] Apache DeltaSpike Partial-Bean-Module Impl ......... SUCCESS [ 10.326 s]
[INFO] Apache DeltaSpike BeanValidation-Module ............ SUCCESS [  5.834 s]
[INFO] Apache DeltaSpike BeanValidation-Module API ........ SUCCESS [ 15.751 s]
[INFO] Apache DeltaSpike BeanValidation-Module Impl ....... SUCCESS [ 10.217 s]
[INFO] Apache DeltaSpike Data-Module ...................... SUCCESS [  6.836 s]
[INFO] Apache DeltaSpike Data-Module API .................. SUCCESS [ 12.626 s]
[INFO] Apache DeltaSpike Data-Module Impl ................. SUCCESS [ 18.305 s]
[INFO] Apache DeltaSpike Data-Module Tests on Java EE 7 ... SUCCESS [  9.348 s]
[INFO] Apache DeltaSpike Data-Module Tests with Java 8 .... FAILURE [  6.411 s]
[INFO] Apache DeltaSpike Scheduler-Module ................. SKIPPED
[INFO] Apache DeltaSpike Scheduler-Module API ............. SKIPPED
[INFO] Apache DeltaSpike Scheduler-Module Impl ............ SKIPPED
[INFO] Apache DeltaSpike Test-Control-Module .............. SKIPPED
[INFO] Apache DeltaSpike Test-Control-Module API .......... SKIPPED
[INFO] Apache DeltaSpike Test-Control-Module Impl ......... SKIPPED
[INFO] Apache DeltaSpike Examples ......................... SKIPPED
[INFO] Apache DeltaSpike Java-SE Examples ................. SKIPPED
[INFO] Apache DeltaSpike JSF Examples ..................... SKIPPED
[INFO] Apache DeltaSpike JSF Playground ................... SKIPPED
[INFO] Apache DeltaSpike Security Example CDI ............. SKIPPED
[INFO] Apache DeltaSpike Security Example PicketLink ...... SKIPPED
[INFO] Apache DeltaSpike Java-SE Scheduler Examples ....... SKIPPED
[INFO] Apache DeltaSpike Documentation .................... SKIPPED
[INFO] Apache DeltaSpike Site ............................. SKIPPED
[INFO] ------------------------------------------------------------------------
[INFO] BUILD FAILURE
[INFO] ------------------------------------------------------------------------
[INFO] Total time: 07:01 min
[INFO] Finished at: 2016-08-05T10:36:39+00:00
[INFO] Final Memory: 139M/1097M
[INFO] ------------------------------------------------------------------------
Waiting for Jenkins to finish collecting data
[ERROR] Failed to execute goal org.apache.maven.plugins:maven-surefire-plugin:2.11:test (default-test)
on project deltaspike-data-module-test-java8: There are test failures.
[ERROR] 
[ERROR] Please refer to <https://builds.apache.org/job/DeltaSpike_Wildfly_10/ws/deltaspike/modules/data/test-java8/target/surefire-reports>
for the individual test results.
[ERROR] -> [Help 1]
[ERROR] 
[ERROR] To see the full stack trace of the errors, re-run Maven with the -e switch.
[ERROR] Re-run Maven using the -X switch to enable full debug logging.
[ERROR] 
[ERROR] For more information about the errors and possible solutions, please read the following
articles:
[ERROR] [Help 1] http://cwiki.apache.org/confluence/display/MAVEN/MojoFailureException
[ERROR] 
[ERROR] After correcting the problems, you can resume the build with the command
[ERROR]   mvn <goals> -rf :deltaspike-data-module-test-java8
[JENKINS] Archiving <https://builds.apache.org/job/DeltaSpike_Wildfly_10/ws/deltaspike/examples/jse-examples/pom.xml>
to org.apache.deltaspike.examples/deltaspike-jse-example/1.7.2-SNAPSHOT/deltaspike-jse-example-1.7.2-SNAPSHOT.pom
[JENKINS] Archiving <https://builds.apache.org/job/DeltaSpike_Wildfly_10/ws/deltaspike/examples/security-requested-page-after-login-cdi/pom.xml>
to org.apache.deltaspike.examples/deltaspike-security-requested-page-after-login-cdi/1.7.2-SNAPSHOT/deltaspike-security-requested-page-after-login-cdi-1.7.2-SNAPSHOT.pom
[JENKINS] Archiving <https://builds.apache.org/job/DeltaSpike_Wildfly_10/ws/deltaspike/test-utils/pom.xml>
to org.apache.deltaspike.test/test-utils/1.7.2-SNAPSHOT/test-utils-1.7.2-SNAPSHOT.pom
[JENKINS] Archiving <https://builds.apache.org/job/DeltaSpike_Wildfly_10/ws/deltaspike/test-utils/target/test-utils-1.7.2-SNAPSHOT.jar>
to org.apache.deltaspike.test/test-utils/1.7.2-SNAPSHOT/test-utils-1.7.2-SNAPSHOT.jar
[JENKINS] Archiving <https://builds.apache.org/job/DeltaSpike_Wildfly_10/ws/deltaspike/test-utils/target/test-utils-1.7.2-SNAPSHOT-sources.jar>
to org.apache.deltaspike.test/test-utils/1.7.2-SNAPSHOT/test-utils-1.7.2-SNAPSHOT-sources.jar
[JENKINS] Archiving <https://builds.apache.org/job/DeltaSpike_Wildfly_10/ws/documentation/pom.xml>
to org.apache.deltaspike/deltaspike-documentation/1.7.2-SNAPSHOT/deltaspike-documentation-1.7.2-SNAPSHOT.pom
[JENKINS] Archiving <https://builds.apache.org/job/DeltaSpike_Wildfly_10/ws/deltaspike/modules/data/impl/pom.xml>
to org.apache.deltaspike.modules/deltaspike-data-module-impl/1.7.2-SNAPSHOT/deltaspike-data-module-impl-1.7.2-SNAPSHOT.pom
[JENKINS] Archiving <https://builds.apache.org/job/DeltaSpike_Wildfly_10/ws/deltaspike/modules/data/impl/target/deltaspike-data-module-impl-1.7.2-SNAPSHOT.jar>
to org.apache.deltaspike.modules/deltaspike-data-module-impl/1.7.2-SNAPSHOT/deltaspike-data-module-impl-1.7.2-SNAPSHOT.jar
[JENKINS] Archiving <https://builds.apache.org/job/DeltaSpike_Wildfly_10/ws/deltaspike/modules/data/impl/target/deltaspike-data-module-impl-1.7.2-SNAPSHOT-tests.jar>
to org.apache.deltaspike.modules/deltaspike-data-module-impl/1.7.2-SNAPSHOT/deltaspike-data-module-impl-1.7.2-SNAPSHOT-tests.jar
[JENKINS] Archiving <https://builds.apache.org/job/DeltaSpike_Wildfly_10/ws/deltaspike/modules/data/impl/target/deltaspike-data-module-impl-1.7.2-SNAPSHOT-sources.jar>
to org.apache.deltaspike.modules/deltaspike-data-module-impl/1.7.2-SNAPSHOT/deltaspike-data-module-impl-1.7.2-SNAPSHOT-sources.jar
[JENKINS] Archiving <https://builds.apache.org/job/DeltaSpike_Wildfly_10/ws/deltaspike/modules/data/api/pom.xml>
to org.apache.deltaspike.modules/deltaspike-data-module-api/1.7.2-SNAPSHOT/deltaspike-data-module-api-1.7.2-SNAPSHOT.pom
[JENKINS] Archiving <https://builds.apache.org/job/DeltaSpike_Wildfly_10/ws/deltaspike/modules/data/api/target/deltaspike-data-module-api-1.7.2-SNAPSHOT.jar>
to org.apache.deltaspike.modules/deltaspike-data-module-api/1.7.2-SNAPSHOT/deltaspike-data-module-api-1.7.2-SNAPSHOT.jar
[JENKINS] Archiving <https://builds.apache.org/job/DeltaSpike_Wildfly_10/ws/deltaspike/modules/data/api/target/deltaspike-data-module-api-1.7.2-SNAPSHOT-tests.jar>
to org.apache.deltaspike.modules/deltaspike-data-module-api/1.7.2-SNAPSHOT/deltaspike-data-module-api-1.7.2-SNAPSHOT-tests.jar
[JENKINS] Archiving <https://builds.apache.org/job/DeltaSpike_Wildfly_10/ws/deltaspike/modules/data/api/target/deltaspike-data-module-api-1.7.2-SNAPSHOT-sources.jar>
to org.apache.deltaspike.modules/deltaspike-data-module-api/1.7.2-SNAPSHOT/deltaspike-data-module-api-1.7.2-SNAPSHOT-sources.jar
[JENKINS] Archiving <https://builds.apache.org/job/DeltaSpike_Wildfly_10/ws/deltaspike/core/impl/pom.xml>
to org.apache.deltaspike.core/deltaspike-core-impl/1.7.2-SNAPSHOT/deltaspike-core-impl-1.7.2-SNAPSHOT.pom
[JENKINS] Archiving <https://builds.apache.org/job/DeltaSpike_Wildfly_10/ws/deltaspike/core/impl/target/deltaspike-core-impl-1.7.2-SNAPSHOT.jar>
to org.apache.deltaspike.core/deltaspike-core-impl/1.7.2-SNAPSHOT/deltaspike-core-impl-1.7.2-SNAPSHOT.jar
[JENKINS] Archiving <https://builds.apache.org/job/DeltaSpike_Wildfly_10/ws/deltaspike/core/impl/target/deltaspike-core-impl-1.7.2-SNAPSHOT-tests.jar>
to org.apache.deltaspike.core/deltaspike-core-impl/1.7.2-SNAPSHOT/deltaspike-core-impl-1.7.2-SNAPSHOT-tests.jar
[JENKINS] Archiving <https://builds.apache.org/job/DeltaSpike_Wildfly_10/ws/deltaspike/core/impl/target/deltaspike-core-impl-1.7.2-SNAPSHOT-sources.jar>
to org.apache.deltaspike.core/deltaspike-core-impl/1.7.2-SNAPSHOT/deltaspike-core-impl-1.7.2-SNAPSHOT-sources.jar
[JENKINS] Archiving <https://builds.apache.org/job/DeltaSpike_Wildfly_10/ws/deltaspike/modules/pom.xml>
to org.apache.deltaspike.modules/modules-project/1.7.2-SNAPSHOT/modules-project-1.7.2-SNAPSHOT.pom
[JENKINS] Archiving <https://builds.apache.org/job/DeltaSpike_Wildfly_10/ws/deltaspike/modules/target/modules-project-1.7.2-SNAPSHOT-tests.jar>
to org.apache.deltaspike.modules/modules-project/1.7.2-SNAPSHOT/modules-project-1.7.2-SNAPSHOT-tests.jar
[JENKINS] Archiving <https://builds.apache.org/job/DeltaSpike_Wildfly_10/ws/deltaspike/modules/test-control/pom.xml>
to org.apache.deltaspike.modules/test-control-module-project/1.7.2-SNAPSHOT/test-control-module-project-1.7.2-SNAPSHOT.pom
[JENKINS] Archiving <https://builds.apache.org/job/DeltaSpike_Wildfly_10/ws/deltaspike/examples/jsf-examples/pom.xml>
to org.apache.deltaspike.examples/deltaspike-jsf-example/1.7.2-SNAPSHOT/deltaspike-jsf-example-1.7.2-SNAPSHOT.pom
[JENKINS] Archiving <https://builds.apache.org/job/DeltaSpike_Wildfly_10/ws/deltaspike/cdictrl/api/pom.xml>
to org.apache.deltaspike.cdictrl/deltaspike-cdictrl-api/1.7.2-SNAPSHOT/deltaspike-cdictrl-api-1.7.2-SNAPSHOT.pom
[JENKINS] Archiving <https://builds.apache.org/job/DeltaSpike_Wildfly_10/ws/deltaspike/cdictrl/api/target/deltaspike-cdictrl-api-1.7.2-SNAPSHOT.jar>
to org.apache.deltaspike.cdictrl/deltaspike-cdictrl-api/1.7.2-SNAPSHOT/deltaspike-cdictrl-api-1.7.2-SNAPSHOT.jar
[JENKINS] Archiving <https://builds.apache.org/job/DeltaSpike_Wildfly_10/ws/deltaspike/cdictrl/api/target/deltaspike-cdictrl-api-1.7.2-SNAPSHOT-tests.jar>
to org.apache.deltaspike.cdictrl/deltaspike-cdictrl-api/1.7.2-SNAPSHOT/deltaspike-cdictrl-api-1.7.2-SNAPSHOT-tests.jar
[JENKINS] Archiving <https://builds.apache.org/job/DeltaSpike_Wildfly_10/ws/deltaspike/cdictrl/api/target/deltaspike-cdictrl-api-1.7.2-SNAPSHOT-sources.jar>
to org.apache.deltaspike.cdictrl/deltaspike-cdictrl-api/1.7.2-SNAPSHOT/deltaspike-cdictrl-api-1.7.2-SNAPSHOT-sources.jar
[JENKINS] Archiving <https://builds.apache.org/job/DeltaSpike_Wildfly_10/ws/deltaspike/examples/scheduler-playground/pom.xml>
to org.apache.deltaspike.examples/deltaspike-scheduler-example/1.7.2-SNAPSHOT/deltaspike-scheduler-example-1.7.2-SNAPSHOT.pom
[JENKINS] Archiving <https://builds.apache.org/job/DeltaSpike_Wildfly_10/ws/deltaspike/checkstyle-rules/pom.xml>
to org.apache.deltaspike/checkstyle-rules/1.7.2-SNAPSHOT/checkstyle-rules-1.7.2-SNAPSHOT.pom
[JENKINS] Archiving <https://builds.apache.org/job/DeltaSpike_Wildfly_10/ws/deltaspike/checkstyle-rules/target/checkstyle-rules-1.7.2-SNAPSHOT.jar>
to org.apache.deltaspike/checkstyle-rules/1.7.2-SNAPSHOT/checkstyle-rules-1.7.2-SNAPSHOT.jar
[JENKINS] Archiving <https://builds.apache.org/job/DeltaSpike_Wildfly_10/ws/deltaspike/parent/code/pom.xml>
to org.apache.deltaspike/parent-code/1.7.2-SNAPSHOT/parent-code-1.7.2-SNAPSHOT.pom
[JENKINS] Archiving <https://builds.apache.org/job/DeltaSpike_Wildfly_10/ws/deltaspike/parent/code/target/parent-code-1.7.2-SNAPSHOT-tests.jar>
to org.apache.deltaspike/parent-code/1.7.2-SNAPSHOT/parent-code-1.7.2-SNAPSHOT-tests.jar
Compressed 97.32 KB of artifacts by 65.8% relative to #120
[JENKINS] Archiving <https://builds.apache.org/job/DeltaSpike_Wildfly_10/ws/deltaspike/modules/jsf/impl/pom.xml>
to org.apache.deltaspike.modules/deltaspike-jsf-module-impl/1.7.2-SNAPSHOT/deltaspike-jsf-module-impl-1.7.2-SNAPSHOT.pom
[JENKINS] Archiving <https://builds.apache.org/job/DeltaSpike_Wildfly_10/ws/deltaspike/modules/jsf/impl/target/deltaspike-jsf-module-impl-1.7.2-SNAPSHOT.jar>
to org.apache.deltaspike.modules/deltaspike-jsf-module-impl/1.7.2-SNAPSHOT/deltaspike-jsf-module-impl-1.7.2-SNAPSHOT.jar
[JENKINS] Archiving <https://builds.apache.org/job/DeltaSpike_Wildfly_10/ws/deltaspike/modules/jsf/impl/target/deltaspike-jsf-module-impl-1.7.2-SNAPSHOT-tests.jar>
to org.apache.deltaspike.modules/deltaspike-jsf-module-impl/1.7.2-SNAPSHOT/deltaspike-jsf-module-impl-1.7.2-SNAPSHOT-tests.jar
[JENKINS] Archiving <https://builds.apache.org/job/DeltaSpike_Wildfly_10/ws/deltaspike/modules/jsf/impl/target/deltaspike-jsf-module-impl-1.7.2-SNAPSHOT-sources.jar>
to org.apache.deltaspike.modules/deltaspike-jsf-module-impl/1.7.2-SNAPSHOT/deltaspike-jsf-module-impl-1.7.2-SNAPSHOT-sources.jar
[JENKINS] Archiving <https://builds.apache.org/job/DeltaSpike_Wildfly_10/ws/deltaspike/modules/partial-bean/pom.xml>
to org.apache.deltaspike.modules/partial-bean-module-project/1.7.2-SNAPSHOT/partial-bean-module-project-1.7.2-SNAPSHOT.pom
[JENKINS] Archiving <https://builds.apache.org/job/DeltaSpike_Wildfly_10/ws/deltaspike/modules/partial-bean/target/partial-bean-module-project-1.7.2-SNAPSHOT-tests.jar>
to org.apache.deltaspike.modules/partial-bean-module-project/1.7.2-SNAPSHOT/partial-bean-module-project-1.7.2-SNAPSHOT-tests.jar
[JENKINS] Archiving <https://builds.apache.org/job/DeltaSpike_Wildfly_10/ws/deltaspike/examples/pom.xml>
to org.apache.deltaspike.examples/examples-project/1.7.2-SNAPSHOT/examples-project-1.7.2-SNAPSHOT.pom
[JENKINS] Archiving <https://builds.apache.org/job/DeltaSpike_Wildfly_10/ws/deltaspike/modules/jsf/pom.xml>
to org.apache.deltaspike.modules/jsf-module-project/1.7.2-SNAPSHOT/jsf-module-project-1.7.2-SNAPSHOT.pom
[JENKINS] Archiving <https://builds.apache.org/job/DeltaSpike_Wildfly_10/ws/deltaspike/modules/jsf/target/jsf-module-project-1.7.2-SNAPSHOT-tests.jar>
to org.apache.deltaspike.modules/jsf-module-project/1.7.2-SNAPSHOT/jsf-module-project-1.7.2-SNAPSHOT-tests.jar
[JENKINS] Archiving <https://builds.apache.org/job/DeltaSpike_Wildfly_10/ws/deltaspike/modules/jsf/api/pom.xml>
to org.apache.deltaspike.modules/deltaspike-jsf-module-api/1.7.2-SNAPSHOT/deltaspike-jsf-module-api-1.7.2-SNAPSHOT.pom
[JENKINS] Archiving <https://builds.apache.org/job/DeltaSpike_Wildfly_10/ws/deltaspike/modules/jsf/api/target/deltaspike-jsf-module-api-1.7.2-SNAPSHOT.jar>
to org.apache.deltaspike.modules/deltaspike-jsf-module-api/1.7.2-SNAPSHOT/deltaspike-jsf-module-api-1.7.2-SNAPSHOT.jar
[JENKINS] Archiving <https://builds.apache.org/job/DeltaSpike_Wildfly_10/ws/deltaspike/modules/jsf/api/target/deltaspike-jsf-module-api-1.7.2-SNAPSHOT-tests.jar>
to org.apache.deltaspike.modules/deltaspike-jsf-module-api/1.7.2-SNAPSHOT/deltaspike-jsf-module-api-1.7.2-SNAPSHOT-tests.jar
[JENKINS] Archiving <https://builds.apache.org/job/DeltaSpike_Wildfly_10/ws/deltaspike/modules/jsf/api/target/deltaspike-jsf-module-api-1.7.2-SNAPSHOT-sources.jar>
to org.apache.deltaspike.modules/deltaspike-jsf-module-api/1.7.2-SNAPSHOT/deltaspike-jsf-module-api-1.7.2-SNAPSHOT-sources.jar
[JENKINS] Archiving <https://builds.apache.org/job/DeltaSpike_Wildfly_10/ws/deltaspike/modules/security/pom.xml>
to org.apache.deltaspike.modules/security-module-project/1.7.2-SNAPSHOT/security-module-project-1.7.2-SNAPSHOT.pom
[JENKINS] Archiving <https://builds.apache.org/job/DeltaSpike_Wildfly_10/ws/deltaspike/modules/security/target/security-module-project-1.7.2-SNAPSHOT-tests.jar>
to org.apache.deltaspike.modules/security-module-project/1.7.2-SNAPSHOT/security-module-project-1.7.2-SNAPSHOT-tests.jar
[JENKINS] Archiving <https://builds.apache.org/job/DeltaSpike_Wildfly_10/ws/deltaspike/modules/bean-validation/pom.xml>
to org.apache.deltaspike.modules/bean-validation-module-project/1.7.2-SNAPSHOT/bean-validation-module-project-1.7.2-SNAPSHOT.pom
[JENKINS] Archiving <https://builds.apache.org/job/DeltaSpike_Wildfly_10/ws/deltaspike/modules/bean-validation/target/bean-validation-module-project-1.7.2-SNAPSHOT-tests.jar>
to org.apache.deltaspike.modules/bean-validation-module-project/1.7.2-SNAPSHOT/bean-validation-module-project-1.7.2-SNAPSHOT-tests.jar
[JENKINS] Archiving <https://builds.apache.org/job/DeltaSpike_Wildfly_10/ws/deltaspike/modules/partial-bean/impl/pom.xml>
to org.apache.deltaspike.modules/deltaspike-partial-bean-module-impl/1.7.2-SNAPSHOT/deltaspike-partial-bean-module-impl-1.7.2-SNAPSHOT.pom
[JENKINS] Archiving <https://builds.apache.org/job/DeltaSpike_Wildfly_10/ws/deltaspike/modules/partial-bean/impl/target/deltaspike-partial-bean-module-impl-1.7.2-SNAPSHOT.jar>
to org.apache.deltaspike.modules/deltaspike-partial-bean-module-impl/1.7.2-SNAPSHOT/deltaspike-partial-bean-module-impl-1.7.2-SNAPSHOT.jar
[JENKINS] Archiving <https://builds.apache.org/job/DeltaSpike_Wildfly_10/ws/deltaspike/modules/partial-bean/impl/target/deltaspike-partial-bean-module-impl-1.7.2-SNAPSHOT-tests.jar>
to org.apache.deltaspike.modules/deltaspike-partial-bean-module-impl/1.7.2-SNAPSHOT/deltaspike-partial-bean-module-impl-1.7.2-SNAPSHOT-tests.jar
[JENKINS] Archiving <https://builds.apache.org/job/DeltaSpike_Wildfly_10/ws/deltaspike/modules/partial-bean/impl/target/deltaspike-partial-bean-module-impl-1.7.2-SNAPSHOT-sources.jar>
to org.apache.deltaspike.modules/deltaspike-partial-bean-module-impl/1.7.2-SNAPSHOT/deltaspike-partial-bean-module-impl-1.7.2-SNAPSHOT-sources.jar
[JENKINS] Archiving <https://builds.apache.org/job/DeltaSpike_Wildfly_10/ws/deltaspike/modules/proxy/api/pom.xml>
to org.apache.deltaspike.modules/deltaspike-proxy-module-api/1.7.2-SNAPSHOT/deltaspike-proxy-module-api-1.7.2-SNAPSHOT.pom
[JENKINS] Archiving <https://builds.apache.org/job/DeltaSpike_Wildfly_10/ws/deltaspike/modules/proxy/api/target/deltaspike-proxy-module-api-1.7.2-SNAPSHOT.jar>
to org.apache.deltaspike.modules/deltaspike-proxy-module-api/1.7.2-SNAPSHOT/deltaspike-proxy-module-api-1.7.2-SNAPSHOT.jar
[JENKINS] Archiving <https://builds.apache.org/job/DeltaSpike_Wildfly_10/ws/deltaspike/modules/proxy/api/target/deltaspike-proxy-module-api-1.7.2-SNAPSHOT-tests.jar>
to org.apache.deltaspike.modules/deltaspike-proxy-module-api/1.7.2-SNAPSHOT/deltaspike-proxy-module-api-1.7.2-SNAPSHOT-tests.jar
[JENKINS] Archiving <https://builds.apache.org/job/DeltaSpike_Wildfly_10/ws/deltaspike/modules/proxy/api/target/deltaspike-proxy-module-api-1.7.2-SNAPSHOT-sources.jar>
to org.apache.deltaspike.modules/deltaspike-proxy-module-api/1.7.2-SNAPSHOT/deltaspike-proxy-module-api-1.7.2-SNAPSHOT-sources.jar
[JENKINS] Archiving <https://builds.apache.org/job/DeltaSpike_Wildfly_10/ws/deltaspike/cdictrl/impl-weld/pom.xml>
to org.apache.deltaspike.cdictrl/deltaspike-cdictrl-weld/1.7.2-SNAPSHOT/deltaspike-cdictrl-weld-1.7.2-SNAPSHOT.pom
[JENKINS] Archiving <https://builds.apache.org/job/DeltaSpike_Wildfly_10/ws/deltaspike/cdictrl/impl-weld/target/deltaspike-cdictrl-weld-1.7.2-SNAPSHOT.jar>
to org.apache.deltaspike.cdictrl/deltaspike-cdictrl-weld/1.7.2-SNAPSHOT/deltaspike-cdictrl-weld-1.7.2-SNAPSHOT.jar
[JENKINS] Archiving <https://builds.apache.org/job/DeltaSpike_Wildfly_10/ws/deltaspike/cdictrl/impl-weld/target/deltaspike-cdictrl-weld-1.7.2-SNAPSHOT-tests.jar>
to org.apache.deltaspike.cdictrl/deltaspike-cdictrl-weld/1.7.2-SNAPSHOT/deltaspike-cdictrl-weld-1.7.2-SNAPSHOT-tests.jar
[JENKINS] Archiving <https://builds.apache.org/job/DeltaSpike_Wildfly_10/ws/deltaspike/cdictrl/impl-weld/target/deltaspike-cdictrl-weld-1.7.2-SNAPSHOT-sources.jar>
to org.apache.deltaspike.cdictrl/deltaspike-cdictrl-weld/1.7.2-SNAPSHOT/deltaspike-cdictrl-weld-1.7.2-SNAPSHOT-sources.jar
[JENKINS] Archiving <https://builds.apache.org/job/DeltaSpike_Wildfly_10/ws/deltaspike/modules/jpa/api/pom.xml>
to org.apache.deltaspike.modules/deltaspike-jpa-module-api/1.7.2-SNAPSHOT/deltaspike-jpa-module-api-1.7.2-SNAPSHOT.pom
[JENKINS] Archiving <https://builds.apache.org/job/DeltaSpike_Wildfly_10/ws/deltaspike/modules/jpa/api/target/deltaspike-jpa-module-api-1.7.2-SNAPSHOT.jar>
to org.apache.deltaspike.modules/deltaspike-jpa-module-api/1.7.2-SNAPSHOT/deltaspike-jpa-module-api-1.7.2-SNAPSHOT.jar
[JENKINS] Archiving <https://builds.apache.org/job/DeltaSpike_Wildfly_10/ws/deltaspike/modules/jpa/api/target/deltaspike-jpa-module-api-1.7.2-SNAPSHOT-tests.jar>
to org.apache.deltaspike.modules/deltaspike-jpa-module-api/1.7.2-SNAPSHOT/deltaspike-jpa-module-api-1.7.2-SNAPSHOT-tests.jar
[JENKINS] Archiving <https://builds.apache.org/job/DeltaSpike_Wildfly_10/ws/deltaspike/modules/jpa/api/target/deltaspike-jpa-module-api-1.7.2-SNAPSHOT-sources.jar>
to org.apache.deltaspike.modules/deltaspike-jpa-module-api/1.7.2-SNAPSHOT/deltaspike-jpa-module-api-1.7.2-SNAPSHOT-sources.jar
[JENKINS] Archiving <https://builds.apache.org/job/DeltaSpike_Wildfly_10/ws/deltaspike/modules/servlet/api/pom.xml>
to org.apache.deltaspike.modules/deltaspike-servlet-module-api/1.7.2-SNAPSHOT/deltaspike-servlet-module-api-1.7.2-SNAPSHOT.pom
[JENKINS] Archiving <https://builds.apache.org/job/DeltaSpike_Wildfly_10/ws/deltaspike/modules/servlet/api/target/deltaspike-servlet-module-api-1.7.2-SNAPSHOT.jar>
to org.apache.deltaspike.modules/deltaspike-servlet-module-api/1.7.2-SNAPSHOT/deltaspike-servlet-module-api-1.7.2-SNAPSHOT.jar
[JENKINS] Archiving <https://builds.apache.org/job/DeltaSpike_Wildfly_10/ws/deltaspike/modules/servlet/api/target/deltaspike-servlet-module-api-1.7.2-SNAPSHOT-tests.jar>
to org.apache.deltaspike.modules/deltaspike-servlet-module-api/1.7.2-SNAPSHOT/deltaspike-servlet-module-api-1.7.2-SNAPSHOT-tests.jar
[JENKINS] Archiving <https://builds.apache.org/job/DeltaSpike_Wildfly_10/ws/deltaspike/modules/servlet/api/target/deltaspike-servlet-module-api-1.7.2-SNAPSHOT-sources.jar>
to org.apache.deltaspike.modules/deltaspike-servlet-module-api/1.7.2-SNAPSHOT/deltaspike-servlet-module-api-1.7.2-SNAPSHOT-sources.jar
[JENKINS] Archiving <https://builds.apache.org/job/DeltaSpike_Wildfly_10/ws/deltaspike/modules/jpa/pom.xml>
to org.apache.deltaspike.modules/jpa-module-project/1.7.2-SNAPSHOT/jpa-module-project-1.7.2-SNAPSHOT.pom
[JENKINS] Archiving <https://builds.apache.org/job/DeltaSpike_Wildfly_10/ws/deltaspike/modules/jpa/target/jpa-module-project-1.7.2-SNAPSHOT-tests.jar>
to org.apache.deltaspike.modules/jpa-module-project/1.7.2-SNAPSHOT/jpa-module-project-1.7.2-SNAPSHOT-tests.jar
[JENKINS] Archiving <https://builds.apache.org/job/DeltaSpike_Wildfly_10/ws/deltaspike/cdictrl/pom.xml>
to org.apache.deltaspike.cdictrl/cdictrl-project/1.7.2-SNAPSHOT/cdictrl-project-1.7.2-SNAPSHOT.pom
[JENKINS] Archiving <https://builds.apache.org/job/DeltaSpike_Wildfly_10/ws/deltaspike/cdictrl/target/cdictrl-project-1.7.2-SNAPSHOT-tests.jar>
to org.apache.deltaspike.cdictrl/cdictrl-project/1.7.2-SNAPSHOT/cdictrl-project-1.7.2-SNAPSHOT-tests.jar
[JENKINS] Archiving <https://builds.apache.org/job/DeltaSpike_Wildfly_10/ws/deltaspike/modules/scheduler/api/pom.xml>
to org.apache.deltaspike.modules/deltaspike-scheduler-module-api/1.7.2-SNAPSHOT/deltaspike-scheduler-module-api-1.7.2-SNAPSHOT.pom
[JENKINS] Archiving <https://builds.apache.org/job/DeltaSpike_Wildfly_10/ws/deltaspike/modules/test-control/impl/pom.xml>
to org.apache.deltaspike.modules/deltaspike-test-control-module-impl/1.7.2-SNAPSHOT/deltaspike-test-control-module-impl-1.7.2-SNAPSHOT.pom
[JENKINS] Archiving <https://builds.apache.org/job/DeltaSpike_Wildfly_10/ws/deltaspike/modules/servlet/pom.xml>
to org.apache.deltaspike.modules/servlet-module-project/1.7.2-SNAPSHOT/servlet-module-project-1.7.2-SNAPSHOT.pom
[JENKINS] Archiving <https://builds.apache.org/job/DeltaSpike_Wildfly_10/ws/deltaspike/modules/servlet/target/servlet-module-project-1.7.2-SNAPSHOT-tests.jar>
to org.apache.deltaspike.modules/servlet-module-project/1.7.2-SNAPSHOT/servlet-module-project-1.7.2-SNAPSHOT-tests.jar
[JENKINS] Archiving <https://builds.apache.org/job/DeltaSpike_Wildfly_10/ws/deltaspike/modules/test-control/api/pom.xml>
to org.apache.deltaspike.modules/deltaspike-test-control-module-api/1.7.2-SNAPSHOT/deltaspike-test-control-module-api-1.7.2-SNAPSHOT.pom
[JENKINS] Archiving <https://builds.apache.org/job/DeltaSpike_Wildfly_10/ws/deltaspike/modules/jsf/impl-ee6/pom.xml>
to org.apache.deltaspike.modules/deltaspike-jsf-module-impl-ee6/1.7.2-SNAPSHOT/deltaspike-jsf-module-impl-ee6-1.7.2-SNAPSHOT.pom
[JENKINS] Archiving <https://builds.apache.org/job/DeltaSpike_Wildfly_10/ws/deltaspike/modules/jsf/impl-ee6/target/deltaspike-jsf-module-impl-ee6-1.7.2-SNAPSHOT.jar>
to org.apache.deltaspike.modules/deltaspike-jsf-module-impl-ee6/1.7.2-SNAPSHOT/deltaspike-jsf-module-impl-ee6-1.7.2-SNAPSHOT.jar
[JENKINS] Archiving <https://builds.apache.org/job/DeltaSpike_Wildfly_10/ws/deltaspike/modules/jsf/impl-ee6/target/deltaspike-jsf-module-impl-ee6-1.7.2-SNAPSHOT-tests.jar>
to org.apache.deltaspike.modules/deltaspike-jsf-module-impl-ee6/1.7.2-SNAPSHOT/deltaspike-jsf-module-impl-ee6-1.7.2-SNAPSHOT-tests.jar
[JENKINS] Archiving <https://builds.apache.org/job/DeltaSpike_Wildfly_10/ws/deltaspike/modules/jsf/impl-ee6/target/deltaspike-jsf-module-impl-ee6-1.7.2-SNAPSHOT-sources.jar>
to org.apache.deltaspike.modules/deltaspike-jsf-module-impl-ee6/1.7.2-SNAPSHOT/deltaspike-jsf-module-impl-ee6-1.7.2-SNAPSHOT-sources.jar
[JENKINS] Archiving <https://builds.apache.org/job/DeltaSpike_Wildfly_10/ws/deltaspike/modules/proxy/pom.xml>
to org.apache.deltaspike.modules/proxy-module-project/1.7.2-SNAPSHOT/proxy-module-project-1.7.2-SNAPSHOT.pom
[JENKINS] Archiving <https://builds.apache.org/job/DeltaSpike_Wildfly_10/ws/deltaspike/modules/proxy/target/proxy-module-project-1.7.2-SNAPSHOT-tests.jar>
to org.apache.deltaspike.modules/proxy-module-project/1.7.2-SNAPSHOT/proxy-module-project-1.7.2-SNAPSHOT-tests.jar
[JENKINS] Archiving <https://builds.apache.org/job/DeltaSpike_Wildfly_10/ws/deltaspike/modules/partial-bean/api/pom.xml>
to org.apache.deltaspike.modules/deltaspike-partial-bean-module-api/1.7.2-SNAPSHOT/deltaspike-partial-bean-module-api-1.7.2-SNAPSHOT.pom
[JENKINS] Archiving <https://builds.apache.org/job/DeltaSpike_Wildfly_10/ws/deltaspike/modules/partial-bean/api/target/deltaspike-partial-bean-module-api-1.7.2-SNAPSHOT.jar>
to org.apache.deltaspike.modules/deltaspike-partial-bean-module-api/1.7.2-SNAPSHOT/deltaspike-partial-bean-module-api-1.7.2-SNAPSHOT.jar
[JENKINS] Archiving <https://builds.apache.org/job/DeltaSpike_Wildfly_10/ws/deltaspike/modules/partial-bean/api/target/deltaspike-partial-bean-module-api-1.7.2-SNAPSHOT-tests.jar>
to org.apache.deltaspike.modules/deltaspike-partial-bean-module-api/1.7.2-SNAPSHOT/deltaspike-partial-bean-module-api-1.7.2-SNAPSHOT-tests.jar
[JENKINS] Archiving <https://builds.apache.org/job/DeltaSpike_Wildfly_10/ws/deltaspike/modules/partial-bean/api/target/deltaspike-partial-bean-module-api-1.7.2-SNAPSHOT-sources.jar>
to org.apache.deltaspike.modules/deltaspike-partial-bean-module-api/1.7.2-SNAPSHOT/deltaspike-partial-bean-module-api-1.7.2-SNAPSHOT-sources.jar
[JENKINS] Archiving <https://builds.apache.org/job/DeltaSpike_Wildfly_10/ws/deltaspike/modules/scheduler/impl/pom.xml>
to org.apache.deltaspike.modules/deltaspike-scheduler-module-impl/1.7.2-SNAPSHOT/deltaspike-scheduler-module-impl-1.7.2-SNAPSHOT.pom
[JENKINS] Archiving <https://builds.apache.org/job/DeltaSpike_Wildfly_10/ws/deltaspike/parent/pom.xml>
to org.apache.deltaspike/parent/1.7.2-SNAPSHOT/parent-1.7.2-SNAPSHOT.pom
Compressed 40.41 KB of artifacts by 79.2% relative to #120
[JENKINS] Archiving <https://builds.apache.org/job/DeltaSpike_Wildfly_10/ws/deltaspike/core/pom.xml>
to org.apache.deltaspike.core/core-project/1.7.2-SNAPSHOT/core-project-1.7.2-SNAPSHOT.pom
[JENKINS] Archiving <https://builds.apache.org/job/DeltaSpike_Wildfly_10/ws/deltaspike/core/target/core-project-1.7.2-SNAPSHOT-tests.jar>
to org.apache.deltaspike.core/core-project/1.7.2-SNAPSHOT/core-project-1.7.2-SNAPSHOT-tests.jar
[JENKINS] Archiving <https://builds.apache.org/job/DeltaSpike_Wildfly_10/ws/deltaspike/modules/bean-validation/api/pom.xml>
to org.apache.deltaspike.modules/deltaspike-bean-validation-module-api/1.7.2-SNAPSHOT/deltaspike-bean-validation-module-api-1.7.2-SNAPSHOT.pom
[JENKINS] Archiving <https://builds.apache.org/job/DeltaSpike_Wildfly_10/ws/deltaspike/modules/bean-validation/api/target/deltaspike-bean-validation-module-api-1.7.2-SNAPSHOT.jar>
to org.apache.deltaspike.modules/deltaspike-bean-validation-module-api/1.7.2-SNAPSHOT/deltaspike-bean-validation-module-api-1.7.2-SNAPSHOT.jar
[JENKINS] Archiving <https://builds.apache.org/job/DeltaSpike_Wildfly_10/ws/deltaspike/modules/bean-validation/api/target/deltaspike-bean-validation-module-api-1.7.2-SNAPSHOT-tests.jar>
to org.apache.deltaspike.modules/deltaspike-bean-validation-module-api/1.7.2-SNAPSHOT/deltaspike-bean-validation-module-api-1.7.2-SNAPSHOT-tests.jar
[JENKINS] Archiving <https://builds.apache.org/job/DeltaSpike_Wildfly_10/ws/deltaspike/modules/bean-validation/api/target/deltaspike-bean-validation-module-api-1.7.2-SNAPSHOT-sources.jar>
to org.apache.deltaspike.modules/deltaspike-bean-validation-module-api/1.7.2-SNAPSHOT/deltaspike-bean-validation-module-api-1.7.2-SNAPSHOT-sources.jar
[JENKINS] Archiving <https://builds.apache.org/job/DeltaSpike_Wildfly_10/ws/deltaspike/core/api/pom.xml>
to org.apache.deltaspike.core/deltaspike-core-api/1.7.2-SNAPSHOT/deltaspike-core-api-1.7.2-SNAPSHOT.pom
[JENKINS] Archiving <https://builds.apache.org/job/DeltaSpike_Wildfly_10/ws/deltaspike/core/api/target/deltaspike-core-api-1.7.2-SNAPSHOT.jar>
to org.apache.deltaspike.core/deltaspike-core-api/1.7.2-SNAPSHOT/deltaspike-core-api-1.7.2-SNAPSHOT.jar
[JENKINS] Archiving <https://builds.apache.org/job/DeltaSpike_Wildfly_10/ws/deltaspike/core/api/target/deltaspike-core-api-1.7.2-SNAPSHOT-tests.jar>
to org.apache.deltaspike.core/deltaspike-core-api/1.7.2-SNAPSHOT/deltaspike-core-api-1.7.2-SNAPSHOT-tests.jar
[JENKINS] Archiving <https://builds.apache.org/job/DeltaSpike_Wildfly_10/ws/deltaspike/core/api/target/deltaspike-core-api-1.7.2-SNAPSHOT-sources.jar>
to org.apache.deltaspike.core/deltaspike-core-api/1.7.2-SNAPSHOT/deltaspike-core-api-1.7.2-SNAPSHOT-sources.jar
[JENKINS] Archiving <https://builds.apache.org/job/DeltaSpike_Wildfly_10/ws/deltaspike/modules/security/impl/pom.xml>
to org.apache.deltaspike.modules/deltaspike-security-module-impl/1.7.2-SNAPSHOT/deltaspike-security-module-impl-1.7.2-SNAPSHOT.pom
[JENKINS] Archiving <https://builds.apache.org/job/DeltaSpike_Wildfly_10/ws/deltaspike/modules/security/impl/target/deltaspike-security-module-impl-1.7.2-SNAPSHOT.jar>
to org.apache.deltaspike.modules/deltaspike-security-module-impl/1.7.2-SNAPSHOT/deltaspike-security-module-impl-1.7.2-SNAPSHOT.jar
[JENKINS] Archiving <https://builds.apache.org/job/DeltaSpike_Wildfly_10/ws/deltaspike/modules/security/impl/target/deltaspike-security-module-impl-1.7.2-SNAPSHOT-tests.jar>
to org.apache.deltaspike.modules/deltaspike-security-module-impl/1.7.2-SNAPSHOT/deltaspike-security-module-impl-1.7.2-SNAPSHOT-tests.jar
[JENKINS] Archiving <https://builds.apache.org/job/DeltaSpike_Wildfly_10/ws/deltaspike/modules/security/impl/target/deltaspike-security-module-impl-1.7.2-SNAPSHOT-sources.jar>
to org.apache.deltaspike.modules/deltaspike-security-module-impl/1.7.2-SNAPSHOT/deltaspike-security-module-impl-1.7.2-SNAPSHOT-sources.jar
[JENKINS] Archiving <https://builds.apache.org/job/DeltaSpike_Wildfly_10/ws/deltaspike/modules/scheduler/pom.xml>
to org.apache.deltaspike.modules/scheduler-module-project/1.7.2-SNAPSHOT/scheduler-module-project-1.7.2-SNAPSHOT.pom
[JENKINS] Archiving <https://builds.apache.org/job/DeltaSpike_Wildfly_10/ws/site/pom.xml>
to org.apache.deltaspike/deltaspike-site/1.7.2-SNAPSHOT/deltaspike-site-1.7.2-SNAPSHOT.pom
[JENKINS] Archiving <https://builds.apache.org/job/DeltaSpike_Wildfly_10/ws/deltaspike/modules/proxy/impl-asm5/pom.xml>
to org.apache.deltaspike.modules/deltaspike-proxy-module-impl-asm5/1.7.2-SNAPSHOT/deltaspike-proxy-module-impl-asm5-1.7.2-SNAPSHOT.pom
[JENKINS] Archiving <https://builds.apache.org/job/DeltaSpike_Wildfly_10/ws/deltaspike/modules/proxy/impl-asm5/target/deltaspike-proxy-module-impl-asm5-1.7.2-SNAPSHOT.jar>
to org.apache.deltaspike.modules/deltaspike-proxy-module-impl-asm5/1.7.2-SNAPSHOT/deltaspike-proxy-module-impl-asm5-1.7.2-SNAPSHOT.jar
[JENKINS] Archiving <https://builds.apache.org/job/DeltaSpike_Wildfly_10/ws/deltaspike/modules/proxy/impl-asm5/target/deltaspike-proxy-module-impl-asm5-1.7.2-SNAPSHOT-tests.jar>
to org.apache.deltaspike.modules/deltaspike-proxy-module-impl-asm5/1.7.2-SNAPSHOT/deltaspike-proxy-module-impl-asm5-1.7.2-SNAPSHOT-tests.jar
[JENKINS] Archiving <https://builds.apache.org/job/DeltaSpike_Wildfly_10/ws/deltaspike/modules/proxy/impl-asm5/target/deltaspike-proxy-module-impl-asm5-1.7.2-SNAPSHOT-sources.jar>
to org.apache.deltaspike.modules/deltaspike-proxy-module-impl-asm5/1.7.2-SNAPSHOT/deltaspike-proxy-module-impl-asm5-1.7.2-SNAPSHOT-sources.jar
[JENKINS] Archiving <https://builds.apache.org/job/DeltaSpike_Wildfly_10/ws/deltaspike/examples/jsf-playground/pom.xml>
to org.apache.deltaspike.examples/deltaspike-jsf-playground/1.7.2-SNAPSHOT/deltaspike-jsf-playground-1.7.2-SNAPSHOT.pom
[JENKINS] Archiving <https://builds.apache.org/job/DeltaSpike_Wildfly_10/ws/deltaspike/modules/servlet/impl/pom.xml>
to org.apache.deltaspike.modules/deltaspike-servlet-module-impl/1.7.2-SNAPSHOT/deltaspike-servlet-module-impl-1.7.2-SNAPSHOT.pom
[JENKINS] Archiving <https://builds.apache.org/job/DeltaSpike_Wildfly_10/ws/deltaspike/modules/servlet/impl/target/deltaspike-servlet-module-impl-1.7.2-SNAPSHOT.jar>
to org.apache.deltaspike.modules/deltaspike-servlet-module-impl/1.7.2-SNAPSHOT/deltaspike-servlet-module-impl-1.7.2-SNAPSHOT.jar
[JENKINS] Archiving <https://builds.apache.org/job/DeltaSpike_Wildfly_10/ws/deltaspike/modules/servlet/impl/target/deltaspike-servlet-module-impl-1.7.2-SNAPSHOT-tests.jar>
to org.apache.deltaspike.modules/deltaspike-servlet-module-impl/1.7.2-SNAPSHOT/deltaspike-servlet-module-impl-1.7.2-SNAPSHOT-tests.jar
[JENKINS] Archiving <https://builds.apache.org/job/DeltaSpike_Wildfly_10/ws/deltaspike/modules/servlet/impl/target/deltaspike-servlet-module-impl-1.7.2-SNAPSHOT-sources.jar>
to org.apache.deltaspike.modules/deltaspike-servlet-module-impl/1.7.2-SNAPSHOT/deltaspike-servlet-module-impl-1.7.2-SNAPSHOT-sources.jar
[JENKINS] Archiving <https://builds.apache.org/job/DeltaSpike_Wildfly_10/ws/deltaspike/modules/bean-validation/impl/pom.xml>
to org.apache.deltaspike.modules/deltaspike-bean-validation-module-impl/1.7.2-SNAPSHOT/deltaspike-bean-validation-module-impl-1.7.2-SNAPSHOT.pom
[JENKINS] Archiving <https://builds.apache.org/job/DeltaSpike_Wildfly_10/ws/deltaspike/modules/bean-validation/impl/target/deltaspike-bean-validation-module-impl-1.7.2-SNAPSHOT.jar>
to org.apache.deltaspike.modules/deltaspike-bean-validation-module-impl/1.7.2-SNAPSHOT/deltaspike-bean-validation-module-impl-1.7.2-SNAPSHOT.jar
[JENKINS] Archiving <https://builds.apache.org/job/DeltaSpike_Wildfly_10/ws/deltaspike/modules/bean-validation/impl/target/deltaspike-bean-validation-module-impl-1.7.2-SNAPSHOT-tests.jar>
to org.apache.deltaspike.modules/deltaspike-bean-validation-module-impl/1.7.2-SNAPSHOT/deltaspike-bean-validation-module-impl-1.7.2-SNAPSHOT-tests.jar
[JENKINS] Archiving <https://builds.apache.org/job/DeltaSpike_Wildfly_10/ws/deltaspike/modules/bean-validation/impl/target/deltaspike-bean-validation-module-impl-1.7.2-SNAPSHOT-sources.jar>
to org.apache.deltaspike.modules/deltaspike-bean-validation-module-impl/1.7.2-SNAPSHOT/deltaspike-bean-validation-module-impl-1.7.2-SNAPSHOT-sources.jar
[JENKINS] Archiving <https://builds.apache.org/job/DeltaSpike_Wildfly_10/ws/deltaspike/modules/data/test-ee7/pom.xml>
to org.apache.deltaspike.modules/deltaspike-data-module-test-ee7/1.7.2-SNAPSHOT/deltaspike-data-module-test-ee7-1.7.2-SNAPSHOT.pom
[JENKINS] Archiving <https://builds.apache.org/job/DeltaSpike_Wildfly_10/ws/deltaspike/modules/data/test-ee7/target/deltaspike-data-module-test-ee7-1.7.2-SNAPSHOT.jar>
to org.apache.deltaspike.modules/deltaspike-data-module-test-ee7/1.7.2-SNAPSHOT/deltaspike-data-module-test-ee7-1.7.2-SNAPSHOT.jar
[JENKINS] Archiving <https://builds.apache.org/job/DeltaSpike_Wildfly_10/ws/deltaspike/modules/data/test-ee7/target/deltaspike-data-module-test-ee7-1.7.2-SNAPSHOT-tests.jar>
to org.apache.deltaspike.modules/deltaspike-data-module-test-ee7/1.7.2-SNAPSHOT/deltaspike-data-module-test-ee7-1.7.2-SNAPSHOT-tests.jar
[JENKINS] Archiving <https://builds.apache.org/job/DeltaSpike_Wildfly_10/ws/deltaspike/modules/data/test-ee7/target/deltaspike-data-module-test-ee7-1.7.2-SNAPSHOT-sources.jar>
to org.apache.deltaspike.modules/deltaspike-data-module-test-ee7/1.7.2-SNAPSHOT/deltaspike-data-module-test-ee7-1.7.2-SNAPSHOT-sources.jar
[JENKINS] Archiving <https://builds.apache.org/job/DeltaSpike_Wildfly_10/ws/pom.xml>
to org.apache.deltaspike/deltaspike/1.7.2-SNAPSHOT/deltaspike-1.7.2-SNAPSHOT.pom
[JENKINS] Archiving <https://builds.apache.org/job/DeltaSpike_Wildfly_10/ws/deltaspike/modules/jpa/impl/pom.xml>
to org.apache.deltaspike.modules/deltaspike-jpa-module-impl/1.7.2-SNAPSHOT/deltaspike-jpa-module-impl-1.7.2-SNAPSHOT.pom
[JENKINS] Archiving <https://builds.apache.org/job/DeltaSpike_Wildfly_10/ws/deltaspike/modules/jpa/impl/target/deltaspike-jpa-module-impl-1.7.2-SNAPSHOT.jar>
to org.apache.deltaspike.modules/deltaspike-jpa-module-impl/1.7.2-SNAPSHOT/deltaspike-jpa-module-impl-1.7.2-SNAPSHOT.jar
[JENKINS] Archiving <https://builds.apache.org/job/DeltaSpike_Wildfly_10/ws/deltaspike/modules/jpa/impl/target/deltaspike-jpa-module-impl-1.7.2-SNAPSHOT-tests.jar>
to org.apache.deltaspike.modules/deltaspike-jpa-module-impl/1.7.2-SNAPSHOT/deltaspike-jpa-module-impl-1.7.2-SNAPSHOT-tests.jar
[JENKINS] Archiving <https://builds.apache.org/job/DeltaSpike_Wildfly_10/ws/deltaspike/modules/jpa/impl/target/deltaspike-jpa-module-impl-1.7.2-SNAPSHOT-sources.jar>
to org.apache.deltaspike.modules/deltaspike-jpa-module-impl/1.7.2-SNAPSHOT/deltaspike-jpa-module-impl-1.7.2-SNAPSHOT-sources.jar
[JENKINS] Archiving <https://builds.apache.org/job/DeltaSpike_Wildfly_10/ws/deltaspike/modules/data/pom.xml>
to org.apache.deltaspike.modules/data-module-project/1.7.2-SNAPSHOT/data-module-project-1.7.2-SNAPSHOT.pom
[JENKINS] Archiving <https://builds.apache.org/job/DeltaSpike_Wildfly_10/ws/deltaspike/modules/data/target/data-module-project-1.7.2-SNAPSHOT-tests.jar>
to org.apache.deltaspike.modules/data-module-project/1.7.2-SNAPSHOT/data-module-project-1.7.2-SNAPSHOT-tests.jar
[JENKINS] Archiving <https://builds.apache.org/job/DeltaSpike_Wildfly_10/ws/deltaspike/examples/security-requested-page-after-login-picketlink/pom.xml>
to org.apache.deltaspike.examples/deltaspike-security-requested-page-after-login-picketlink/1.7.2-SNAPSHOT/deltaspike-security-requested-page-after-login-picketlink-1.7.2-SNAPSHOT.pom
[JENKINS] Archiving <https://builds.apache.org/job/DeltaSpike_Wildfly_10/ws/deltaspike/pom.xml>
to org.apache.deltaspike/deltaspike-project/1.7.2-SNAPSHOT/deltaspike-project-1.7.2-SNAPSHOT.pom
[JENKINS] Archiving <https://builds.apache.org/job/DeltaSpike_Wildfly_10/ws/deltaspike/modules/security/api/pom.xml>
to org.apache.deltaspike.modules/deltaspike-security-module-api/1.7.2-SNAPSHOT/deltaspike-security-module-api-1.7.2-SNAPSHOT.pom
[JENKINS] Archiving <https://builds.apache.org/job/DeltaSpike_Wildfly_10/ws/deltaspike/modules/security/api/target/deltaspike-security-module-api-1.7.2-SNAPSHOT.jar>
to org.apache.deltaspike.modules/deltaspike-security-module-api/1.7.2-SNAPSHOT/deltaspike-security-module-api-1.7.2-SNAPSHOT.jar
[JENKINS] Archiving <https://builds.apache.org/job/DeltaSpike_Wildfly_10/ws/deltaspike/modules/security/api/target/deltaspike-security-module-api-1.7.2-SNAPSHOT-tests.jar>
to org.apache.deltaspike.modules/deltaspike-security-module-api/1.7.2-SNAPSHOT/deltaspike-security-module-api-1.7.2-SNAPSHOT-tests.jar
[JENKINS] Archiving <https://builds.apache.org/job/DeltaSpike_Wildfly_10/ws/deltaspike/modules/security/api/target/deltaspike-security-module-api-1.7.2-SNAPSHOT-sources.jar>
to org.apache.deltaspike.modules/deltaspike-security-module-api/1.7.2-SNAPSHOT/deltaspike-security-module-api-1.7.2-SNAPSHOT-sources.jar
channel stopped

Mime
View raw message