deltaspike-commits mailing list archives

Site index · List index
Message view « Date » · « Thread »
Top « Date » · « Thread »
From Apache Jenkins Server <jenk...@builds.apache.org>
Subject Build failed in Jenkins: DeltaSpike_Wildfly_9.0.2 #112
Date Thu, 21 Jul 2016 14:55:41 GMT
See <https://builds.apache.org/job/DeltaSpike_Wildfly_9.0.2/112/changes>

Changes:

[johndament] [maven-release-plugin] prepare release deltaspike-1.7.1

[johndament] [maven-release-plugin] prepare for next development iteration

[johndament] DELTASPIKE-1186 Updated website with 1.7.1 release.

[johndament] DELTASPIKE-1186 New release announcement template.

[johndament] Switched links to HTTPS.

------------------------------------------
[...truncated 5983 lines...]
[INFO] --- maven-bundle-plugin:2.3.7:install (default-install) @ deltaspike-scheduler-module-api
---
[INFO] Installing org/apache/deltaspike/modules/deltaspike-scheduler-module-api/1.7.2-SNAPSHOT/deltaspike-scheduler-module-api-1.7.2-SNAPSHOT.jar
[INFO] Writing OBR metadata
[INFO]                                                                         
[INFO] ------------------------------------------------------------------------
[INFO] Building Apache DeltaSpike Scheduler-Module Impl 1.7.2-SNAPSHOT
[INFO] ------------------------------------------------------------------------
[INFO] Downloading: https://repository.apache.org/content/repositories/releases/org/quartz-scheduler/quartz/2.2.1/quartz-2.2.1.pom
[INFO] Downloading: https://repository.apache.org/content/repositories/snapshots/org/quartz-scheduler/quartz/2.2.1/quartz-2.2.1.pom
[INFO] Downloading: http://repo.maven.apache.org/maven2/org/quartz-scheduler/quartz/2.2.1/quartz-2.2.1.pom
[INFO] Downloaded: http://repo.maven.apache.org/maven2/org/quartz-scheduler/quartz/2.2.1/quartz-2.2.1.pom
(10 KB at 1169.8 KB/sec)
[INFO] Downloading: https://repository.apache.org/content/repositories/releases/org/quartz-scheduler/quartz-parent/2.2.1/quartz-parent-2.2.1.pom
[INFO] Downloading: https://repository.apache.org/content/repositories/snapshots/org/quartz-scheduler/quartz-parent/2.2.1/quartz-parent-2.2.1.pom
[INFO] Downloading: http://repo.maven.apache.org/maven2/org/quartz-scheduler/quartz-parent/2.2.1/quartz-parent-2.2.1.pom
[INFO] Downloaded: http://repo.maven.apache.org/maven2/org/quartz-scheduler/quartz-parent/2.2.1/quartz-parent-2.2.1.pom
(14 KB at 1522.5 KB/sec)
[INFO] Downloading: https://repository.apache.org/content/repositories/releases/c3p0/c3p0/0.9.1.1/c3p0-0.9.1.1.pom
[INFO] Downloading: https://repository.apache.org/content/repositories/snapshots/c3p0/c3p0/0.9.1.1/c3p0-0.9.1.1.pom
[INFO] Downloading: http://repo.maven.apache.org/maven2/c3p0/c3p0/0.9.1.1/c3p0-0.9.1.1.pom
[INFO] Downloaded: http://repo.maven.apache.org/maven2/c3p0/c3p0/0.9.1.1/c3p0-0.9.1.1.pom
(856 B at 46.4 KB/sec)
[INFO] Downloading: https://repository.apache.org/content/repositories/releases/org/apache/deltaspike/cdictrl/deltaspike-cdictrl-owb/1.7.2-SNAPSHOT/deltaspike-cdictrl-owb-1.7.2-SNAPSHOT.pom
[INFO] Downloading: https://repository.apache.org/content/repositories/snapshots/org/apache/deltaspike/cdictrl/deltaspike-cdictrl-owb/1.7.2-SNAPSHOT/deltaspike-cdictrl-owb-1.7.2-SNAPSHOT.pom
[INFO] Downloading: http://repository.apache.org/snapshots/org/apache/deltaspike/cdictrl/deltaspike-cdictrl-owb/1.7.2-SNAPSHOT/deltaspike-cdictrl-owb-1.7.2-SNAPSHOT.pom
[WARNING] The POM for org.apache.deltaspike.cdictrl:deltaspike-cdictrl-owb:jar:1.7.2-SNAPSHOT
is missing, no dependency information available
[INFO] Downloading: https://repository.apache.org/content/repositories/releases/org/quartz-scheduler/quartz/2.2.1/quartz-2.2.1.jar
[INFO] Downloading: https://repository.apache.org/content/repositories/releases/c3p0/c3p0/0.9.1.1/c3p0-0.9.1.1.jar
[INFO] Downloading: https://repository.apache.org/content/repositories/releases/org/apache/xbean/xbean-finder-shaded/4.1/xbean-finder-shaded-4.1.jar
[INFO] Downloading: https://repository.apache.org/content/repositories/releases/org/apache/xbean/xbean-asm5-shaded/4.1/xbean-asm5-shaded-4.1.jar
[INFO] Downloading: https://repository.apache.org/content/repositories/releases/org/apache/deltaspike/cdictrl/deltaspike-cdictrl-owb/1.7.2-SNAPSHOT/deltaspike-cdictrl-owb-1.7.2-SNAPSHOT.jar
[INFO] Downloaded: https://repository.apache.org/content/repositories/releases/org/apache/xbean/xbean-asm5-shaded/4.1/xbean-asm5-shaded-4.1.jar
(142 KB at 1119.8 KB/sec)
[INFO] Downloaded: https://repository.apache.org/content/repositories/releases/org/apache/xbean/xbean-finder-shaded/4.1/xbean-finder-shaded-4.1.jar
(156 KB at 1199.3 KB/sec)
[INFO] Downloading: https://repository.apache.org/content/repositories/snapshots/org/quartz-scheduler/quartz/2.2.1/quartz-2.2.1.jar
[INFO] Downloading: https://repository.apache.org/content/repositories/snapshots/c3p0/c3p0/0.9.1.1/c3p0-0.9.1.1.jar
[INFO] Downloading: https://repository.apache.org/content/repositories/snapshots/org/apache/deltaspike/cdictrl/deltaspike-cdictrl-owb/1.7.2-SNAPSHOT/deltaspike-cdictrl-owb-1.7.2-SNAPSHOT.jar
[INFO] Downloading: http://repo.maven.apache.org/maven2/org/quartz-scheduler/quartz/2.2.1/quartz-2.2.1.jar
[INFO] Downloading: http://repo.maven.apache.org/maven2/c3p0/c3p0/0.9.1.1/c3p0-0.9.1.1.jar
[INFO] Downloaded: http://repo.maven.apache.org/maven2/org/quartz-scheduler/quartz/2.2.1/quartz-2.2.1.jar
(645 KB at 29310.9 KB/sec)
[INFO] Downloaded: http://repo.maven.apache.org/maven2/c3p0/c3p0/0.9.1.1/c3p0-0.9.1.1.jar
(595 KB at 27005.3 KB/sec)
[INFO] Downloading: http://repository.apache.org/snapshots/org/apache/deltaspike/cdictrl/deltaspike-cdictrl-owb/1.7.2-SNAPSHOT/deltaspike-cdictrl-owb-1.7.2-SNAPSHOT.jar
[INFO] ------------------------------------------------------------------------
[INFO] Reactor Summary:
[INFO] 
[INFO] Apache DeltaSpike ................................. SUCCESS [ 47.664 s]
[INFO] Apache DeltaSpike Sources ......................... SUCCESS [ 17.654 s]
[INFO] Apache DeltaSpike CheckStyle-rules ................ SUCCESS [ 48.186 s]
[INFO] Apache DeltaSpike Parent .......................... SUCCESS [ 56.509 s]
[INFO] Apache DeltaSpike Test-Utils ...................... SUCCESS [ 43.396 s]
[INFO] Apache DeltaSpike Code Parent ..................... SUCCESS [01:05 min]
[INFO] Apache DeltaSpike Core ............................ SUCCESS [ 38.701 s]
[INFO] Apache DeltaSpike Core-API ........................ SUCCESS [09:52 min]
[INFO] Apache DeltaSpike Core-Implementation ............. SUCCESS [03:39 min]
[INFO] Apache DeltaSpike ContainerControl parent ......... SUCCESS [01:05 min]
[INFO] Apache DeltaSpike CDI ContainerControl API ........ SUCCESS [01:06 min]
[INFO] Apache DeltaSpike CDI Weld-ContainerControl ....... SUCCESS [ 36.729 s]
[INFO] Apache DeltaSpike Modules ......................... SUCCESS [ 28.044 s]
[INFO] Apache DeltaSpike Proxy-Module .................... SUCCESS [ 26.194 s]
[INFO] Apache DeltaSpike Proxy-Module API ................ SUCCESS [ 47.189 s]
[INFO] Apache DeltaSpike Proxy-Module Impl ASM5 .......... SUCCESS [02:09 min]
[INFO] Apache DeltaSpike Security-Module ................. SUCCESS [ 37.396 s]
[INFO] Apache DeltaSpike Security-Module API ............. SUCCESS [01:14 min]
[INFO] Apache DeltaSpike Security-Module Impl ............ SUCCESS [01:46 min]
[INFO] Apache DeltaSpike JPA-Module ...................... SUCCESS [ 44.589 s]
[INFO] Apache DeltaSpike JPA-Module API .................. SUCCESS [01:01 min]
[INFO] Apache DeltaSpike JPA-Module Impl ................. SUCCESS [ 48.680 s]
[INFO] Apache DeltaSpike Servlet-Module .................. SUCCESS [ 25.167 s]
[INFO] Apache DeltaSpike Servlet-Module API .............. SUCCESS [ 41.407 s]
[INFO] Apache DeltaSpike Servlet-Module Impl ............. SUCCESS [01:40 min]
[INFO] Apache DeltaSpike JSF-Module ...................... SUCCESS [ 37.885 s]
[INFO] Apache DeltaSpike JSF-Module API .................. SUCCESS [01:19 min]
[INFO] Apache DeltaSpike JSF-Module Impl ................. SUCCESS [05:17 min]
[INFO] Apache DeltaSpike JSF-Module Impl (EE6 only) ...... SUCCESS [01:28 min]
[INFO] Apache DeltaSpike Partial-Bean-Module ............. SUCCESS [ 48.582 s]
[INFO] Apache DeltaSpike Partial-Bean-Module API ......... SUCCESS [ 30.141 s]
[INFO] Apache DeltaSpike Partial-Bean-Module Impl ........ SUCCESS [02:08 min]
[INFO] Apache DeltaSpike BeanValidation-Module ........... SUCCESS [ 41.833 s]
[INFO] Apache DeltaSpike BeanValidation-Module API ....... SUCCESS [01:04 min]
[INFO] Apache DeltaSpike BeanValidation-Module Impl ...... SUCCESS [01:32 min]
[INFO] Apache DeltaSpike Data-Module ..................... SUCCESS [ 49.814 s]
[INFO] Apache DeltaSpike Data-Module API ................. SUCCESS [ 49.802 s]
[INFO] Apache DeltaSpike Data-Module Impl ................ SUCCESS [03:17 min]
[INFO] Apache DeltaSpike Scheduler-Module ................ SUCCESS [ 33.851 s]
[INFO] Apache DeltaSpike Scheduler-Module API ............ SUCCESS [ 51.121 s]
[INFO] Apache DeltaSpike Scheduler-Module Impl ........... FAILURE [  1.036 s]
[INFO] Apache DeltaSpike Test-Control-Module ............. SKIPPED
[INFO] Apache DeltaSpike Test-Control-Module API ......... SKIPPED
[INFO] Apache DeltaSpike Test-Control-Module Impl ........ SKIPPED
[INFO] Apache DeltaSpike Examples ........................ SKIPPED
[INFO] Apache DeltaSpike Java-SE Examples ................ SKIPPED
[INFO] Apache DeltaSpike JSF Examples .................... SKIPPED
[INFO] Apache DeltaSpike JSF Playground .................. SKIPPED
[INFO] Apache DeltaSpike Security Example CDI ............ SKIPPED
[INFO] Apache DeltaSpike Security Example PicketLink ..... SKIPPED
[INFO] Apache DeltaSpike Java-SE Scheduler Examples ...... SKIPPED
[INFO] Apache DeltaSpike Documentation ................... SKIPPED
[INFO] Apache DeltaSpike Site ............................ SKIPPED
[INFO] ------------------------------------------------------------------------
[INFO] BUILD FAILURE
[INFO] ------------------------------------------------------------------------
[INFO] Total time: 01:27 h
[INFO] Finished at: 2016-07-21T14:33:16+00:00
[INFO] Final Memory: 100M/395M
[INFO] ------------------------------------------------------------------------
Waiting for Jenkins to finish collecting data
[ERROR] Failed to execute goal on project deltaspike-scheduler-module-impl: Could not resolve
dependencies for project org.apache.deltaspike.modules:deltaspike-scheduler-module-impl:bundle:1.7.2-SNAPSHOT:
Could not find artifact org.apache.deltaspike.cdictrl:deltaspike-cdictrl-owb:jar:1.7.2-SNAPSHOT
in Apache Repository (https://repository.apache.org/content/repositories/releases) -> [Help
1]
[ERROR] 
[ERROR] To see the full stack trace of the errors, re-run Maven with the -e switch.
[ERROR] Re-run Maven using the -X switch to enable full debug logging.
[ERROR] 
[ERROR] For more information about the errors and possible solutions, please read the following
articles:
[ERROR] [Help 1] http://cwiki.apache.org/confluence/display/MAVEN/DependencyResolutionException
[ERROR] 
[ERROR] After correcting the problems, you can resume the build with the command
[ERROR]   mvn <goals> -rf :deltaspike-scheduler-module-impl
[JENKINS] Archiving <https://builds.apache.org/job/DeltaSpike_Wildfly_9.0.2/ws/deltaspike/examples/jse-examples/pom.xml>
to org.apache.deltaspike.examples/deltaspike-jse-example/1.7.2-SNAPSHOT/deltaspike-jse-example-1.7.2-SNAPSHOT.pom
[JENKINS] Archiving <https://builds.apache.org/job/DeltaSpike_Wildfly_9.0.2/ws/deltaspike/examples/security-requested-page-after-login-cdi/pom.xml>
to org.apache.deltaspike.examples/deltaspike-security-requested-page-after-login-cdi/1.7.2-SNAPSHOT/deltaspike-security-requested-page-after-login-cdi-1.7.2-SNAPSHOT.pom
[JENKINS] Archiving <https://builds.apache.org/job/DeltaSpike_Wildfly_9.0.2/ws/deltaspike/test-utils/pom.xml>
to org.apache.deltaspike.test/test-utils/1.7.2-SNAPSHOT/test-utils-1.7.2-SNAPSHOT.pom
[JENKINS] Archiving <https://builds.apache.org/job/DeltaSpike_Wildfly_9.0.2/ws/deltaspike/test-utils/target/test-utils-1.7.2-SNAPSHOT.jar>
to org.apache.deltaspike.test/test-utils/1.7.2-SNAPSHOT/test-utils-1.7.2-SNAPSHOT.jar
[JENKINS] Archiving <https://builds.apache.org/job/DeltaSpike_Wildfly_9.0.2/ws/deltaspike/test-utils/target/test-utils-1.7.2-SNAPSHOT-sources.jar>
to org.apache.deltaspike.test/test-utils/1.7.2-SNAPSHOT/test-utils-1.7.2-SNAPSHOT-sources.jar
[JENKINS] Archiving <https://builds.apache.org/job/DeltaSpike_Wildfly_9.0.2/ws/documentation/pom.xml>
to org.apache.deltaspike/deltaspike-documentation/1.7.2-SNAPSHOT/deltaspike-documentation-1.7.2-SNAPSHOT.pom
[JENKINS] Archiving <https://builds.apache.org/job/DeltaSpike_Wildfly_9.0.2/ws/deltaspike/modules/data/impl/pom.xml>
to org.apache.deltaspike.modules/deltaspike-data-module-impl/1.7.2-SNAPSHOT/deltaspike-data-module-impl-1.7.2-SNAPSHOT.pom
[JENKINS] Archiving <https://builds.apache.org/job/DeltaSpike_Wildfly_9.0.2/ws/deltaspike/modules/data/impl/target/deltaspike-data-module-impl-1.7.2-SNAPSHOT.jar>
to org.apache.deltaspike.modules/deltaspike-data-module-impl/1.7.2-SNAPSHOT/deltaspike-data-module-impl-1.7.2-SNAPSHOT.jar
[JENKINS] Archiving <https://builds.apache.org/job/DeltaSpike_Wildfly_9.0.2/ws/deltaspike/modules/data/impl/target/deltaspike-data-module-impl-1.7.2-SNAPSHOT-tests.jar>
to org.apache.deltaspike.modules/deltaspike-data-module-impl/1.7.2-SNAPSHOT/deltaspike-data-module-impl-1.7.2-SNAPSHOT-tests.jar
[JENKINS] Archiving <https://builds.apache.org/job/DeltaSpike_Wildfly_9.0.2/ws/deltaspike/modules/data/impl/target/deltaspike-data-module-impl-1.7.2-SNAPSHOT-sources.jar>
to org.apache.deltaspike.modules/deltaspike-data-module-impl/1.7.2-SNAPSHOT/deltaspike-data-module-impl-1.7.2-SNAPSHOT-sources.jar
[JENKINS] Archiving <https://builds.apache.org/job/DeltaSpike_Wildfly_9.0.2/ws/deltaspike/modules/data/api/pom.xml>
to org.apache.deltaspike.modules/deltaspike-data-module-api/1.7.2-SNAPSHOT/deltaspike-data-module-api-1.7.2-SNAPSHOT.pom
[JENKINS] Archiving <https://builds.apache.org/job/DeltaSpike_Wildfly_9.0.2/ws/deltaspike/modules/data/api/target/deltaspike-data-module-api-1.7.2-SNAPSHOT.jar>
to org.apache.deltaspike.modules/deltaspike-data-module-api/1.7.2-SNAPSHOT/deltaspike-data-module-api-1.7.2-SNAPSHOT.jar
[JENKINS] Archiving <https://builds.apache.org/job/DeltaSpike_Wildfly_9.0.2/ws/deltaspike/modules/data/api/target/deltaspike-data-module-api-1.7.2-SNAPSHOT-tests.jar>
to org.apache.deltaspike.modules/deltaspike-data-module-api/1.7.2-SNAPSHOT/deltaspike-data-module-api-1.7.2-SNAPSHOT-tests.jar
[JENKINS] Archiving <https://builds.apache.org/job/DeltaSpike_Wildfly_9.0.2/ws/deltaspike/modules/data/api/target/deltaspike-data-module-api-1.7.2-SNAPSHOT-sources.jar>
to org.apache.deltaspike.modules/deltaspike-data-module-api/1.7.2-SNAPSHOT/deltaspike-data-module-api-1.7.2-SNAPSHOT-sources.jar
[JENKINS] Archiving <https://builds.apache.org/job/DeltaSpike_Wildfly_9.0.2/ws/deltaspike/core/impl/pom.xml>
to org.apache.deltaspike.core/deltaspike-core-impl/1.7.2-SNAPSHOT/deltaspike-core-impl-1.7.2-SNAPSHOT.pom
[JENKINS] Archiving <https://builds.apache.org/job/DeltaSpike_Wildfly_9.0.2/ws/deltaspike/core/impl/target/deltaspike-core-impl-1.7.2-SNAPSHOT.jar>
to org.apache.deltaspike.core/deltaspike-core-impl/1.7.2-SNAPSHOT/deltaspike-core-impl-1.7.2-SNAPSHOT.jar
[JENKINS] Archiving <https://builds.apache.org/job/DeltaSpike_Wildfly_9.0.2/ws/deltaspike/core/impl/target/deltaspike-core-impl-1.7.2-SNAPSHOT-tests.jar>
to org.apache.deltaspike.core/deltaspike-core-impl/1.7.2-SNAPSHOT/deltaspike-core-impl-1.7.2-SNAPSHOT-tests.jar
[JENKINS] Archiving <https://builds.apache.org/job/DeltaSpike_Wildfly_9.0.2/ws/deltaspike/core/impl/target/deltaspike-core-impl-1.7.2-SNAPSHOT-sources.jar>
to org.apache.deltaspike.core/deltaspike-core-impl/1.7.2-SNAPSHOT/deltaspike-core-impl-1.7.2-SNAPSHOT-sources.jar
[JENKINS] Archiving <https://builds.apache.org/job/DeltaSpike_Wildfly_9.0.2/ws/deltaspike/modules/pom.xml>
to org.apache.deltaspike.modules/modules-project/1.7.2-SNAPSHOT/modules-project-1.7.2-SNAPSHOT.pom
[JENKINS] Archiving <https://builds.apache.org/job/DeltaSpike_Wildfly_9.0.2/ws/deltaspike/modules/target/modules-project-1.7.2-SNAPSHOT-tests.jar>
to org.apache.deltaspike.modules/modules-project/1.7.2-SNAPSHOT/modules-project-1.7.2-SNAPSHOT-tests.jar
[JENKINS] Archiving <https://builds.apache.org/job/DeltaSpike_Wildfly_9.0.2/ws/deltaspike/modules/test-control/pom.xml>
to org.apache.deltaspike.modules/test-control-module-project/1.7.2-SNAPSHOT/test-control-module-project-1.7.2-SNAPSHOT.pom
[JENKINS] Archiving <https://builds.apache.org/job/DeltaSpike_Wildfly_9.0.2/ws/deltaspike/examples/jsf-examples/pom.xml>
to org.apache.deltaspike.examples/deltaspike-jsf-example/1.7.2-SNAPSHOT/deltaspike-jsf-example-1.7.2-SNAPSHOT.pom
[JENKINS] Archiving <https://builds.apache.org/job/DeltaSpike_Wildfly_9.0.2/ws/deltaspike/cdictrl/api/pom.xml>
to org.apache.deltaspike.cdictrl/deltaspike-cdictrl-api/1.7.2-SNAPSHOT/deltaspike-cdictrl-api-1.7.2-SNAPSHOT.pom
[JENKINS] Archiving <https://builds.apache.org/job/DeltaSpike_Wildfly_9.0.2/ws/deltaspike/cdictrl/api/target/deltaspike-cdictrl-api-1.7.2-SNAPSHOT.jar>
to org.apache.deltaspike.cdictrl/deltaspike-cdictrl-api/1.7.2-SNAPSHOT/deltaspike-cdictrl-api-1.7.2-SNAPSHOT.jar
[JENKINS] Archiving <https://builds.apache.org/job/DeltaSpike_Wildfly_9.0.2/ws/deltaspike/cdictrl/api/target/deltaspike-cdictrl-api-1.7.2-SNAPSHOT-tests.jar>
to org.apache.deltaspike.cdictrl/deltaspike-cdictrl-api/1.7.2-SNAPSHOT/deltaspike-cdictrl-api-1.7.2-SNAPSHOT-tests.jar
[JENKINS] Archiving <https://builds.apache.org/job/DeltaSpike_Wildfly_9.0.2/ws/deltaspike/cdictrl/api/target/deltaspike-cdictrl-api-1.7.2-SNAPSHOT-sources.jar>
to org.apache.deltaspike.cdictrl/deltaspike-cdictrl-api/1.7.2-SNAPSHOT/deltaspike-cdictrl-api-1.7.2-SNAPSHOT-sources.jar
[JENKINS] Archiving <https://builds.apache.org/job/DeltaSpike_Wildfly_9.0.2/ws/deltaspike/examples/scheduler-playground/pom.xml>
to org.apache.deltaspike.examples/deltaspike-scheduler-example/1.7.2-SNAPSHOT/deltaspike-scheduler-example-1.7.2-SNAPSHOT.pom
[JENKINS] Archiving <https://builds.apache.org/job/DeltaSpike_Wildfly_9.0.2/ws/deltaspike/checkstyle-rules/pom.xml>
to org.apache.deltaspike/checkstyle-rules/1.7.2-SNAPSHOT/checkstyle-rules-1.7.2-SNAPSHOT.pom
[JENKINS] Archiving <https://builds.apache.org/job/DeltaSpike_Wildfly_9.0.2/ws/deltaspike/checkstyle-rules/target/checkstyle-rules-1.7.2-SNAPSHOT.jar>
to org.apache.deltaspike/checkstyle-rules/1.7.2-SNAPSHOT/checkstyle-rules-1.7.2-SNAPSHOT.jar
[JENKINS] Archiving <https://builds.apache.org/job/DeltaSpike_Wildfly_9.0.2/ws/deltaspike/parent/code/pom.xml>
to org.apache.deltaspike/parent-code/1.7.2-SNAPSHOT/parent-code-1.7.2-SNAPSHOT.pom
[JENKINS] Archiving <https://builds.apache.org/job/DeltaSpike_Wildfly_9.0.2/ws/deltaspike/parent/code/target/parent-code-1.7.2-SNAPSHOT-tests.jar>
to org.apache.deltaspike/parent-code/1.7.2-SNAPSHOT/parent-code-1.7.2-SNAPSHOT-tests.jar
Compressed 97.32 KB of artifacts by 65.8% relative to #111
[JENKINS] Archiving <https://builds.apache.org/job/DeltaSpike_Wildfly_9.0.2/ws/deltaspike/modules/jsf/impl/pom.xml>
to org.apache.deltaspike.modules/deltaspike-jsf-module-impl/1.7.2-SNAPSHOT/deltaspike-jsf-module-impl-1.7.2-SNAPSHOT.pom
[JENKINS] Archiving <https://builds.apache.org/job/DeltaSpike_Wildfly_9.0.2/ws/deltaspike/modules/jsf/impl/target/deltaspike-jsf-module-impl-1.7.2-SNAPSHOT.jar>
to org.apache.deltaspike.modules/deltaspike-jsf-module-impl/1.7.2-SNAPSHOT/deltaspike-jsf-module-impl-1.7.2-SNAPSHOT.jar
[JENKINS] Archiving <https://builds.apache.org/job/DeltaSpike_Wildfly_9.0.2/ws/deltaspike/modules/jsf/impl/target/deltaspike-jsf-module-impl-1.7.2-SNAPSHOT-tests.jar>
to org.apache.deltaspike.modules/deltaspike-jsf-module-impl/1.7.2-SNAPSHOT/deltaspike-jsf-module-impl-1.7.2-SNAPSHOT-tests.jar
[JENKINS] Archiving <https://builds.apache.org/job/DeltaSpike_Wildfly_9.0.2/ws/deltaspike/modules/jsf/impl/target/deltaspike-jsf-module-impl-1.7.2-SNAPSHOT-sources.jar>
to org.apache.deltaspike.modules/deltaspike-jsf-module-impl/1.7.2-SNAPSHOT/deltaspike-jsf-module-impl-1.7.2-SNAPSHOT-sources.jar
[JENKINS] Archiving <https://builds.apache.org/job/DeltaSpike_Wildfly_9.0.2/ws/deltaspike/modules/partial-bean/pom.xml>
to org.apache.deltaspike.modules/partial-bean-module-project/1.7.2-SNAPSHOT/partial-bean-module-project-1.7.2-SNAPSHOT.pom
[JENKINS] Archiving <https://builds.apache.org/job/DeltaSpike_Wildfly_9.0.2/ws/deltaspike/modules/partial-bean/target/partial-bean-module-project-1.7.2-SNAPSHOT-tests.jar>
to org.apache.deltaspike.modules/partial-bean-module-project/1.7.2-SNAPSHOT/partial-bean-module-project-1.7.2-SNAPSHOT-tests.jar
[JENKINS] Archiving <https://builds.apache.org/job/DeltaSpike_Wildfly_9.0.2/ws/deltaspike/examples/pom.xml>
to org.apache.deltaspike.examples/examples-project/1.7.2-SNAPSHOT/examples-project-1.7.2-SNAPSHOT.pom
[JENKINS] Archiving <https://builds.apache.org/job/DeltaSpike_Wildfly_9.0.2/ws/deltaspike/modules/jsf/pom.xml>
to org.apache.deltaspike.modules/jsf-module-project/1.7.2-SNAPSHOT/jsf-module-project-1.7.2-SNAPSHOT.pom
[JENKINS] Archiving <https://builds.apache.org/job/DeltaSpike_Wildfly_9.0.2/ws/deltaspike/modules/jsf/target/jsf-module-project-1.7.2-SNAPSHOT-tests.jar>
to org.apache.deltaspike.modules/jsf-module-project/1.7.2-SNAPSHOT/jsf-module-project-1.7.2-SNAPSHOT-tests.jar
[JENKINS] Archiving <https://builds.apache.org/job/DeltaSpike_Wildfly_9.0.2/ws/deltaspike/modules/jsf/api/pom.xml>
to org.apache.deltaspike.modules/deltaspike-jsf-module-api/1.7.2-SNAPSHOT/deltaspike-jsf-module-api-1.7.2-SNAPSHOT.pom
[JENKINS] Archiving <https://builds.apache.org/job/DeltaSpike_Wildfly_9.0.2/ws/deltaspike/modules/jsf/api/target/deltaspike-jsf-module-api-1.7.2-SNAPSHOT.jar>
to org.apache.deltaspike.modules/deltaspike-jsf-module-api/1.7.2-SNAPSHOT/deltaspike-jsf-module-api-1.7.2-SNAPSHOT.jar
[JENKINS] Archiving <https://builds.apache.org/job/DeltaSpike_Wildfly_9.0.2/ws/deltaspike/modules/jsf/api/target/deltaspike-jsf-module-api-1.7.2-SNAPSHOT-tests.jar>
to org.apache.deltaspike.modules/deltaspike-jsf-module-api/1.7.2-SNAPSHOT/deltaspike-jsf-module-api-1.7.2-SNAPSHOT-tests.jar
[JENKINS] Archiving <https://builds.apache.org/job/DeltaSpike_Wildfly_9.0.2/ws/deltaspike/modules/jsf/api/target/deltaspike-jsf-module-api-1.7.2-SNAPSHOT-sources.jar>
to org.apache.deltaspike.modules/deltaspike-jsf-module-api/1.7.2-SNAPSHOT/deltaspike-jsf-module-api-1.7.2-SNAPSHOT-sources.jar
[JENKINS] Archiving <https://builds.apache.org/job/DeltaSpike_Wildfly_9.0.2/ws/deltaspike/modules/security/pom.xml>
to org.apache.deltaspike.modules/security-module-project/1.7.2-SNAPSHOT/security-module-project-1.7.2-SNAPSHOT.pom
[JENKINS] Archiving <https://builds.apache.org/job/DeltaSpike_Wildfly_9.0.2/ws/deltaspike/modules/security/target/security-module-project-1.7.2-SNAPSHOT-tests.jar>
to org.apache.deltaspike.modules/security-module-project/1.7.2-SNAPSHOT/security-module-project-1.7.2-SNAPSHOT-tests.jar
[JENKINS] Archiving <https://builds.apache.org/job/DeltaSpike_Wildfly_9.0.2/ws/deltaspike/modules/bean-validation/pom.xml>
to org.apache.deltaspike.modules/bean-validation-module-project/1.7.2-SNAPSHOT/bean-validation-module-project-1.7.2-SNAPSHOT.pom
[JENKINS] Archiving <https://builds.apache.org/job/DeltaSpike_Wildfly_9.0.2/ws/deltaspike/modules/bean-validation/target/bean-validation-module-project-1.7.2-SNAPSHOT-tests.jar>
to org.apache.deltaspike.modules/bean-validation-module-project/1.7.2-SNAPSHOT/bean-validation-module-project-1.7.2-SNAPSHOT-tests.jar
[JENKINS] Archiving <https://builds.apache.org/job/DeltaSpike_Wildfly_9.0.2/ws/deltaspike/modules/partial-bean/impl/pom.xml>
to org.apache.deltaspike.modules/deltaspike-partial-bean-module-impl/1.7.2-SNAPSHOT/deltaspike-partial-bean-module-impl-1.7.2-SNAPSHOT.pom
[JENKINS] Archiving <https://builds.apache.org/job/DeltaSpike_Wildfly_9.0.2/ws/deltaspike/modules/partial-bean/impl/target/deltaspike-partial-bean-module-impl-1.7.2-SNAPSHOT.jar>
to org.apache.deltaspike.modules/deltaspike-partial-bean-module-impl/1.7.2-SNAPSHOT/deltaspike-partial-bean-module-impl-1.7.2-SNAPSHOT.jar
[JENKINS] Archiving <https://builds.apache.org/job/DeltaSpike_Wildfly_9.0.2/ws/deltaspike/modules/partial-bean/impl/target/deltaspike-partial-bean-module-impl-1.7.2-SNAPSHOT-tests.jar>
to org.apache.deltaspike.modules/deltaspike-partial-bean-module-impl/1.7.2-SNAPSHOT/deltaspike-partial-bean-module-impl-1.7.2-SNAPSHOT-tests.jar
[JENKINS] Archiving <https://builds.apache.org/job/DeltaSpike_Wildfly_9.0.2/ws/deltaspike/modules/partial-bean/impl/target/deltaspike-partial-bean-module-impl-1.7.2-SNAPSHOT-sources.jar>
to org.apache.deltaspike.modules/deltaspike-partial-bean-module-impl/1.7.2-SNAPSHOT/deltaspike-partial-bean-module-impl-1.7.2-SNAPSHOT-sources.jar
[JENKINS] Archiving <https://builds.apache.org/job/DeltaSpike_Wildfly_9.0.2/ws/deltaspike/modules/proxy/api/pom.xml>
to org.apache.deltaspike.modules/deltaspike-proxy-module-api/1.7.2-SNAPSHOT/deltaspike-proxy-module-api-1.7.2-SNAPSHOT.pom
[JENKINS] Archiving <https://builds.apache.org/job/DeltaSpike_Wildfly_9.0.2/ws/deltaspike/modules/proxy/api/target/deltaspike-proxy-module-api-1.7.2-SNAPSHOT.jar>
to org.apache.deltaspike.modules/deltaspike-proxy-module-api/1.7.2-SNAPSHOT/deltaspike-proxy-module-api-1.7.2-SNAPSHOT.jar
[JENKINS] Archiving <https://builds.apache.org/job/DeltaSpike_Wildfly_9.0.2/ws/deltaspike/modules/proxy/api/target/deltaspike-proxy-module-api-1.7.2-SNAPSHOT-tests.jar>
to org.apache.deltaspike.modules/deltaspike-proxy-module-api/1.7.2-SNAPSHOT/deltaspike-proxy-module-api-1.7.2-SNAPSHOT-tests.jar
[JENKINS] Archiving <https://builds.apache.org/job/DeltaSpike_Wildfly_9.0.2/ws/deltaspike/modules/proxy/api/target/deltaspike-proxy-module-api-1.7.2-SNAPSHOT-sources.jar>
to org.apache.deltaspike.modules/deltaspike-proxy-module-api/1.7.2-SNAPSHOT/deltaspike-proxy-module-api-1.7.2-SNAPSHOT-sources.jar
[JENKINS] Archiving <https://builds.apache.org/job/DeltaSpike_Wildfly_9.0.2/ws/deltaspike/cdictrl/impl-weld/pom.xml>
to org.apache.deltaspike.cdictrl/deltaspike-cdictrl-weld/1.7.2-SNAPSHOT/deltaspike-cdictrl-weld-1.7.2-SNAPSHOT.pom
[JENKINS] Archiving <https://builds.apache.org/job/DeltaSpike_Wildfly_9.0.2/ws/deltaspike/cdictrl/impl-weld/target/deltaspike-cdictrl-weld-1.7.2-SNAPSHOT.jar>
to org.apache.deltaspike.cdictrl/deltaspike-cdictrl-weld/1.7.2-SNAPSHOT/deltaspike-cdictrl-weld-1.7.2-SNAPSHOT.jar
[JENKINS] Archiving <https://builds.apache.org/job/DeltaSpike_Wildfly_9.0.2/ws/deltaspike/cdictrl/impl-weld/target/deltaspike-cdictrl-weld-1.7.2-SNAPSHOT-tests.jar>
to org.apache.deltaspike.cdictrl/deltaspike-cdictrl-weld/1.7.2-SNAPSHOT/deltaspike-cdictrl-weld-1.7.2-SNAPSHOT-tests.jar
[JENKINS] Archiving <https://builds.apache.org/job/DeltaSpike_Wildfly_9.0.2/ws/deltaspike/cdictrl/impl-weld/target/deltaspike-cdictrl-weld-1.7.2-SNAPSHOT-sources.jar>
to org.apache.deltaspike.cdictrl/deltaspike-cdictrl-weld/1.7.2-SNAPSHOT/deltaspike-cdictrl-weld-1.7.2-SNAPSHOT-sources.jar
[JENKINS] Archiving <https://builds.apache.org/job/DeltaSpike_Wildfly_9.0.2/ws/deltaspike/modules/jpa/api/pom.xml>
to org.apache.deltaspike.modules/deltaspike-jpa-module-api/1.7.2-SNAPSHOT/deltaspike-jpa-module-api-1.7.2-SNAPSHOT.pom
[JENKINS] Archiving <https://builds.apache.org/job/DeltaSpike_Wildfly_9.0.2/ws/deltaspike/modules/jpa/api/target/deltaspike-jpa-module-api-1.7.2-SNAPSHOT.jar>
to org.apache.deltaspike.modules/deltaspike-jpa-module-api/1.7.2-SNAPSHOT/deltaspike-jpa-module-api-1.7.2-SNAPSHOT.jar
[JENKINS] Archiving <https://builds.apache.org/job/DeltaSpike_Wildfly_9.0.2/ws/deltaspike/modules/jpa/api/target/deltaspike-jpa-module-api-1.7.2-SNAPSHOT-tests.jar>
to org.apache.deltaspike.modules/deltaspike-jpa-module-api/1.7.2-SNAPSHOT/deltaspike-jpa-module-api-1.7.2-SNAPSHOT-tests.jar
[JENKINS] Archiving <https://builds.apache.org/job/DeltaSpike_Wildfly_9.0.2/ws/deltaspike/modules/jpa/api/target/deltaspike-jpa-module-api-1.7.2-SNAPSHOT-sources.jar>
to org.apache.deltaspike.modules/deltaspike-jpa-module-api/1.7.2-SNAPSHOT/deltaspike-jpa-module-api-1.7.2-SNAPSHOT-sources.jar
[JENKINS] Archiving <https://builds.apache.org/job/DeltaSpike_Wildfly_9.0.2/ws/deltaspike/modules/servlet/api/pom.xml>
to org.apache.deltaspike.modules/deltaspike-servlet-module-api/1.7.2-SNAPSHOT/deltaspike-servlet-module-api-1.7.2-SNAPSHOT.pom
[JENKINS] Archiving <https://builds.apache.org/job/DeltaSpike_Wildfly_9.0.2/ws/deltaspike/modules/servlet/api/target/deltaspike-servlet-module-api-1.7.2-SNAPSHOT.jar>
to org.apache.deltaspike.modules/deltaspike-servlet-module-api/1.7.2-SNAPSHOT/deltaspike-servlet-module-api-1.7.2-SNAPSHOT.jar
[JENKINS] Archiving <https://builds.apache.org/job/DeltaSpike_Wildfly_9.0.2/ws/deltaspike/modules/servlet/api/target/deltaspike-servlet-module-api-1.7.2-SNAPSHOT-tests.jar>
to org.apache.deltaspike.modules/deltaspike-servlet-module-api/1.7.2-SNAPSHOT/deltaspike-servlet-module-api-1.7.2-SNAPSHOT-tests.jar
[JENKINS] Archiving <https://builds.apache.org/job/DeltaSpike_Wildfly_9.0.2/ws/deltaspike/modules/servlet/api/target/deltaspike-servlet-module-api-1.7.2-SNAPSHOT-sources.jar>
to org.apache.deltaspike.modules/deltaspike-servlet-module-api/1.7.2-SNAPSHOT/deltaspike-servlet-module-api-1.7.2-SNAPSHOT-sources.jar
[JENKINS] Archiving <https://builds.apache.org/job/DeltaSpike_Wildfly_9.0.2/ws/deltaspike/modules/jpa/pom.xml>
to org.apache.deltaspike.modules/jpa-module-project/1.7.2-SNAPSHOT/jpa-module-project-1.7.2-SNAPSHOT.pom
[JENKINS] Archiving <https://builds.apache.org/job/DeltaSpike_Wildfly_9.0.2/ws/deltaspike/modules/jpa/target/jpa-module-project-1.7.2-SNAPSHOT-tests.jar>
to org.apache.deltaspike.modules/jpa-module-project/1.7.2-SNAPSHOT/jpa-module-project-1.7.2-SNAPSHOT-tests.jar
[JENKINS] Archiving <https://builds.apache.org/job/DeltaSpike_Wildfly_9.0.2/ws/deltaspike/cdictrl/pom.xml>
to org.apache.deltaspike.cdictrl/cdictrl-project/1.7.2-SNAPSHOT/cdictrl-project-1.7.2-SNAPSHOT.pom
[JENKINS] Archiving <https://builds.apache.org/job/DeltaSpike_Wildfly_9.0.2/ws/deltaspike/cdictrl/target/cdictrl-project-1.7.2-SNAPSHOT-tests.jar>
to org.apache.deltaspike.cdictrl/cdictrl-project/1.7.2-SNAPSHOT/cdictrl-project-1.7.2-SNAPSHOT-tests.jar
[JENKINS] Archiving <https://builds.apache.org/job/DeltaSpike_Wildfly_9.0.2/ws/deltaspike/modules/scheduler/api/pom.xml>
to org.apache.deltaspike.modules/deltaspike-scheduler-module-api/1.7.2-SNAPSHOT/deltaspike-scheduler-module-api-1.7.2-SNAPSHOT.pom
[JENKINS] Archiving <https://builds.apache.org/job/DeltaSpike_Wildfly_9.0.2/ws/deltaspike/modules/scheduler/api/target/deltaspike-scheduler-module-api-1.7.2-SNAPSHOT.jar>
to org.apache.deltaspike.modules/deltaspike-scheduler-module-api/1.7.2-SNAPSHOT/deltaspike-scheduler-module-api-1.7.2-SNAPSHOT.jar
[JENKINS] Archiving <https://builds.apache.org/job/DeltaSpike_Wildfly_9.0.2/ws/deltaspike/modules/scheduler/api/target/deltaspike-scheduler-module-api-1.7.2-SNAPSHOT-tests.jar>
to org.apache.deltaspike.modules/deltaspike-scheduler-module-api/1.7.2-SNAPSHOT/deltaspike-scheduler-module-api-1.7.2-SNAPSHOT-tests.jar
[JENKINS] Archiving <https://builds.apache.org/job/DeltaSpike_Wildfly_9.0.2/ws/deltaspike/modules/scheduler/api/target/deltaspike-scheduler-module-api-1.7.2-SNAPSHOT-sources.jar>
to org.apache.deltaspike.modules/deltaspike-scheduler-module-api/1.7.2-SNAPSHOT/deltaspike-scheduler-module-api-1.7.2-SNAPSHOT-sources.jar
[JENKINS] Archiving <https://builds.apache.org/job/DeltaSpike_Wildfly_9.0.2/ws/deltaspike/modules/test-control/impl/pom.xml>
to org.apache.deltaspike.modules/deltaspike-test-control-module-impl/1.7.2-SNAPSHOT/deltaspike-test-control-module-impl-1.7.2-SNAPSHOT.pom
[JENKINS] Archiving <https://builds.apache.org/job/DeltaSpike_Wildfly_9.0.2/ws/deltaspike/modules/servlet/pom.xml>
to org.apache.deltaspike.modules/servlet-module-project/1.7.2-SNAPSHOT/servlet-module-project-1.7.2-SNAPSHOT.pom
[JENKINS] Archiving <https://builds.apache.org/job/DeltaSpike_Wildfly_9.0.2/ws/deltaspike/modules/servlet/target/servlet-module-project-1.7.2-SNAPSHOT-tests.jar>
to org.apache.deltaspike.modules/servlet-module-project/1.7.2-SNAPSHOT/servlet-module-project-1.7.2-SNAPSHOT-tests.jar
[JENKINS] Archiving <https://builds.apache.org/job/DeltaSpike_Wildfly_9.0.2/ws/deltaspike/modules/test-control/api/pom.xml>
to org.apache.deltaspike.modules/deltaspike-test-control-module-api/1.7.2-SNAPSHOT/deltaspike-test-control-module-api-1.7.2-SNAPSHOT.pom
[JENKINS] Archiving <https://builds.apache.org/job/DeltaSpike_Wildfly_9.0.2/ws/deltaspike/modules/jsf/impl-ee6/pom.xml>
to org.apache.deltaspike.modules/deltaspike-jsf-module-impl-ee6/1.7.2-SNAPSHOT/deltaspike-jsf-module-impl-ee6-1.7.2-SNAPSHOT.pom
[JENKINS] Archiving <https://builds.apache.org/job/DeltaSpike_Wildfly_9.0.2/ws/deltaspike/modules/jsf/impl-ee6/target/deltaspike-jsf-module-impl-ee6-1.7.2-SNAPSHOT.jar>
to org.apache.deltaspike.modules/deltaspike-jsf-module-impl-ee6/1.7.2-SNAPSHOT/deltaspike-jsf-module-impl-ee6-1.7.2-SNAPSHOT.jar
[JENKINS] Archiving <https://builds.apache.org/job/DeltaSpike_Wildfly_9.0.2/ws/deltaspike/modules/jsf/impl-ee6/target/deltaspike-jsf-module-impl-ee6-1.7.2-SNAPSHOT-tests.jar>
to org.apache.deltaspike.modules/deltaspike-jsf-module-impl-ee6/1.7.2-SNAPSHOT/deltaspike-jsf-module-impl-ee6-1.7.2-SNAPSHOT-tests.jar
[JENKINS] Archiving <https://builds.apache.org/job/DeltaSpike_Wildfly_9.0.2/ws/deltaspike/modules/jsf/impl-ee6/target/deltaspike-jsf-module-impl-ee6-1.7.2-SNAPSHOT-sources.jar>
to org.apache.deltaspike.modules/deltaspike-jsf-module-impl-ee6/1.7.2-SNAPSHOT/deltaspike-jsf-module-impl-ee6-1.7.2-SNAPSHOT-sources.jar
[JENKINS] Archiving <https://builds.apache.org/job/DeltaSpike_Wildfly_9.0.2/ws/deltaspike/modules/proxy/pom.xml>
to org.apache.deltaspike.modules/proxy-module-project/1.7.2-SNAPSHOT/proxy-module-project-1.7.2-SNAPSHOT.pom
[JENKINS] Archiving <https://builds.apache.org/job/DeltaSpike_Wildfly_9.0.2/ws/deltaspike/modules/proxy/target/proxy-module-project-1.7.2-SNAPSHOT-tests.jar>
to org.apache.deltaspike.modules/proxy-module-project/1.7.2-SNAPSHOT/proxy-module-project-1.7.2-SNAPSHOT-tests.jar
[JENKINS] Archiving <https://builds.apache.org/job/DeltaSpike_Wildfly_9.0.2/ws/deltaspike/modules/partial-bean/api/pom.xml>
to org.apache.deltaspike.modules/deltaspike-partial-bean-module-api/1.7.2-SNAPSHOT/deltaspike-partial-bean-module-api-1.7.2-SNAPSHOT.pom
[JENKINS] Archiving <https://builds.apache.org/job/DeltaSpike_Wildfly_9.0.2/ws/deltaspike/modules/partial-bean/api/target/deltaspike-partial-bean-module-api-1.7.2-SNAPSHOT.jar>
to org.apache.deltaspike.modules/deltaspike-partial-bean-module-api/1.7.2-SNAPSHOT/deltaspike-partial-bean-module-api-1.7.2-SNAPSHOT.jar
[JENKINS] Archiving <https://builds.apache.org/job/DeltaSpike_Wildfly_9.0.2/ws/deltaspike/modules/partial-bean/api/target/deltaspike-partial-bean-module-api-1.7.2-SNAPSHOT-tests.jar>
to org.apache.deltaspike.modules/deltaspike-partial-bean-module-api/1.7.2-SNAPSHOT/deltaspike-partial-bean-module-api-1.7.2-SNAPSHOT-tests.jar
[JENKINS] Archiving <https://builds.apache.org/job/DeltaSpike_Wildfly_9.0.2/ws/deltaspike/modules/partial-bean/api/target/deltaspike-partial-bean-module-api-1.7.2-SNAPSHOT-sources.jar>
to org.apache.deltaspike.modules/deltaspike-partial-bean-module-api/1.7.2-SNAPSHOT/deltaspike-partial-bean-module-api-1.7.2-SNAPSHOT-sources.jar
[JENKINS] Archiving <https://builds.apache.org/job/DeltaSpike_Wildfly_9.0.2/ws/deltaspike/modules/scheduler/impl/pom.xml>
to org.apache.deltaspike.modules/deltaspike-scheduler-module-impl/1.7.2-SNAPSHOT/deltaspike-scheduler-module-impl-1.7.2-SNAPSHOT.pom
[JENKINS] Archiving <https://builds.apache.org/job/DeltaSpike_Wildfly_9.0.2/ws/deltaspike/parent/pom.xml>
to org.apache.deltaspike/parent/1.7.2-SNAPSHOT/parent-1.7.2-SNAPSHOT.pom
[JENKINS] Archiving <https://builds.apache.org/job/DeltaSpike_Wildfly_9.0.2/ws/deltaspike/core/pom.xml>
to org.apache.deltaspike.core/core-project/1.7.2-SNAPSHOT/core-project-1.7.2-SNAPSHOT.pom
[JENKINS] Archiving <https://builds.apache.org/job/DeltaSpike_Wildfly_9.0.2/ws/deltaspike/core/target/core-project-1.7.2-SNAPSHOT-tests.jar>
to org.apache.deltaspike.core/core-project/1.7.2-SNAPSHOT/core-project-1.7.2-SNAPSHOT-tests.jar
[JENKINS] Archiving <https://builds.apache.org/job/DeltaSpike_Wildfly_9.0.2/ws/deltaspike/modules/bean-validation/api/pom.xml>
to org.apache.deltaspike.modules/deltaspike-bean-validation-module-api/1.7.2-SNAPSHOT/deltaspike-bean-validation-module-api-1.7.2-SNAPSHOT.pom
[JENKINS] Archiving <https://builds.apache.org/job/DeltaSpike_Wildfly_9.0.2/ws/deltaspike/modules/bean-validation/api/target/deltaspike-bean-validation-module-api-1.7.2-SNAPSHOT.jar>
to org.apache.deltaspike.modules/deltaspike-bean-validation-module-api/1.7.2-SNAPSHOT/deltaspike-bean-validation-module-api-1.7.2-SNAPSHOT.jar
[JENKINS] Archiving <https://builds.apache.org/job/DeltaSpike_Wildfly_9.0.2/ws/deltaspike/modules/bean-validation/api/target/deltaspike-bean-validation-module-api-1.7.2-SNAPSHOT-tests.jar>
to org.apache.deltaspike.modules/deltaspike-bean-validation-module-api/1.7.2-SNAPSHOT/deltaspike-bean-validation-module-api-1.7.2-SNAPSHOT-tests.jar
[JENKINS] Archiving <https://builds.apache.org/job/DeltaSpike_Wildfly_9.0.2/ws/deltaspike/modules/bean-validation/api/target/deltaspike-bean-validation-module-api-1.7.2-SNAPSHOT-sources.jar>
to org.apache.deltaspike.modules/deltaspike-bean-validation-module-api/1.7.2-SNAPSHOT/deltaspike-bean-validation-module-api-1.7.2-SNAPSHOT-sources.jar
[JENKINS] Archiving <https://builds.apache.org/job/DeltaSpike_Wildfly_9.0.2/ws/deltaspike/core/api/pom.xml>
to org.apache.deltaspike.core/deltaspike-core-api/1.7.2-SNAPSHOT/deltaspike-core-api-1.7.2-SNAPSHOT.pom
[JENKINS] Archiving <https://builds.apache.org/job/DeltaSpike_Wildfly_9.0.2/ws/deltaspike/core/api/target/deltaspike-core-api-1.7.2-SNAPSHOT.jar>
to org.apache.deltaspike.core/deltaspike-core-api/1.7.2-SNAPSHOT/deltaspike-core-api-1.7.2-SNAPSHOT.jar
[JENKINS] Archiving <https://builds.apache.org/job/DeltaSpike_Wildfly_9.0.2/ws/deltaspike/core/api/target/deltaspike-core-api-1.7.2-SNAPSHOT-tests.jar>
to org.apache.deltaspike.core/deltaspike-core-api/1.7.2-SNAPSHOT/deltaspike-core-api-1.7.2-SNAPSHOT-tests.jar
[JENKINS] Archiving <https://builds.apache.org/job/DeltaSpike_Wildfly_9.0.2/ws/deltaspike/core/api/target/deltaspike-core-api-1.7.2-SNAPSHOT-sources.jar>
to org.apache.deltaspike.core/deltaspike-core-api/1.7.2-SNAPSHOT/deltaspike-core-api-1.7.2-SNAPSHOT-sources.jar
[JENKINS] Archiving <https://builds.apache.org/job/DeltaSpike_Wildfly_9.0.2/ws/deltaspike/modules/security/impl/pom.xml>
to org.apache.deltaspike.modules/deltaspike-security-module-impl/1.7.2-SNAPSHOT/deltaspike-security-module-impl-1.7.2-SNAPSHOT.pom
[JENKINS] Archiving <https://builds.apache.org/job/DeltaSpike_Wildfly_9.0.2/ws/deltaspike/modules/security/impl/target/deltaspike-security-module-impl-1.7.2-SNAPSHOT.jar>
to org.apache.deltaspike.modules/deltaspike-security-module-impl/1.7.2-SNAPSHOT/deltaspike-security-module-impl-1.7.2-SNAPSHOT.jar
[JENKINS] Archiving <https://builds.apache.org/job/DeltaSpike_Wildfly_9.0.2/ws/deltaspike/modules/security/impl/target/deltaspike-security-module-impl-1.7.2-SNAPSHOT-tests.jar>
to org.apache.deltaspike.modules/deltaspike-security-module-impl/1.7.2-SNAPSHOT/deltaspike-security-module-impl-1.7.2-SNAPSHOT-tests.jar
[JENKINS] Archiving <https://builds.apache.org/job/DeltaSpike_Wildfly_9.0.2/ws/deltaspike/modules/security/impl/target/deltaspike-security-module-impl-1.7.2-SNAPSHOT-sources.jar>
to org.apache.deltaspike.modules/deltaspike-security-module-impl/1.7.2-SNAPSHOT/deltaspike-security-module-impl-1.7.2-SNAPSHOT-sources.jar
[JENKINS] Archiving <https://builds.apache.org/job/DeltaSpike_Wildfly_9.0.2/ws/deltaspike/modules/scheduler/pom.xml>
to org.apache.deltaspike.modules/scheduler-module-project/1.7.2-SNAPSHOT/scheduler-module-project-1.7.2-SNAPSHOT.pom
[JENKINS] Archiving <https://builds.apache.org/job/DeltaSpike_Wildfly_9.0.2/ws/deltaspike/modules/scheduler/target/scheduler-module-project-1.7.2-SNAPSHOT-tests.jar>
to org.apache.deltaspike.modules/scheduler-module-project/1.7.2-SNAPSHOT/scheduler-module-project-1.7.2-SNAPSHOT-tests.jar
[JENKINS] Archiving <https://builds.apache.org/job/DeltaSpike_Wildfly_9.0.2/ws/site/pom.xml>
to org.apache.deltaspike/deltaspike-site/1.7.2-SNAPSHOT/deltaspike-site-1.7.2-SNAPSHOT.pom
[JENKINS] Archiving <https://builds.apache.org/job/DeltaSpike_Wildfly_9.0.2/ws/deltaspike/modules/proxy/impl-asm5/pom.xml>
to org.apache.deltaspike.modules/deltaspike-proxy-module-impl-asm5/1.7.2-SNAPSHOT/deltaspike-proxy-module-impl-asm5-1.7.2-SNAPSHOT.pom
[JENKINS] Archiving <https://builds.apache.org/job/DeltaSpike_Wildfly_9.0.2/ws/deltaspike/modules/proxy/impl-asm5/target/deltaspike-proxy-module-impl-asm5-1.7.2-SNAPSHOT.jar>
to org.apache.deltaspike.modules/deltaspike-proxy-module-impl-asm5/1.7.2-SNAPSHOT/deltaspike-proxy-module-impl-asm5-1.7.2-SNAPSHOT.jar
[JENKINS] Archiving <https://builds.apache.org/job/DeltaSpike_Wildfly_9.0.2/ws/deltaspike/modules/proxy/impl-asm5/target/deltaspike-proxy-module-impl-asm5-1.7.2-SNAPSHOT-tests.jar>
to org.apache.deltaspike.modules/deltaspike-proxy-module-impl-asm5/1.7.2-SNAPSHOT/deltaspike-proxy-module-impl-asm5-1.7.2-SNAPSHOT-tests.jar
[JENKINS] Archiving <https://builds.apache.org/job/DeltaSpike_Wildfly_9.0.2/ws/deltaspike/modules/proxy/impl-asm5/target/deltaspike-proxy-module-impl-asm5-1.7.2-SNAPSHOT-sources.jar>
to org.apache.deltaspike.modules/deltaspike-proxy-module-impl-asm5/1.7.2-SNAPSHOT/deltaspike-proxy-module-impl-asm5-1.7.2-SNAPSHOT-sources.jar
[JENKINS] Archiving <https://builds.apache.org/job/DeltaSpike_Wildfly_9.0.2/ws/deltaspike/examples/jsf-playground/pom.xml>
to org.apache.deltaspike.examples/deltaspike-jsf-playground/1.7.2-SNAPSHOT/deltaspike-jsf-playground-1.7.2-SNAPSHOT.pom
[JENKINS] Archiving <https://builds.apache.org/job/DeltaSpike_Wildfly_9.0.2/ws/deltaspike/modules/servlet/impl/pom.xml>
to org.apache.deltaspike.modules/deltaspike-servlet-module-impl/1.7.2-SNAPSHOT/deltaspike-servlet-module-impl-1.7.2-SNAPSHOT.pom
[JENKINS] Archiving <https://builds.apache.org/job/DeltaSpike_Wildfly_9.0.2/ws/deltaspike/modules/servlet/impl/target/deltaspike-servlet-module-impl-1.7.2-SNAPSHOT.jar>
to org.apache.deltaspike.modules/deltaspike-servlet-module-impl/1.7.2-SNAPSHOT/deltaspike-servlet-module-impl-1.7.2-SNAPSHOT.jar
[JENKINS] Archiving <https://builds.apache.org/job/DeltaSpike_Wildfly_9.0.2/ws/deltaspike/modules/servlet/impl/target/deltaspike-servlet-module-impl-1.7.2-SNAPSHOT-tests.jar>
to org.apache.deltaspike.modules/deltaspike-servlet-module-impl/1.7.2-SNAPSHOT/deltaspike-servlet-module-impl-1.7.2-SNAPSHOT-tests.jar
[JENKINS] Archiving <https://builds.apache.org/job/DeltaSpike_Wildfly_9.0.2/ws/deltaspike/modules/servlet/impl/target/deltaspike-servlet-module-impl-1.7.2-SNAPSHOT-sources.jar>
to org.apache.deltaspike.modules/deltaspike-servlet-module-impl/1.7.2-SNAPSHOT/deltaspike-servlet-module-impl-1.7.2-SNAPSHOT-sources.jar
[JENKINS] Archiving <https://builds.apache.org/job/DeltaSpike_Wildfly_9.0.2/ws/deltaspike/modules/bean-validation/impl/pom.xml>
to org.apache.deltaspike.modules/deltaspike-bean-validation-module-impl/1.7.2-SNAPSHOT/deltaspike-bean-validation-module-impl-1.7.2-SNAPSHOT.pom
[JENKINS] Archiving <https://builds.apache.org/job/DeltaSpike_Wildfly_9.0.2/ws/deltaspike/modules/bean-validation/impl/target/deltaspike-bean-validation-module-impl-1.7.2-SNAPSHOT.jar>
to org.apache.deltaspike.modules/deltaspike-bean-validation-module-impl/1.7.2-SNAPSHOT/deltaspike-bean-validation-module-impl-1.7.2-SNAPSHOT.jar
[JENKINS] Archiving <https://builds.apache.org/job/DeltaSpike_Wildfly_9.0.2/ws/deltaspike/modules/bean-validation/impl/target/deltaspike-bean-validation-module-impl-1.7.2-SNAPSHOT-tests.jar>
to org.apache.deltaspike.modules/deltaspike-bean-validation-module-impl/1.7.2-SNAPSHOT/deltaspike-bean-validation-module-impl-1.7.2-SNAPSHOT-tests.jar
[JENKINS] Archiving <https://builds.apache.org/job/DeltaSpike_Wildfly_9.0.2/ws/deltaspike/modules/bean-validation/impl/target/deltaspike-bean-validation-module-impl-1.7.2-SNAPSHOT-sources.jar>
to org.apache.deltaspike.modules/deltaspike-bean-validation-module-impl/1.7.2-SNAPSHOT/deltaspike-bean-validation-module-impl-1.7.2-SNAPSHOT-sources.jar
[JENKINS] Archiving <https://builds.apache.org/job/DeltaSpike_Wildfly_9.0.2/ws/pom.xml>
to org.apache.deltaspike/deltaspike/1.7.2-SNAPSHOT/deltaspike-1.7.2-SNAPSHOT.pom
[JENKINS] Archiving <https://builds.apache.org/job/DeltaSpike_Wildfly_9.0.2/ws/deltaspike/modules/jpa/impl/pom.xml>
to org.apache.deltaspike.modules/deltaspike-jpa-module-impl/1.7.2-SNAPSHOT/deltaspike-jpa-module-impl-1.7.2-SNAPSHOT.pom
[JENKINS] Archiving <https://builds.apache.org/job/DeltaSpike_Wildfly_9.0.2/ws/deltaspike/modules/jpa/impl/target/deltaspike-jpa-module-impl-1.7.2-SNAPSHOT.jar>
to org.apache.deltaspike.modules/deltaspike-jpa-module-impl/1.7.2-SNAPSHOT/deltaspike-jpa-module-impl-1.7.2-SNAPSHOT.jar
[JENKINS] Archiving <https://builds.apache.org/job/DeltaSpike_Wildfly_9.0.2/ws/deltaspike/modules/jpa/impl/target/deltaspike-jpa-module-impl-1.7.2-SNAPSHOT-tests.jar>
to org.apache.deltaspike.modules/deltaspike-jpa-module-impl/1.7.2-SNAPSHOT/deltaspike-jpa-module-impl-1.7.2-SNAPSHOT-tests.jar
[JENKINS] Archiving <https://builds.apache.org/job/DeltaSpike_Wildfly_9.0.2/ws/deltaspike/modules/jpa/impl/target/deltaspike-jpa-module-impl-1.7.2-SNAPSHOT-sources.jar>
to org.apache.deltaspike.modules/deltaspike-jpa-module-impl/1.7.2-SNAPSHOT/deltaspike-jpa-module-impl-1.7.2-SNAPSHOT-sources.jar
[JENKINS] Archiving <https://builds.apache.org/job/DeltaSpike_Wildfly_9.0.2/ws/deltaspike/modules/data/pom.xml>
to org.apache.deltaspike.modules/data-module-project/1.7.2-SNAPSHOT/data-module-project-1.7.2-SNAPSHOT.pom
[JENKINS] Archiving <https://builds.apache.org/job/DeltaSpike_Wildfly_9.0.2/ws/deltaspike/modules/data/target/data-module-project-1.7.2-SNAPSHOT-tests.jar>
to org.apache.deltaspike.modules/data-module-project/1.7.2-SNAPSHOT/data-module-project-1.7.2-SNAPSHOT-tests.jar
[JENKINS] Archiving <https://builds.apache.org/job/DeltaSpike_Wildfly_9.0.2/ws/deltaspike/examples/security-requested-page-after-login-picketlink/pom.xml>
to org.apache.deltaspike.examples/deltaspike-security-requested-page-after-login-picketlink/1.7.2-SNAPSHOT/deltaspike-security-requested-page-after-login-picketlink-1.7.2-SNAPSHOT.pom
[JENKINS] Archiving <https://builds.apache.org/job/DeltaSpike_Wildfly_9.0.2/ws/deltaspike/pom.xml>
to org.apache.deltaspike/deltaspike-project/1.7.2-SNAPSHOT/deltaspike-project-1.7.2-SNAPSHOT.pom
[JENKINS] Archiving <https://builds.apache.org/job/DeltaSpike_Wildfly_9.0.2/ws/deltaspike/modules/security/api/pom.xml>
to org.apache.deltaspike.modules/deltaspike-security-module-api/1.7.2-SNAPSHOT/deltaspike-security-module-api-1.7.2-SNAPSHOT.pom
[JENKINS] Archiving <https://builds.apache.org/job/DeltaSpike_Wildfly_9.0.2/ws/deltaspike/modules/security/api/target/deltaspike-security-module-api-1.7.2-SNAPSHOT.jar>
to org.apache.deltaspike.modules/deltaspike-security-module-api/1.7.2-SNAPSHOT/deltaspike-security-module-api-1.7.2-SNAPSHOT.jar
[JENKINS] Archiving <https://builds.apache.org/job/DeltaSpike_Wildfly_9.0.2/ws/deltaspike/modules/security/api/target/deltaspike-security-module-api-1.7.2-SNAPSHOT-tests.jar>
to org.apache.deltaspike.modules/deltaspike-security-module-api/1.7.2-SNAPSHOT/deltaspike-security-module-api-1.7.2-SNAPSHOT-tests.jar
[JENKINS] Archiving <https://builds.apache.org/job/DeltaSpike_Wildfly_9.0.2/ws/deltaspike/modules/security/api/target/deltaspike-security-module-api-1.7.2-SNAPSHOT-sources.jar>
to org.apache.deltaspike.modules/deltaspike-security-module-api/1.7.2-SNAPSHOT/deltaspike-security-module-api-1.7.2-SNAPSHOT-sources.jar
channel stopped

Mime
View raw message