deltaspike-commits mailing list archives

Site index · List index
Message view « Date » · « Thread »
Top « Date » · « Thread »
From Apache Jenkins Server <jenk...@builds.apache.org>
Subject Build failed in Jenkins: DeltaSpike Weld 2.0.0 #670
Date Fri, 15 Jul 2016 04:09:39 GMT
See <https://builds.apache.org/job/DeltaSpike%20Weld%202.0.0/670/changes>

Changes:

[johndament] DELTASPIKE-1181 Added a profile for payara in cdictrl

[johndament] DELTASPIKE-1181 Fixes for payara-build-managed-4 profile

[johndament] DELTASPIKE-645 squid:S2583 - Conditions should not unconditionally

[johndament] DELTASPIKE-645 squid:S2131 - Primitives should not be boxed just for

[johndament] DELTASPIKE-645 squid:S1155 - Collection.isEmpty() should be used to test

[johndament] DELTASPIKE-1060 Reactivate the EE 7 tests for Wildfly 10 only, disabling

[johndament] DELTASPIKE-1167 Patch from Valentin Maechler to add support for variable

[johndament] DELTASPIKE-1183 Fix concurrency issue when using proxies.

[johndament] DELTASPIKE-1184 Added Release Notes for 1.7.1

------------------------------------------
Started by upstream project "DeltaSpike for CDI 1.1 and 1.2" build number 28
originally caused by:
 Started by an SCM change
[EnvInject] - Loading node environment variables.
Building remotely on ubuntu-us1 (Ubuntu ubuntu ubuntu-us golang-ppa) in workspace <https://builds.apache.org/job/DeltaSpike%20Weld%202.0.0/ws/>
Cloning the remote Git repository
Cloning repository https://git-wip-us.apache.org/repos/asf/deltaspike.git
 > git init <https://builds.apache.org/job/DeltaSpike%20Weld%202.0.0/ws/> # timeout=10
Fetching upstream changes from https://git-wip-us.apache.org/repos/asf/deltaspike.git
 > git --version # timeout=10
 > git -c core.askpass=true fetch --tags --progress https://git-wip-us.apache.org/repos/asf/deltaspike.git
+refs/heads/*:refs/remotes/origin/*
 > git config remote.origin.url https://git-wip-us.apache.org/repos/asf/deltaspike.git
# timeout=10
 > git config --add remote.origin.fetch +refs/heads/*:refs/remotes/origin/* # timeout=10
 > git config remote.origin.url https://git-wip-us.apache.org/repos/asf/deltaspike.git
# timeout=10
Fetching upstream changes from https://git-wip-us.apache.org/repos/asf/deltaspike.git
 > git -c core.askpass=true fetch --tags --progress https://git-wip-us.apache.org/repos/asf/deltaspike.git
+refs/heads/*:refs/remotes/origin/*
 > git rev-parse origin/master^{commit} # timeout=10
Checking out Revision af0c7faa092de7ba192a7d9a00085c577c97247f (origin/master)
 > git config core.sparsecheckout # timeout=10
 > git checkout -f af0c7faa092de7ba192a7d9a00085c577c97247f
 > git rev-list db211f60c0fd5c610818c25a3cf99df30ae9ce95 # timeout=10
Parsing POMs
Modules changed, recalculating dependency graph
Established TCP socket on 40319
maven3-agent.jar already up to date
maven3-interceptor.jar already up to date
maven3-interceptor-commons.jar already up to date
[DeltaSpike Weld 2.0.0] $ /home/jenkins/jenkins-slave/tools/hudson.model.JDK/JDK_1.7_latest_/bin/java
-Xmx2g -Xms256m -XX:MaxPermSize=512m -cp /home/jenkins/jenkins-slave/maven3-agent.jar:/home/jenkins/tools/maven/apache-maven-3.0.4/boot/plexus-classworlds-2.4.jar
org.jvnet.hudson.maven3.agent.Maven3Main /home/jenkins/tools/maven/apache-maven-3.0.4 /home/jenkins/jenkins-slave/slave.jar
/home/jenkins/jenkins-slave/maven3-interceptor.jar /home/jenkins/jenkins-slave/maven3-interceptor-commons.jar
40319
<===[JENKINS REMOTING CAPACITY]===>   channel started
Executing Maven:  -B -f <https://builds.apache.org/job/DeltaSpike%20Weld%202.0.0/ws/pom.xml>
-Dmaven.repo.local=/home/jenkins/jenkins-slave/maven-repositories/0 clean install -PWeld2
-Dweld.version=2.0.0.Final
[INFO] Scanning for projects...
Downloading: https://repository.apache.org/content/repositories/releases/org/jboss/weld/weld-core-bom/2.0.0.Final/weld-core-bom-2.0.0.Final.pom
Downloading: https://repository.apache.org/content/repositories/snapshots/org/jboss/weld/weld-core-bom/2.0.0.Final/weld-core-bom-2.0.0.Final.pom
Downloading: http://repo.maven.apache.org/maven2/org/jboss/weld/weld-core-bom/2.0.0.Final/weld-core-bom-2.0.0.Final.pom
Downloaded: http://repo.maven.apache.org/maven2/org/jboss/weld/weld-core-bom/2.0.0.Final/weld-core-bom-2.0.0.Final.pom
(7 KB at 17.5 KB/sec)
Downloading: https://repository.apache.org/content/repositories/releases/org/jboss/weld/weld-core-parent/2.0.0.Final/weld-core-parent-2.0.0.Final.pom
Downloading: https://repository.apache.org/content/repositories/snapshots/org/jboss/weld/weld-core-parent/2.0.0.Final/weld-core-parent-2.0.0.Final.pom
Downloading: http://repository.jboss.org/nexus/content/groups/public/org/jboss/weld/weld-core-parent/2.0.0.Final/weld-core-parent-2.0.0.Final.pom
Downloaded: http://repository.jboss.org/nexus/content/groups/public/org/jboss/weld/weld-core-parent/2.0.0.Final/weld-core-parent-2.0.0.Final.pom
(29 KB at 60.7 KB/sec)
[ERROR] The build could not read 4 projects -> [Help 1]
[ERROR]   
[ERROR]   The project org.apache.deltaspike:parent-code:1.7.1-SNAPSHOT (<https://builds.apache.org/job/DeltaSpike%20Weld%202.0.0/ws/deltaspike/parent/code/pom.xml)>
has 1 error
[ERROR]     'dependencies.dependency.version' for org.jboss.weld:weld-core-impl:jar is missing.
@ line 437, column 29
[ERROR]   
[ERROR]   The project org.apache.deltaspike.core:core-project:1.7.1-SNAPSHOT (<https://builds.apache.org/job/DeltaSpike%20Weld%202.0.0/ws/deltaspike/core/pom.xml)>
has 1 error
[ERROR]     'dependencies.dependency.version' for org.jboss.weld:weld-core-impl:jar is missing.
@ org.apache.deltaspike:parent-code:1.7.1-SNAPSHOT, <https://builds.apache.org/job/DeltaSpike%20Weld%202.0.0/ws/deltaspike/parent/code/pom.xml,>
line 437, column 29
[ERROR]   
[ERROR]   The project org.apache.deltaspike.cdictrl:cdictrl-project:1.7.1-SNAPSHOT (<https://builds.apache.org/job/DeltaSpike%20Weld%202.0.0/ws/deltaspike/cdictrl/pom.xml)>
has 1 error
[ERROR]     'dependencies.dependency.version' for org.jboss.weld:weld-core-impl:jar is missing.
@ org.apache.deltaspike:parent-code:1.7.1-SNAPSHOT, <https://builds.apache.org/job/DeltaSpike%20Weld%202.0.0/ws/deltaspike/parent/code/pom.xml,>
line 437, column 29
[ERROR]   
[ERROR]   The project org.apache.deltaspike.modules:modules-project:1.7.1-SNAPSHOT (<https://builds.apache.org/job/DeltaSpike%20Weld%202.0.0/ws/deltaspike/modules/pom.xml)>
has 1 error
[ERROR]     'dependencies.dependency.version' for org.jboss.weld:weld-core-impl:jar is missing.
@ org.apache.deltaspike:parent-code:1.7.1-SNAPSHOT, <https://builds.apache.org/job/DeltaSpike%20Weld%202.0.0/ws/deltaspike/parent/code/pom.xml,>
line 437, column 29
[ERROR] 
[ERROR] To see the full stack trace of the errors, re-run Maven with the -e switch.
[ERROR] Re-run Maven using the -X switch to enable full debug logging.
[ERROR] 
[ERROR] For more information about the errors and possible solutions, please read the following
articles:
[ERROR] [Help 1] http://cwiki.apache.org/confluence/display/MAVEN/ProjectBuildingException
channel stopped

Mime
View raw message