deltaspike-commits mailing list archives

Site index · List index
Message view « Date » · « Thread »
Top « Date » · « Thread »
From Apache Jenkins Server <jenk...@builds.apache.org>
Subject Build failed in Jenkins: DeltaSpike_Wildfly_10 #116
Date Thu, 21 Jul 2016 11:56:59 GMT
See <https://builds.apache.org/job/DeltaSpike_Wildfly_10/116/changes>

Changes:

[johndament] [maven-release-plugin] prepare release deltaspike-1.7.1

[johndament] [maven-release-plugin] prepare for next development iteration

[johndament] DELTASPIKE-1186 Updated website with 1.7.1 release.

[johndament] DELTASPIKE-1186 New release announcement template.

[johndament] Switched links to HTTPS.

------------------------------------------
Started by upstream project "DeltaSpike for Java EE" build number 80
originally caused by:
 Started by an SCM change
[EnvInject] - Loading node environment variables.
Building remotely on jenkins-test-78b (jenkins-cloud-4GB cloud-slave Ubuntu ubuntu jenkins-cloud-8GB)
in workspace <https://builds.apache.org/job/DeltaSpike_Wildfly_10/ws/>
Unpacking https://repo.maven.apache.org/maven2/org/apache/maven/apache-maven/3.3.3/apache-maven-3.3.3-bin.zip
to /home/jenkins/jenkins-slave/tools/hudson.tasks.Maven_MavenInstallation/maven-3.3.3 on jenkins-test-78b
Cloning the remote Git repository
Cloning repository https://git-wip-us.apache.org/repos/asf/deltaspike.git
 > git init <https://builds.apache.org/job/DeltaSpike_Wildfly_10/ws/> # timeout=10
Fetching upstream changes from https://git-wip-us.apache.org/repos/asf/deltaspike.git
 > git --version # timeout=10
 > git -c core.askpass=true fetch --tags --progress https://git-wip-us.apache.org/repos/asf/deltaspike.git
+refs/heads/*:refs/remotes/origin/*
 > git config remote.origin.url https://git-wip-us.apache.org/repos/asf/deltaspike.git
# timeout=10
 > git config --add remote.origin.fetch +refs/heads/*:refs/remotes/origin/* # timeout=10
 > git config remote.origin.url https://git-wip-us.apache.org/repos/asf/deltaspike.git
# timeout=10
Fetching upstream changes from https://git-wip-us.apache.org/repos/asf/deltaspike.git
 > git -c core.askpass=true fetch --tags --progress https://git-wip-us.apache.org/repos/asf/deltaspike.git
+refs/heads/*:refs/remotes/origin/*
 > git rev-parse origin/master^{commit} # timeout=10
Checking out Revision 234ab7370d246291c2f73bcd2acfa28d7642058d (origin/master)
 > git config core.sparsecheckout # timeout=10
 > git checkout -f 234ab7370d246291c2f73bcd2acfa28d7642058d
 > git rev-list 54b57e1e8ff08ddf31e636b711e9a70a509d5e3e # timeout=10
Parsing POMs
Failed to transfer Could not find artifact org.jboss.arquillian:arquillian-bom:pom:1.1.8.Final
in Apache Repository (https://repository.apache.org/content/repositories/releases)
Failed to transfer Could not find artifact org.jboss.arquillian:arquillian-bom:pom:1.1.8.Final
in Apache Snapshot Repository (https://repository.apache.org/content/repositories/snapshots)
Downloaded artifact http://repo.maven.apache.org/maven2/org/jboss/arquillian/arquillian-bom/1.1.8.Final/arquillian-bom-1.1.8.Final.pom
Failed to transfer Could not find artifact org.jboss.shrinkwrap:shrinkwrap-bom:pom:1.2.2 in
Apache Repository (https://repository.apache.org/content/repositories/releases)
Failed to transfer Could not find artifact org.jboss.shrinkwrap:shrinkwrap-bom:pom:1.2.2 in
Apache Snapshot Repository (https://repository.apache.org/content/repositories/snapshots)
Downloaded artifact http://repo.maven.apache.org/maven2/org/jboss/shrinkwrap/shrinkwrap-bom/1.2.2/shrinkwrap-bom-1.2.2.pom
Failed to transfer Could not find artifact org.jboss.shrinkwrap.resolver:shrinkwrap-resolver-bom:pom:2.1.1
in Apache Repository (https://repository.apache.org/content/repositories/releases)
Failed to transfer Could not find artifact org.jboss.shrinkwrap.resolver:shrinkwrap-resolver-bom:pom:2.1.1
in Apache Snapshot Repository (https://repository.apache.org/content/repositories/snapshots)
Downloaded artifact http://repo.maven.apache.org/maven2/org/jboss/shrinkwrap/resolver/shrinkwrap-resolver-bom/2.1.1/shrinkwrap-resolver-bom-2.1.1.pom
Failed to transfer Could not find artifact org.jboss.shrinkwrap.descriptors:shrinkwrap-descriptors-bom:pom:2.0.0-alpha-7
in Apache Repository (https://repository.apache.org/content/repositories/releases)
Failed to transfer Could not find artifact org.jboss.shrinkwrap.descriptors:shrinkwrap-descriptors-bom:pom:2.0.0-alpha-7
in Apache Snapshot Repository (https://repository.apache.org/content/repositories/snapshots)
Downloaded artifact http://repo.maven.apache.org/maven2/org/jboss/shrinkwrap/descriptors/shrinkwrap-descriptors-bom/2.0.0-alpha-7/shrinkwrap-descriptors-bom-2.0.0-alpha-7.pom
Failed to transfer Could not find artifact org.jboss.shrinkwrap.resolver:shrinkwrap-resolver-bom:pom:2.0.0
in Apache Repository (https://repository.apache.org/content/repositories/releases)
Failed to transfer Could not find artifact org.jboss.shrinkwrap.resolver:shrinkwrap-resolver-bom:pom:2.0.0
in Apache Snapshot Repository (https://repository.apache.org/content/repositories/snapshots)
Downloaded artifact http://repo.maven.apache.org/maven2/org/jboss/shrinkwrap/resolver/shrinkwrap-resolver-bom/2.0.0/shrinkwrap-resolver-bom-2.0.0.pom
ERROR: Failed to parse POMs
java.io.IOException: remote file operation failed: <https://builds.apache.org/job/DeltaSpike_Wildfly_10/ws/>
at hudson.remoting.Channel@438c9709:jenkins-test-78b: hudson.remoting.ProxyException: hudson.maven.MavenModuleSetBuild$MavenExecutionException:
org.apache.maven.project.ProjectBuildingException: Some problems were encountered while processing
the POMs:
[FATAL] Non-resolvable parent POM: Could not find artifact org.apache.deltaspike.modules:data-module-project:pom:1.6.0-SNAPSHOT
and 'parent.relativePath' points at wrong local POM @ line 23, column 13

	at hudson.FilePath.act(FilePath.java:986)
	at hudson.FilePath.act(FilePath.java:968)
	at hudson.maven.MavenModuleSetBuild$MavenModuleSetBuildExecution.parsePoms(MavenModuleSetBuild.java:960)
	at hudson.maven.MavenModuleSetBuild$MavenModuleSetBuildExecution.doRun(MavenModuleSetBuild.java:679)
	at hudson.model.AbstractBuild$AbstractBuildExecution.run(AbstractBuild.java:534)
	at hudson.model.Run.execute(Run.java:1738)
	at hudson.maven.MavenModuleSetBuild.run(MavenModuleSetBuild.java:531)
	at hudson.model.ResourceController.execute(ResourceController.java:98)
	at hudson.model.Executor.run(Executor.java:410)
Caused by: hudson.remoting.ProxyException: hudson.maven.MavenModuleSetBuild$MavenExecutionException:
org.apache.maven.project.ProjectBuildingException: Some problems were encountered while processing
the POMs:
[FATAL] Non-resolvable parent POM: Could not find artifact org.apache.deltaspike.modules:data-module-project:pom:1.6.0-SNAPSHOT
and 'parent.relativePath' points at wrong local POM @ line 23, column 13

	at hudson.maven.MavenModuleSetBuild$PomParser.invoke(MavenModuleSetBuild.java:1364)
	at hudson.maven.MavenModuleSetBuild$PomParser.invoke(MavenModuleSetBuild.java:1098)
	at hudson.FilePath$FileCallableWrapper.call(FilePath.java:2719)
	at hudson.remoting.UserRequest.perform(UserRequest.java:120)
	at hudson.remoting.UserRequest.perform(UserRequest.java:48)
	at hudson.remoting.Request$2.run(Request.java:326)
	at hudson.remoting.InterceptingExecutorService$1.call(InterceptingExecutorService.java:68)
	at java.util.concurrent.FutureTask.run(FutureTask.java:262)
	at java.util.concurrent.ThreadPoolExecutor.runWorker(ThreadPoolExecutor.java:1145)
	at java.util.concurrent.ThreadPoolExecutor$Worker.run(ThreadPoolExecutor.java:615)
	at java.lang.Thread.run(Thread.java:745)
	at ......remote call to jenkins-test-78b(Native Method)
	at hudson.remoting.Channel.attachCallSiteStackTrace(Channel.java:1416)
	at hudson.remoting.UserResponse.retrieve(UserRequest.java:220)
	at hudson.remoting.Channel.call(Channel.java:781)
	at hudson.FilePath.act(FilePath.java:979)
	... 8 more
Caused by: hudson.remoting.ProxyException: org.apache.maven.project.ProjectBuildingException:
Some problems were encountered while processing the POMs:
[FATAL] Non-resolvable parent POM: Could not find artifact org.apache.deltaspike.modules:data-module-project:pom:1.6.0-SNAPSHOT
and 'parent.relativePath' points at wrong local POM @ line 23, column 13

	at org.apache.maven.project.DefaultProjectBuilder.build(DefaultProjectBuilder.java:364)
	at hudson.maven.MavenEmbedder.buildProjects(MavenEmbedder.java:361)
	at hudson.maven.MavenEmbedder.readProjects(MavenEmbedder.java:331)
	at hudson.maven.MavenModuleSetBuild$PomParser.invoke(MavenModuleSetBuild.java:1301)
	at hudson.maven.MavenModuleSetBuild$PomParser.invoke(MavenModuleSetBuild.java:1098)
	at hudson.FilePath$FileCallableWrapper.call(FilePath.java:2719)
	at hudson.remoting.UserRequest.perform(UserRequest.java:120)
	at hudson.remoting.UserRequest.perform(UserRequest.java:48)
	at hudson.remoting.Request$2.run(Request.java:326)
	at hudson.remoting.InterceptingExecutorService$1.call(InterceptingExecutorService.java:68)
	at java.util.concurrent.FutureTask.run(FutureTask.java:262)
	at java.util.concurrent.ThreadPoolExecutor.runWorker(ThreadPoolExecutor.java:1145)
	at java.util.concurrent.ThreadPoolExecutor$Worker.run(ThreadPoolExecutor.java:615)
	at java.lang.Thread.run(Thread.java:745)

Mime
View raw message