deltaspike-commits mailing list archives

Site index · List index
Message view « Date » · « Thread »
Top « Date » · « Thread »
From Apache Jenkins Server <jenk...@builds.apache.org>
Subject Build failed in Jenkins: DeltaSpike_GF3 #401
Date Sat, 23 Jul 2016 07:32:32 GMT
See <https://builds.apache.org/job/DeltaSpike_GF3/401/changes>

Changes:

[kalgon] DELTASPIKE-1185 Allow customization (name, description) of JMX managed

------------------------------------------
[...truncated 551 lines...]
[INFO] Using 'UTF-8' encoding to copy filtered resources.
[INFO] Copying 15 resources
[INFO] Copying 3 resources
[INFO] 
[INFO] --- maven-antrun-plugin:1.8:run (prepare-glassfish3) @ deltaspike-core-impl ---
[INFO] Executing tasks

main:
[INFO] Executed tasks
[INFO] 
[INFO] --- maven-compiler-plugin:2.5:testCompile (default-testCompile) @ deltaspike-core-impl
---
[INFO] Compiling 208 source files to <https://builds.apache.org/job/DeltaSpike_GF3/ws/deltaspike/core/impl/target/test-classes>
[INFO] 
[INFO] --- maven-surefire-plugin:2.11:test (default-test) @ deltaspike-core-impl ---
[INFO] Surefire report directory: <https://builds.apache.org/job/DeltaSpike_GF3/ws/deltaspike/core/impl/target/surefire-reports>
[INFO] Using configured provider org.apache.maven.surefire.junitcore.JUnitCoreProvider

-------------------------------------------------------
 T E S T S
-------------------------------------------------------
Concurrency config is parallel='none', perCoreThreadCount=true, threadCount=2, useUnlimitedThreads=false
Jul 23, 2016 7:22:59 AM org.apache.deltaspike.test.utils.ShrinkWrapArchiveUtil getArchives
INFO: Test org.apache.deltaspike.test.core.api.exclude.ExcludeWarFileTest Adding Java ClassPath
URL as JavaArchive <https://builds.apache.org/job/DeltaSpike_GF3/ws/deltaspike/core/impl/target/classes/META-INF/beans.xml>
Jul 23, 2016 7:22:59 AM org.apache.deltaspike.test.utils.ShrinkWrapArchiveUtil getArchives
INFO: Test org.apache.deltaspike.test.core.api.exclude.ExcludeWarFileTest Adding Java ClassPath
URL as JavaArchive jar:<https://builds.apache.org/job/DeltaSpike_GF3/ws/deltaspike/core/api/target/deltaspike-core-api-1.7.2-SNAPSHOT.jar!/META-INF/beans.xml>
Jul 23, 2016 7:23:13 AM org.apache.deltaspike.test.utils.ShrinkWrapArchiveUtil getArchives
INFO: Test org.apache.deltaspike.test.core.api.exclude.uc001.EntityExcludeTest Adding Java
ClassPath URL as JavaArchive <https://builds.apache.org/job/DeltaSpike_GF3/ws/deltaspike/core/impl/target/classes/META-INF/beans.xml>
Jul 23, 2016 7:23:13 AM org.apache.deltaspike.test.utils.ShrinkWrapArchiveUtil getArchives
INFO: Test org.apache.deltaspike.test.core.api.exclude.uc001.EntityExcludeTest Adding Java
ClassPath URL as JavaArchive jar:<https://builds.apache.org/job/DeltaSpike_GF3/ws/deltaspike/core/api/target/deltaspike-core-api-1.7.2-SNAPSHOT.jar!/META-INF/beans.xml>
Running org.apache.deltaspike.test.core.api.exclude.ExcludeWarFileTest
Tests run: 7, Failures: 0, Errors: 0, Skipped: 0, Time elapsed: 1.201 sec
Jul 23, 2016 7:23:19 AM org.apache.deltaspike.test.utils.ShrinkWrapArchiveUtil getArchives
INFO: Test org.apache.deltaspike.test.core.api.exclude.ExcludeWarFileTest Adding Java ClassPath
URL as JavaArchive <https://builds.apache.org/job/DeltaSpike_GF3/ws/deltaspike/core/impl/target/classes/META-INF/beans.xml>
Jul 23, 2016 7:23:19 AM org.apache.deltaspike.test.utils.ShrinkWrapArchiveUtil getArchives
INFO: Test org.apache.deltaspike.test.core.api.exclude.ExcludeWarFileTest Adding Java ClassPath
URL as JavaArchive jar:<https://builds.apache.org/job/DeltaSpike_GF3/ws/deltaspike/core/api/target/deltaspike-core-api-1.7.2-SNAPSHOT.jar!/META-INF/beans.xml>
Running org.apache.deltaspike.test.core.api.exclude.uc001.EntityExcludeTest
Tests run: 3, Failures: 0, Errors: 0, Skipped: 0, Time elapsed: 0.596 sec
Running org.apache.deltaspike.test.core.api.exclude.ExcludeEarFileTest
Tests run: 7, Failures: 0, Errors: 0, Skipped: 0, Time elapsed: 0.901 sec
Running org.apache.deltaspike.test.core.api.projectstage.ProjectStageTest
Tests run: 1, Failures: 0, Errors: 0, Skipped: 0, Time elapsed: 0.015 sec
Jul 23, 2016 7:23:27 AM org.apache.deltaspike.test.utils.ShrinkWrapArchiveUtil getArchives
INFO: Test org.apache.deltaspike.test.core.api.config.propertyconfigsource.ConfigPropertyEARTest
Adding Java ClassPath URL as JavaArchive <https://builds.apache.org/job/DeltaSpike_GF3/ws/deltaspike/core/impl/target/classes/META-INF/beans.xml>
Jul 23, 2016 7:23:27 AM org.apache.deltaspike.test.utils.ShrinkWrapArchiveUtil getArchives
INFO: Test org.apache.deltaspike.test.core.api.config.propertyconfigsource.ConfigPropertyEARTest
Adding Java ClassPath URL as JavaArchive jar:<https://builds.apache.org/job/DeltaSpike_GF3/ws/deltaspike/core/api/target/deltaspike-core-api-1.7.2-SNAPSHOT.jar!/META-INF/beans.xml>
Running org.apache.deltaspike.test.core.api.projectstage.ProjectStageProducerTest
Jul 23, 2016 7:23:27 AM org.apache.deltaspike.core.impl.config.EnvironmentPropertyConfigSourceProvider
<init>
INFO: Custom config found by DeltaSpike. Name: 'META-INF/apache-deltaspike.properties', URL:
'<https://builds.apache.org/job/DeltaSpike_GF3/ws/deltaspike/core/impl/target/test-classes/META-INF/apache-deltaspike.properties'>
Jul 23, 2016 7:23:27 AM org.apache.deltaspike.core.impl.config.EnvironmentPropertyConfigSourceProvider
<init>
INFO: Custom config found by DeltaSpike. Name: 'myboottimeconfig.properties', URL: '<https://builds.apache.org/job/DeltaSpike_GF3/ws/deltaspike/core/impl/target/test-classes/myboottimeconfig.properties'>
Jul 23, 2016 7:23:27 AM org.apache.deltaspike.core.util.ProjectStageProducer initProjectStage
INFO: Computed the following DeltaSpike ProjectStage: SystemTest
Jul 23, 2016 7:23:27 AM org.apache.deltaspike.core.util.ProjectStageProducer initProjectStage
INFO: Computed the following DeltaSpike ProjectStage: SystemTest
Jul 23, 2016 7:23:27 AM org.apache.deltaspike.core.util.ProjectStageProducer initProjectStage
INFO: Computed the following DeltaSpike ProjectStage: IntegrationTest
Jul 23, 2016 7:23:27 AM org.apache.deltaspike.core.util.ProjectStageProducer initProjectStage
INFO: Computed the following DeltaSpike ProjectStage: SystemTest
Jul 23, 2016 7:23:27 AM org.apache.deltaspike.core.util.ProjectStageProducer initProjectStage
INFO: Computed the following DeltaSpike ProjectStage: IntegrationTest
Jul 23, 2016 7:23:27 AM org.apache.deltaspike.core.util.ProjectStageProducer initProjectStage
INFO: Computed the following DeltaSpike ProjectStage: SystemTest
Jul 23, 2016 7:23:27 AM org.apache.deltaspike.core.util.ProjectStageProducer initProjectStage
INFO: Computed the following DeltaSpike ProjectStage: IntegrationTest
Tests run: 1, Failures: 0, Errors: 0, Skipped: 0, Time elapsed: 0.057 sec
Jul 23, 2016 7:23:34 AM org.apache.deltaspike.test.utils.ShrinkWrapArchiveUtil getArchives
INFO: Test org.apache.deltaspike.test.core.api.config.propertyconfigsource.ConfigPropertyWARTest
Adding Java ClassPath URL as JavaArchive <https://builds.apache.org/job/DeltaSpike_GF3/ws/deltaspike/core/impl/target/classes/META-INF/beans.xml>
Jul 23, 2016 7:23:35 AM org.apache.deltaspike.test.utils.ShrinkWrapArchiveUtil getArchives
INFO: Test org.apache.deltaspike.test.core.api.config.propertyconfigsource.ConfigPropertyWARTest
Adding Java ClassPath URL as JavaArchive jar:<https://builds.apache.org/job/DeltaSpike_GF3/ws/deltaspike/core/api/target/deltaspike-core-api-1.7.2-SNAPSHOT.jar!/META-INF/beans.xml>
Running org.apache.deltaspike.test.core.api.config.propertyconfigsource.ConfigPropertyEARTest
Tests run: 1, Failures: 0, Errors: 0, Skipped: 0, Time elapsed: 0.379 sec
Running org.apache.deltaspike.test.core.api.config.propertyconfigsource.ConfigPropertyWARTest
Tests run: 1, Failures: 0, Errors: 0, Skipped: 0, Time elapsed: 0.628 sec
Jul 23, 2016 7:23:39 AM org.apache.deltaspike.test.utils.ShrinkWrapArchiveUtil getArchives
INFO: Test org.apache.deltaspike.test.core.api.message.MinimalMessagesTest Adding Java ClassPath
URL as JavaArchive <https://builds.apache.org/job/DeltaSpike_GF3/ws/deltaspike/core/impl/target/classes/META-INF/beans.xml>
Jul 23, 2016 7:23:39 AM org.apache.deltaspike.test.utils.ShrinkWrapArchiveUtil getArchives
INFO: Test org.apache.deltaspike.test.core.api.message.MinimalMessagesTest Adding Java ClassPath
URL as JavaArchive jar:<https://builds.apache.org/job/DeltaSpike_GF3/ws/deltaspike/core/api/target/deltaspike-core-api-1.7.2-SNAPSHOT.jar!/META-INF/beans.xml>
Running org.apache.deltaspike.test.core.api.config.ConfigSourceTest
Tests run: 6, Failures: 0, Errors: 0, Skipped: 0, Time elapsed: 0.002 sec
Running org.apache.deltaspike.test.core.api.message.MinimalMessagesTest
Tests run: 5, Failures: 0, Errors: 0, Skipped: 0, Time elapsed: 0.773 sec
Jul 23, 2016 7:23:43 AM org.apache.deltaspike.test.utils.ShrinkWrapArchiveUtil getArchives
INFO: Test org.apache.deltaspike.test.core.api.provider.BeanProviderTest Adding Java ClassPath
URL as JavaArchive <https://builds.apache.org/job/DeltaSpike_GF3/ws/deltaspike/core/impl/target/classes/META-INF/beans.xml>
Jul 23, 2016 7:23:43 AM org.apache.deltaspike.test.utils.ShrinkWrapArchiveUtil getArchives
INFO: Test org.apache.deltaspike.test.core.api.provider.BeanProviderTest Adding Java ClassPath
URL as JavaArchive jar:<https://builds.apache.org/job/DeltaSpike_GF3/ws/deltaspike/core/api/target/deltaspike-core-api-1.7.2-SNAPSHOT.jar!/META-INF/beans.xml>
Running org.apache.deltaspike.test.core.api.interpreter.PropertyExpressionInterpreterTest
Tests run: 3, Failures: 0, Errors: 0, Skipped: 0, Time elapsed: 0.006 sec
Jul 23, 2016 7:23:48 AM org.apache.deltaspike.test.utils.ShrinkWrapArchiveUtil getArchives
INFO: Test org.apache.deltaspike.test.core.api.provider.BeanManagerProviderWarFileTest Adding
Java ClassPath URL as JavaArchive <https://builds.apache.org/job/DeltaSpike_GF3/ws/deltaspike/core/impl/target/classes/META-INF/beans.xml>
Jul 23, 2016 7:23:48 AM org.apache.deltaspike.test.utils.ShrinkWrapArchiveUtil getArchives
INFO: Test org.apache.deltaspike.test.core.api.provider.BeanManagerProviderWarFileTest Adding
Java ClassPath URL as JavaArchive jar:<https://builds.apache.org/job/DeltaSpike_GF3/ws/deltaspike/core/api/target/deltaspike-core-api-1.7.2-SNAPSHOT.jar!/META-INF/beans.xml>
Running org.apache.deltaspike.test.core.api.provider.BeanProviderTest
Tests run: 10, Failures: 0, Errors: 0, Skipped: 0, Time elapsed: 0.578 sec
Jul 23, 2016 7:23:54 AM org.apache.deltaspike.test.utils.ShrinkWrapArchiveUtil getArchives
INFO: Test org.apache.deltaspike.test.core.api.provider.BeanManagerProviderWarFileTest Adding
Java ClassPath URL as JavaArchive <https://builds.apache.org/job/DeltaSpike_GF3/ws/deltaspike/core/impl/target/classes/META-INF/beans.xml>
Jul 23, 2016 7:23:54 AM org.apache.deltaspike.test.utils.ShrinkWrapArchiveUtil getArchives
INFO: Test org.apache.deltaspike.test.core.api.provider.BeanManagerProviderWarFileTest Adding
Java ClassPath URL as JavaArchive jar:<https://builds.apache.org/job/DeltaSpike_GF3/ws/deltaspike/core/api/target/deltaspike-core-api-1.7.2-SNAPSHOT.jar!/META-INF/beans.xml>
Running org.apache.deltaspike.test.core.api.provider.BeanManagerProviderWarFileTest
Tests run: 1, Failures: 0, Errors: 0, Skipped: 0, Time elapsed: 0.679 sec
Java HotSpot(TM) 64-Bit Server VM warning: INFO: os::commit_memory(0x00000007e0480000, 503316480,
0) failed; error='Cannot allocate memory' (errno=12)
#
# There is insufficient memory for the Java Runtime Environment to continue.
# Native memory allocation (malloc) failed to allocate 503316480 bytes for committing reserved
memory.
# An error report file with more information is saved as:
# <https://builds.apache.org/job/DeltaSpike_GF3/ws/deltaspike/core/impl/hs_err_pid9203.log>

Results :

Tests run: 46, Failures: 0, Errors: 0, Skipped: 0

[JENKINS] Recording test results
[INFO] ------------------------------------------------------------------------
[INFO] Reactor Summary:
[INFO] 
[INFO] Apache DeltaSpike .................................. SUCCESS [ 21.044 s]
[INFO] Apache DeltaSpike Sources .......................... SUCCESS [  0.694 s]
[INFO] Apache DeltaSpike CheckStyle-rules ................. SUCCESS [ 10.899 s]
[INFO] Apache DeltaSpike Parent ........................... SUCCESS [ 40.945 s]
[INFO] Apache DeltaSpike Test-Utils ....................... SUCCESS [ 33.997 s]
[INFO] Apache DeltaSpike Code Parent ...................... SUCCESS [ 35.421 s]
[INFO] Apache DeltaSpike Core ............................. SUCCESS [ 33.201 s]
[INFO] Apache DeltaSpike Core-API ......................... SUCCESS [04:44 min]
[INFO] Apache DeltaSpike Core-Implementation .............. FAILURE [02:57 min]
[INFO] Apache DeltaSpike ContainerControl parent .......... SKIPPED
[INFO] Apache DeltaSpike CDI ContainerControl API ......... SKIPPED
[INFO] Apache DeltaSpike CDI Weld-ContainerControl ........ SKIPPED
[INFO] Apache DeltaSpike Modules .......................... SKIPPED
[INFO] Apache DeltaSpike Proxy-Module ..................... SKIPPED
[INFO] Apache DeltaSpike Proxy-Module API ................. SKIPPED
[INFO] Apache DeltaSpike Proxy-Module Impl ASM5 ........... SKIPPED
[INFO] Apache DeltaSpike Security-Module .................. SKIPPED
[INFO] Apache DeltaSpike Security-Module API .............. SKIPPED
[INFO] Apache DeltaSpike Security-Module Impl ............. SKIPPED
[INFO] Apache DeltaSpike JPA-Module ....................... SKIPPED
[INFO] Apache DeltaSpike JPA-Module API ................... SKIPPED
[INFO] Apache DeltaSpike JPA-Module Impl .................. SKIPPED
[INFO] Apache DeltaSpike Servlet-Module ................... SKIPPED
[INFO] Apache DeltaSpike Servlet-Module API ............... SKIPPED
[INFO] Apache DeltaSpike Servlet-Module Impl .............. SKIPPED
[INFO] Apache DeltaSpike JSF-Module ....................... SKIPPED
[INFO] Apache DeltaSpike JSF-Module API ................... SKIPPED
[INFO] Apache DeltaSpike JSF-Module Impl .................. SKIPPED
[INFO] Apache DeltaSpike JSF-Module Impl (EE6 only) ....... SKIPPED
[INFO] Apache DeltaSpike Partial-Bean-Module .............. SKIPPED
[INFO] Apache DeltaSpike Partial-Bean-Module API .......... SKIPPED
[INFO] Apache DeltaSpike Partial-Bean-Module Impl ......... SKIPPED
[INFO] Apache DeltaSpike BeanValidation-Module ............ SKIPPED
[INFO] Apache DeltaSpike BeanValidation-Module API ........ SKIPPED
[INFO] Apache DeltaSpike BeanValidation-Module Impl ....... SKIPPED
[INFO] Apache DeltaSpike Data-Module ...................... SKIPPED
[INFO] Apache DeltaSpike Data-Module API .................. SKIPPED
[INFO] Apache DeltaSpike Data-Module Impl ................. SKIPPED
[INFO] Apache DeltaSpike Scheduler-Module ................. SKIPPED
[INFO] Apache DeltaSpike Scheduler-Module API ............. SKIPPED
[INFO] Apache DeltaSpike Scheduler-Module Impl ............ SKIPPED
[INFO] Apache DeltaSpike Test-Control-Module .............. SKIPPED
[INFO] Apache DeltaSpike Test-Control-Module API .......... SKIPPED
[INFO] Apache DeltaSpike Test-Control-Module Impl ......... SKIPPED
[INFO] Apache DeltaSpike Examples ......................... SKIPPED
[INFO] Apache DeltaSpike Java-SE Examples ................. SKIPPED
[INFO] Apache DeltaSpike JSF Examples ..................... SKIPPED
[INFO] Apache DeltaSpike JSF Playground ................... SKIPPED
[INFO] Apache DeltaSpike Security Example CDI ............. SKIPPED
[INFO] Apache DeltaSpike Security Example PicketLink ...... SKIPPED
[INFO] Apache DeltaSpike Java-SE Scheduler Examples ....... SKIPPED
[INFO] Apache DeltaSpike Documentation .................... SKIPPED
[INFO] Apache DeltaSpike Site ............................. SKIPPED
[INFO] ------------------------------------------------------------------------
[INFO] BUILD FAILURE
[INFO] ------------------------------------------------------------------------
[INFO] Total time: 14:48 min
[INFO] Finished at: 2016-07-23T07:27:24+00:00
[INFO] Final Memory: 74M/775M
[INFO] ------------------------------------------------------------------------
Waiting for Jenkins to finish collecting data[ERROR] Failed to execute goal org.apache.maven.plugins:maven-surefire-plugin:2.11:test
(default-test) on project deltaspike-core-impl: Error occured in starting fork, check output
in log -> [Help 1]
[ERROR] 
[ERROR] To see the full stack trace of the errors, re-run Maven with the -e switch.
[ERROR] Re-run Maven using the -X switch to enable full debug logging.
[ERROR] 
[ERROR] For more information about the errors and possible solutions, please read the following
articles:
[ERROR] [Help 1] http://cwiki.apache.org/confluence/display/MAVEN/MojoExecutionException
[ERROR] 
[ERROR] After correcting the problems, you can resume the build with the command
[ERROR]   mvn <goals> -rf :deltaspike-core-impl

[JENKINS] Archiving <https://builds.apache.org/job/DeltaSpike_GF3/ws/deltaspike/examples/jse-examples/pom.xml>
to org.apache.deltaspike.examples/deltaspike-jse-example/1.7.2-SNAPSHOT/deltaspike-jse-example-1.7.2-SNAPSHOT.pom
[JENKINS] Archiving <https://builds.apache.org/job/DeltaSpike_GF3/ws/deltaspike/examples/security-requested-page-after-login-cdi/pom.xml>
to org.apache.deltaspike.examples/deltaspike-security-requested-page-after-login-cdi/1.7.2-SNAPSHOT/deltaspike-security-requested-page-after-login-cdi-1.7.2-SNAPSHOT.pom
[JENKINS] Archiving <https://builds.apache.org/job/DeltaSpike_GF3/ws/deltaspike/test-utils/pom.xml>
to org.apache.deltaspike.test/test-utils/1.7.2-SNAPSHOT/test-utils-1.7.2-SNAPSHOT.pom
[JENKINS] Archiving <https://builds.apache.org/job/DeltaSpike_GF3/ws/deltaspike/test-utils/target/test-utils-1.7.2-SNAPSHOT.jar>
to org.apache.deltaspike.test/test-utils/1.7.2-SNAPSHOT/test-utils-1.7.2-SNAPSHOT.jar
[JENKINS] Archiving <https://builds.apache.org/job/DeltaSpike_GF3/ws/deltaspike/test-utils/target/test-utils-1.7.2-SNAPSHOT-sources.jar>
to org.apache.deltaspike.test/test-utils/1.7.2-SNAPSHOT/test-utils-1.7.2-SNAPSHOT-sources.jar
[JENKINS] Archiving <https://builds.apache.org/job/DeltaSpike_GF3/ws/documentation/pom.xml>
to org.apache.deltaspike/deltaspike-documentation/1.7.2-SNAPSHOT/deltaspike-documentation-1.7.2-SNAPSHOT.pom
[JENKINS] Archiving <https://builds.apache.org/job/DeltaSpike_GF3/ws/deltaspike/modules/data/impl/pom.xml>
to org.apache.deltaspike.modules/deltaspike-data-module-impl/1.7.2-SNAPSHOT/deltaspike-data-module-impl-1.7.2-SNAPSHOT.pom
[JENKINS] Archiving <https://builds.apache.org/job/DeltaSpike_GF3/ws/deltaspike/modules/data/api/pom.xml>
to org.apache.deltaspike.modules/deltaspike-data-module-api/1.7.2-SNAPSHOT/deltaspike-data-module-api-1.7.2-SNAPSHOT.pom
[JENKINS] Archiving <https://builds.apache.org/job/DeltaSpike_GF3/ws/deltaspike/core/impl/pom.xml>
to org.apache.deltaspike.core/deltaspike-core-impl/1.7.2-SNAPSHOT/deltaspike-core-impl-1.7.2-SNAPSHOT.pom
[JENKINS] Archiving <https://builds.apache.org/job/DeltaSpike_GF3/ws/deltaspike/modules/pom.xml>
to org.apache.deltaspike.modules/modules-project/1.7.2-SNAPSHOT/modules-project-1.7.2-SNAPSHOT.pom
[JENKINS] Archiving <https://builds.apache.org/job/DeltaSpike_GF3/ws/deltaspike/modules/test-control/pom.xml>
to org.apache.deltaspike.modules/test-control-module-project/1.7.2-SNAPSHOT/test-control-module-project-1.7.2-SNAPSHOT.pom
[JENKINS] Archiving <https://builds.apache.org/job/DeltaSpike_GF3/ws/deltaspike/examples/jsf-examples/pom.xml>
to org.apache.deltaspike.examples/deltaspike-jsf-example/1.7.2-SNAPSHOT/deltaspike-jsf-example-1.7.2-SNAPSHOT.pom
[JENKINS] Archiving <https://builds.apache.org/job/DeltaSpike_GF3/ws/deltaspike/cdictrl/api/pom.xml>
to org.apache.deltaspike.cdictrl/deltaspike-cdictrl-api/1.7.2-SNAPSHOT/deltaspike-cdictrl-api-1.7.2-SNAPSHOT.pom
[JENKINS] Archiving <https://builds.apache.org/job/DeltaSpike_GF3/ws/deltaspike/examples/scheduler-playground/pom.xml>
to org.apache.deltaspike.examples/deltaspike-scheduler-example/1.7.2-SNAPSHOT/deltaspike-scheduler-example-1.7.2-SNAPSHOT.pom
[JENKINS] Archiving <https://builds.apache.org/job/DeltaSpike_GF3/ws/deltaspike/checkstyle-rules/pom.xml>
to org.apache.deltaspike/checkstyle-rules/1.7.2-SNAPSHOT/checkstyle-rules-1.7.2-SNAPSHOT.pom
[JENKINS] Archiving <https://builds.apache.org/job/DeltaSpike_GF3/ws/deltaspike/checkstyle-rules/target/checkstyle-rules-1.7.2-SNAPSHOT.jar>
to org.apache.deltaspike/checkstyle-rules/1.7.2-SNAPSHOT/checkstyle-rules-1.7.2-SNAPSHOT.jar
[JENKINS] Archiving <https://builds.apache.org/job/DeltaSpike_GF3/ws/deltaspike/parent/code/pom.xml>
to org.apache.deltaspike/parent-code/1.7.2-SNAPSHOT/parent-code-1.7.2-SNAPSHOT.pom
[JENKINS] Archiving <https://builds.apache.org/job/DeltaSpike_GF3/ws/deltaspike/parent/code/target/parent-code-1.7.2-SNAPSHOT-tests.jar>
to org.apache.deltaspike/parent-code/1.7.2-SNAPSHOT/parent-code-1.7.2-SNAPSHOT-tests.jar
Compressed 97.32 KB of artifacts by 65.8% relative to #400
[JENKINS] Archiving <https://builds.apache.org/job/DeltaSpike_GF3/ws/deltaspike/modules/jsf/impl/pom.xml>
to org.apache.deltaspike.modules/deltaspike-jsf-module-impl/1.7.2-SNAPSHOT/deltaspike-jsf-module-impl-1.7.2-SNAPSHOT.pom
[JENKINS] Archiving <https://builds.apache.org/job/DeltaSpike_GF3/ws/deltaspike/modules/partial-bean/pom.xml>
to org.apache.deltaspike.modules/partial-bean-module-project/1.7.2-SNAPSHOT/partial-bean-module-project-1.7.2-SNAPSHOT.pom
[JENKINS] Archiving <https://builds.apache.org/job/DeltaSpike_GF3/ws/deltaspike/examples/pom.xml>
to org.apache.deltaspike.examples/examples-project/1.7.2-SNAPSHOT/examples-project-1.7.2-SNAPSHOT.pom
[JENKINS] Archiving <https://builds.apache.org/job/DeltaSpike_GF3/ws/deltaspike/modules/jsf/pom.xml>
to org.apache.deltaspike.modules/jsf-module-project/1.7.2-SNAPSHOT/jsf-module-project-1.7.2-SNAPSHOT.pom
[JENKINS] Archiving <https://builds.apache.org/job/DeltaSpike_GF3/ws/deltaspike/modules/jsf/api/pom.xml>
to org.apache.deltaspike.modules/deltaspike-jsf-module-api/1.7.2-SNAPSHOT/deltaspike-jsf-module-api-1.7.2-SNAPSHOT.pom
[JENKINS] Archiving <https://builds.apache.org/job/DeltaSpike_GF3/ws/deltaspike/modules/security/pom.xml>
to org.apache.deltaspike.modules/security-module-project/1.7.2-SNAPSHOT/security-module-project-1.7.2-SNAPSHOT.pom
[JENKINS] Archiving <https://builds.apache.org/job/DeltaSpike_GF3/ws/deltaspike/modules/bean-validation/pom.xml>
to org.apache.deltaspike.modules/bean-validation-module-project/1.7.2-SNAPSHOT/bean-validation-module-project-1.7.2-SNAPSHOT.pom
[JENKINS] Archiving <https://builds.apache.org/job/DeltaSpike_GF3/ws/deltaspike/modules/partial-bean/impl/pom.xml>
to org.apache.deltaspike.modules/deltaspike-partial-bean-module-impl/1.7.2-SNAPSHOT/deltaspike-partial-bean-module-impl-1.7.2-SNAPSHOT.pom
[JENKINS] Archiving <https://builds.apache.org/job/DeltaSpike_GF3/ws/deltaspike/modules/proxy/api/pom.xml>
to org.apache.deltaspike.modules/deltaspike-proxy-module-api/1.7.2-SNAPSHOT/deltaspike-proxy-module-api-1.7.2-SNAPSHOT.pom
[JENKINS] Archiving <https://builds.apache.org/job/DeltaSpike_GF3/ws/deltaspike/cdictrl/impl-weld/pom.xml>
to org.apache.deltaspike.cdictrl/deltaspike-cdictrl-weld/1.7.2-SNAPSHOT/deltaspike-cdictrl-weld-1.7.2-SNAPSHOT.pom
[JENKINS] Archiving <https://builds.apache.org/job/DeltaSpike_GF3/ws/deltaspike/modules/jpa/api/pom.xml>
to org.apache.deltaspike.modules/deltaspike-jpa-module-api/1.7.2-SNAPSHOT/deltaspike-jpa-module-api-1.7.2-SNAPSHOT.pom
[JENKINS] Archiving <https://builds.apache.org/job/DeltaSpike_GF3/ws/deltaspike/modules/servlet/api/pom.xml>
to org.apache.deltaspike.modules/deltaspike-servlet-module-api/1.7.2-SNAPSHOT/deltaspike-servlet-module-api-1.7.2-SNAPSHOT.pom
[JENKINS] Archiving <https://builds.apache.org/job/DeltaSpike_GF3/ws/deltaspike/modules/jpa/pom.xml>
to org.apache.deltaspike.modules/jpa-module-project/1.7.2-SNAPSHOT/jpa-module-project-1.7.2-SNAPSHOT.pom
[JENKINS] Archiving <https://builds.apache.org/job/DeltaSpike_GF3/ws/deltaspike/cdictrl/pom.xml>
to org.apache.deltaspike.cdictrl/cdictrl-project/1.7.2-SNAPSHOT/cdictrl-project-1.7.2-SNAPSHOT.pom
[JENKINS] Archiving <https://builds.apache.org/job/DeltaSpike_GF3/ws/deltaspike/modules/scheduler/api/pom.xml>
to org.apache.deltaspike.modules/deltaspike-scheduler-module-api/1.7.2-SNAPSHOT/deltaspike-scheduler-module-api-1.7.2-SNAPSHOT.pom
[JENKINS] Archiving <https://builds.apache.org/job/DeltaSpike_GF3/ws/deltaspike/modules/test-control/impl/pom.xml>
to org.apache.deltaspike.modules/deltaspike-test-control-module-impl/1.7.2-SNAPSHOT/deltaspike-test-control-module-impl-1.7.2-SNAPSHOT.pom
[JENKINS] Archiving <https://builds.apache.org/job/DeltaSpike_GF3/ws/deltaspike/modules/servlet/pom.xml>
to org.apache.deltaspike.modules/servlet-module-project/1.7.2-SNAPSHOT/servlet-module-project-1.7.2-SNAPSHOT.pom
[JENKINS] Archiving <https://builds.apache.org/job/DeltaSpike_GF3/ws/deltaspike/modules/test-control/api/pom.xml>
to org.apache.deltaspike.modules/deltaspike-test-control-module-api/1.7.2-SNAPSHOT/deltaspike-test-control-module-api-1.7.2-SNAPSHOT.pom
[JENKINS] Archiving <https://builds.apache.org/job/DeltaSpike_GF3/ws/deltaspike/modules/jsf/impl-ee6/pom.xml>
to org.apache.deltaspike.modules/deltaspike-jsf-module-impl-ee6/1.7.2-SNAPSHOT/deltaspike-jsf-module-impl-ee6-1.7.2-SNAPSHOT.pom
[JENKINS] Archiving <https://builds.apache.org/job/DeltaSpike_GF3/ws/deltaspike/modules/proxy/pom.xml>
to org.apache.deltaspike.modules/proxy-module-project/1.7.2-SNAPSHOT/proxy-module-project-1.7.2-SNAPSHOT.pom
[JENKINS] Archiving <https://builds.apache.org/job/DeltaSpike_GF3/ws/deltaspike/modules/partial-bean/api/pom.xml>
to org.apache.deltaspike.modules/deltaspike-partial-bean-module-api/1.7.2-SNAPSHOT/deltaspike-partial-bean-module-api-1.7.2-SNAPSHOT.pom
[JENKINS] Archiving <https://builds.apache.org/job/DeltaSpike_GF3/ws/deltaspike/modules/scheduler/impl/pom.xml>
to org.apache.deltaspike.modules/deltaspike-scheduler-module-impl/1.7.2-SNAPSHOT/deltaspike-scheduler-module-impl-1.7.2-SNAPSHOT.pom
[JENKINS] Archiving <https://builds.apache.org/job/DeltaSpike_GF3/ws/deltaspike/parent/pom.xml>
to org.apache.deltaspike/parent/1.7.2-SNAPSHOT/parent-1.7.2-SNAPSHOT.pom
Compressed 40.41 KB of artifacts by 79.2% relative to #400
[JENKINS] Archiving <https://builds.apache.org/job/DeltaSpike_GF3/ws/deltaspike/core/pom.xml>
to org.apache.deltaspike.core/core-project/1.7.2-SNAPSHOT/core-project-1.7.2-SNAPSHOT.pom
[JENKINS] Archiving <https://builds.apache.org/job/DeltaSpike_GF3/ws/deltaspike/core/target/core-project-1.7.2-SNAPSHOT-tests.jar>
to org.apache.deltaspike.core/core-project/1.7.2-SNAPSHOT/core-project-1.7.2-SNAPSHOT-tests.jar
[JENKINS] Archiving <https://builds.apache.org/job/DeltaSpike_GF3/ws/deltaspike/modules/bean-validation/api/pom.xml>
to org.apache.deltaspike.modules/deltaspike-bean-validation-module-api/1.7.2-SNAPSHOT/deltaspike-bean-validation-module-api-1.7.2-SNAPSHOT.pom
[JENKINS] Archiving <https://builds.apache.org/job/DeltaSpike_GF3/ws/deltaspike/core/api/pom.xml>
to org.apache.deltaspike.core/deltaspike-core-api/1.7.2-SNAPSHOT/deltaspike-core-api-1.7.2-SNAPSHOT.pom
[JENKINS] Archiving <https://builds.apache.org/job/DeltaSpike_GF3/ws/deltaspike/core/api/target/deltaspike-core-api-1.7.2-SNAPSHOT.jar>
to org.apache.deltaspike.core/deltaspike-core-api/1.7.2-SNAPSHOT/deltaspike-core-api-1.7.2-SNAPSHOT.jar
[JENKINS] Archiving <https://builds.apache.org/job/DeltaSpike_GF3/ws/deltaspike/core/api/target/deltaspike-core-api-1.7.2-SNAPSHOT-tests.jar>
to org.apache.deltaspike.core/deltaspike-core-api/1.7.2-SNAPSHOT/deltaspike-core-api-1.7.2-SNAPSHOT-tests.jar
[JENKINS] Archiving <https://builds.apache.org/job/DeltaSpike_GF3/ws/deltaspike/core/api/target/deltaspike-core-api-1.7.2-SNAPSHOT-sources.jar>
to org.apache.deltaspike.core/deltaspike-core-api/1.7.2-SNAPSHOT/deltaspike-core-api-1.7.2-SNAPSHOT-sources.jar
[JENKINS] Archiving <https://builds.apache.org/job/DeltaSpike_GF3/ws/deltaspike/modules/security/impl/pom.xml>
to org.apache.deltaspike.modules/deltaspike-security-module-impl/1.7.2-SNAPSHOT/deltaspike-security-module-impl-1.7.2-SNAPSHOT.pom
[JENKINS] Archiving <https://builds.apache.org/job/DeltaSpike_GF3/ws/deltaspike/modules/scheduler/pom.xml>
to org.apache.deltaspike.modules/scheduler-module-project/1.7.2-SNAPSHOT/scheduler-module-project-1.7.2-SNAPSHOT.pom
[JENKINS] Archiving <https://builds.apache.org/job/DeltaSpike_GF3/ws/site/pom.xml> to
org.apache.deltaspike/deltaspike-site/1.7.2-SNAPSHOT/deltaspike-site-1.7.2-SNAPSHOT.pom
[JENKINS] Archiving <https://builds.apache.org/job/DeltaSpike_GF3/ws/deltaspike/modules/proxy/impl-asm5/pom.xml>
to org.apache.deltaspike.modules/deltaspike-proxy-module-impl-asm5/1.7.2-SNAPSHOT/deltaspike-proxy-module-impl-asm5-1.7.2-SNAPSHOT.pom
[JENKINS] Archiving <https://builds.apache.org/job/DeltaSpike_GF3/ws/deltaspike/examples/jsf-playground/pom.xml>
to org.apache.deltaspike.examples/deltaspike-jsf-playground/1.7.2-SNAPSHOT/deltaspike-jsf-playground-1.7.2-SNAPSHOT.pom
[JENKINS] Archiving <https://builds.apache.org/job/DeltaSpike_GF3/ws/deltaspike/modules/servlet/impl/pom.xml>
to org.apache.deltaspike.modules/deltaspike-servlet-module-impl/1.7.2-SNAPSHOT/deltaspike-servlet-module-impl-1.7.2-SNAPSHOT.pom
[JENKINS] Archiving <https://builds.apache.org/job/DeltaSpike_GF3/ws/deltaspike/modules/bean-validation/impl/pom.xml>
to org.apache.deltaspike.modules/deltaspike-bean-validation-module-impl/1.7.2-SNAPSHOT/deltaspike-bean-validation-module-impl-1.7.2-SNAPSHOT.pom
[JENKINS] Archiving <https://builds.apache.org/job/DeltaSpike_GF3/ws/pom.xml> to org.apache.deltaspike/deltaspike/1.7.2-SNAPSHOT/deltaspike-1.7.2-SNAPSHOT.pom
[JENKINS] Archiving <https://builds.apache.org/job/DeltaSpike_GF3/ws/deltaspike/modules/jpa/impl/pom.xml>
to org.apache.deltaspike.modules/deltaspike-jpa-module-impl/1.7.2-SNAPSHOT/deltaspike-jpa-module-impl-1.7.2-SNAPSHOT.pom
[JENKINS] Archiving <https://builds.apache.org/job/DeltaSpike_GF3/ws/deltaspike/modules/data/pom.xml>
to org.apache.deltaspike.modules/data-module-project/1.7.2-SNAPSHOT/data-module-project-1.7.2-SNAPSHOT.pom
[JENKINS] Archiving <https://builds.apache.org/job/DeltaSpike_GF3/ws/deltaspike/examples/security-requested-page-after-login-picketlink/pom.xml>
to org.apache.deltaspike.examples/deltaspike-security-requested-page-after-login-picketlink/1.7.2-SNAPSHOT/deltaspike-security-requested-page-after-login-picketlink-1.7.2-SNAPSHOT.pom
[JENKINS] Archiving <https://builds.apache.org/job/DeltaSpike_GF3/ws/deltaspike/pom.xml>
to org.apache.deltaspike/deltaspike-project/1.7.2-SNAPSHOT/deltaspike-project-1.7.2-SNAPSHOT.pom
[JENKINS] Archiving <https://builds.apache.org/job/DeltaSpike_GF3/ws/deltaspike/modules/security/api/pom.xml>
to org.apache.deltaspike.modules/deltaspike-security-module-api/1.7.2-SNAPSHOT/deltaspike-security-module-api-1.7.2-SNAPSHOT.pom
channel stopped

Mime
View raw message