deltaspike-commits mailing list archives

Site index · List index
Message view « Date » · « Thread »
Top « Date » · « Thread »
From Apache Jenkins Server <jenk...@builds.apache.org>
Subject Build failed in Jenkins: DeltaSpike_Wildfly_10 #112
Date Wed, 13 Jul 2016 07:54:04 GMT
See <https://builds.apache.org/job/DeltaSpike_Wildfly_10/112/changes>

Changes:

[johndament] DELTASPIKE-1181 Fixes for payara-build-managed-4 profile

[johndament] DELTASPIKE-645 squid:S2583 - Conditions should not unconditionally

[johndament] DELTASPIKE-645 squid:S2131 - Primitives should not be boxed just for

[johndament] DELTASPIKE-645 squid:S1155 - Collection.isEmpty() should be used to test

[johndament] DELTASPIKE-1060 Reactivate the EE 7 tests for Wildfly 10 only, disabling

------------------------------------------
[...truncated 1669 lines...]
jdk1.8.0_74/jre/lib/deploy/ffjcext.zip
jdk1.8.0_74/jre/lib/deploy/messages_pt_BR.properties
jdk1.8.0_74/jre/lib/deploy/messages_ko.properties
jdk1.8.0_74/jre/lib/deploy/messages_zh_TW.properties
jdk1.8.0_74/jre/lib/deploy/messages_it.properties
jdk1.8.0_74/jre/lib/deploy/MixedCodeMainDialogJs.ui
jdk1.8.0_74/jre/lib/deploy/messages_fr.properties
jdk1.8.0_74/jre/lib/deploy/java-icon.ico
jdk1.8.0_74/jre/lib/deploy/mixcode_s.png
jdk1.8.0_74/jre/lib/deploy/messages_de.properties
jdk1.8.0_74/jre/lib/deploy/messages_zh_CN.properties
jdk1.8.0_74/jre/lib/deploy/splash_11-lic.gif
jdk1.8.0_74/jre/lib/deploy/splash_11@2x-lic.gif
jdk1.8.0_74/jre/lib/deploy/splash.gif
jdk1.8.0_74/jre/lib/deploy/messages.properties
jdk1.8.0_74/jre/lib/deploy/splash@2x.gif
jdk1.8.0_74/jre/lib/deploy/messages_zh_HK.properties
jdk1.8.0_74/jre/lib/deploy/cautionshield.icns
jdk1.8.0_74/jre/lib/deploy/messages_es.properties
jdk1.8.0_74/jre/lib/deploy/messages_sv.properties
jdk1.8.0_74/jre/lib/fontconfig.properties.src
jdk1.8.0_74/jre/lib/jfr/
jdk1.8.0_74/jre/lib/jfr/profile.jfc
jdk1.8.0_74/jre/lib/jfr/default.jfc
jdk1.8.0_74/jre/lib/jvm.hprof.txt
jdk1.8.0_74/jre/lib/jce.jar
jdk1.8.0_74/jre/lib/calendars.properties
jdk1.8.0_74/jre/lib/fontconfig.SuSE.11.bfc
jdk1.8.0_74/jre/lib/logging.properties
jdk1.8.0_74/jre/lib/meta-index
jdk1.8.0_74/jre/lib/fontconfig.RedHat.5.bfc
jdk1.8.0_74/jre/lib/net.properties
jdk1.8.0_74/jre/lib/applet/
jdk1.8.0_74/jre/lib/psfontj2d.properties
jdk1.8.0_74/jre/LICENSE
jdk1.8.0_74/jre/bin/
jdk1.8.0_74/jre/bin/rmiregistry
jdk1.8.0_74/jre/bin/servertool
jdk1.8.0_74/jre/bin/orbd
jdk1.8.0_74/jre/bin/jcontrol
jdk1.8.0_74/jre/bin/unpack200
jdk1.8.0_74/jre/bin/tnameserv
jdk1.8.0_74/jre/bin/javaws
jdk1.8.0_74/jre/bin/keytool
jdk1.8.0_74/jre/bin/ControlPanel
jdk1.8.0_74/jre/bin/pack200
jdk1.8.0_74/jre/bin/java
jdk1.8.0_74/jre/bin/policytool
jdk1.8.0_74/jre/bin/rmid
jdk1.8.0_74/jre/bin/jjs
jdk1.8.0_74/jre/COPYRIGHT
jdk1.8.0_74/jre/README
jdk1.8.0_74/jre/plugin/
jdk1.8.0_74/jre/plugin/desktop/
jdk1.8.0_74/jre/plugin/desktop/sun_java.png
jdk1.8.0_74/jre/plugin/desktop/sun_java.desktop
jdk1.8.0_74/jre/Welcome.html
jdk1.8.0_74/README.html
jdk1.8.0_74/src.zip
jdk1.8.0_74/include/
jdk1.8.0_74/include/jvmticmlr.h
jdk1.8.0_74/include/jvmti.h
jdk1.8.0_74/include/linux/
jdk1.8.0_74/include/linux/jawt_md.h
jdk1.8.0_74/include/linux/jni_md.h
jdk1.8.0_74/include/jdwpTransport.h
jdk1.8.0_74/include/jni.h
jdk1.8.0_74/include/classfile_constants.h
jdk1.8.0_74/include/jawt.h
jdk1.8.0_74/man/
jdk1.8.0_74/man/ja
jdk1.8.0_74/man/man1/
jdk1.8.0_74/man/man1/java.1
jdk1.8.0_74/man/man1/jmc.1
jdk1.8.0_74/man/man1/xjc.1
jdk1.8.0_74/man/man1/jar.1
jdk1.8.0_74/man/man1/idlj.1
jdk1.8.0_74/man/man1/jsadebugd.1
jdk1.8.0_74/man/man1/appletviewer.1
jdk1.8.0_74/man/man1/javah.1
jdk1.8.0_74/man/man1/schemagen.1
jdk1.8.0_74/man/man1/servertool.1
jdk1.8.0_74/man/man1/jrunscript.1
jdk1.8.0_74/man/man1/javadoc.1
jdk1.8.0_74/man/man1/unpack200.1
jdk1.8.0_74/man/man1/javaws.1
jdk1.8.0_74/man/man1/policytool.1
jdk1.8.0_74/man/man1/jps.1
jdk1.8.0_74/man/man1/extcheck.1
jdk1.8.0_74/man/man1/jhat.1
jdk1.8.0_74/man/man1/wsgen.1
jdk1.8.0_74/man/man1/orbd.1
jdk1.8.0_74/man/man1/jstack.1
jdk1.8.0_74/man/man1/javafxpackager.1
jdk1.8.0_74/man/man1/javap.1
jdk1.8.0_74/man/man1/jstatd.1
jdk1.8.0_74/man/man1/rmiregistry.1
jdk1.8.0_74/man/man1/keytool.1
jdk1.8.0_74/man/man1/jarsigner.1
jdk1.8.0_74/man/man1/serialver.1
jdk1.8.0_74/man/man1/rmic.1
jdk1.8.0_74/man/man1/native2ascii.1
jdk1.8.0_74/man/man1/jjs.1
jdk1.8.0_74/man/man1/jvisualvm.1
jdk1.8.0_74/man/man1/rmid.1
jdk1.8.0_74/man/man1/jconsole.1
jdk1.8.0_74/man/man1/jdeps.1
jdk1.8.0_74/man/man1/jinfo.1
jdk1.8.0_74/man/man1/jdb.1
jdk1.8.0_74/man/man1/jmap.1
jdk1.8.0_74/man/man1/javac.1
jdk1.8.0_74/man/man1/wsimport.1
jdk1.8.0_74/man/man1/tnameserv.1
jdk1.8.0_74/man/man1/pack200.1
jdk1.8.0_74/man/man1/jcmd.1
jdk1.8.0_74/man/man1/javapackager.1
jdk1.8.0_74/man/man1/jstat.1
jdk1.8.0_74/man/ja_JP.UTF-8/
jdk1.8.0_74/man/ja_JP.UTF-8/man1/
jdk1.8.0_74/man/ja_JP.UTF-8/man1/java.1
jdk1.8.0_74/man/ja_JP.UTF-8/man1/jmc.1
jdk1.8.0_74/man/ja_JP.UTF-8/man1/xjc.1
jdk1.8.0_74/man/ja_JP.UTF-8/man1/jar.1
jdk1.8.0_74/man/ja_JP.UTF-8/man1/idlj.1
jdk1.8.0_74/man/ja_JP.UTF-8/man1/jsadebugd.1
jdk1.8.0_74/man/ja_JP.UTF-8/man1/appletviewer.1
jdk1.8.0_74/man/ja_JP.UTF-8/man1/javah.1
jdk1.8.0_74/man/ja_JP.UTF-8/man1/schemagen.1
jdk1.8.0_74/man/ja_JP.UTF-8/man1/servertool.1
jdk1.8.0_74/man/ja_JP.UTF-8/man1/jrunscript.1
jdk1.8.0_74/man/ja_JP.UTF-8/man1/javadoc.1
jdk1.8.0_74/man/ja_JP.UTF-8/man1/unpack200.1
jdk1.8.0_74/man/ja_JP.UTF-8/man1/javaws.1
jdk1.8.0_74/man/ja_JP.UTF-8/man1/policytool.1
jdk1.8.0_74/man/ja_JP.UTF-8/man1/jps.1
jdk1.8.0_74/man/ja_JP.UTF-8/man1/extcheck.1
jdk1.8.0_74/man/ja_JP.UTF-8/man1/jhat.1
jdk1.8.0_74/man/ja_JP.UTF-8/man1/wsgen.1
jdk1.8.0_74/man/ja_JP.UTF-8/man1/orbd.1
jdk1.8.0_74/man/ja_JP.UTF-8/man1/jstack.1
jdk1.8.0_74/man/ja_JP.UTF-8/man1/javafxpackager.1
jdk1.8.0_74/man/ja_JP.UTF-8/man1/javap.1
jdk1.8.0_74/man/ja_JP.UTF-8/man1/jstatd.1
jdk1.8.0_74/man/ja_JP.UTF-8/man1/rmiregistry.1
jdk1.8.0_74/man/ja_JP.UTF-8/man1/keytool.1
jdk1.8.0_74/man/ja_JP.UTF-8/man1/jarsigner.1
jdk1.8.0_74/man/ja_JP.UTF-8/man1/serialver.1
jdk1.8.0_74/man/ja_JP.UTF-8/man1/rmic.1
jdk1.8.0_74/man/ja_JP.UTF-8/man1/native2ascii.1
jdk1.8.0_74/man/ja_JP.UTF-8/man1/jjs.1
jdk1.8.0_74/man/ja_JP.UTF-8/man1/jvisualvm.1
jdk1.8.0_74/man/ja_JP.UTF-8/man1/rmid.1
jdk1.8.0_74/man/ja_JP.UTF-8/man1/jconsole.1
jdk1.8.0_74/man/ja_JP.UTF-8/man1/jdeps.1
jdk1.8.0_74/man/ja_JP.UTF-8/man1/jinfo.1
jdk1.8.0_74/man/ja_JP.UTF-8/man1/jdb.1
jdk1.8.0_74/man/ja_JP.UTF-8/man1/jmap.1
jdk1.8.0_74/man/ja_JP.UTF-8/man1/javac.1
jdk1.8.0_74/man/ja_JP.UTF-8/man1/wsimport.1
jdk1.8.0_74/man/ja_JP.UTF-8/man1/tnameserv.1
jdk1.8.0_74/man/ja_JP.UTF-8/man1/pack200.1
jdk1.8.0_74/man/ja_JP.UTF-8/man1/jcmd.1
jdk1.8.0_74/man/ja_JP.UTF-8/man1/javapackager.1
jdk1.8.0_74/man/ja_JP.UTF-8/man1/jstat.1
Building remotely on jenkins-test-3c9 (jenkins-cloud-4GB cloud-slave Ubuntu ubuntu jenkins-cloud-8GB)
in workspace <https://builds.apache.org/job/DeltaSpike_Wildfly_10/ws/>
Unpacking https://repo.maven.apache.org/maven2/org/apache/maven/apache-maven/3.3.3/apache-maven-3.3.3-bin.zip
to /home/jenkins/jenkins-slave/tools/hudson.tasks.Maven_MavenInstallation/maven-3.3.3 on jenkins-test-3c9
Cloning the remote Git repository
Cloning repository https://git-wip-us.apache.org/repos/asf/deltaspike.git
 > git init <https://builds.apache.org/job/DeltaSpike_Wildfly_10/ws/> # timeout=10
Fetching upstream changes from https://git-wip-us.apache.org/repos/asf/deltaspike.git
 > git --version # timeout=10
 > git -c core.askpass=true fetch --tags --progress https://git-wip-us.apache.org/repos/asf/deltaspike.git
+refs/heads/*:refs/remotes/origin/*
 > git config remote.origin.url https://git-wip-us.apache.org/repos/asf/deltaspike.git
# timeout=10
 > git config --add remote.origin.fetch +refs/heads/*:refs/remotes/origin/* # timeout=10
 > git config remote.origin.url https://git-wip-us.apache.org/repos/asf/deltaspike.git
# timeout=10
Fetching upstream changes from https://git-wip-us.apache.org/repos/asf/deltaspike.git
 > git -c core.askpass=true fetch --tags --progress https://git-wip-us.apache.org/repos/asf/deltaspike.git
+refs/heads/*:refs/remotes/origin/*
 > git rev-parse origin/master^{commit} # timeout=10
Checking out Revision f8896e3f85535f7f367164e7a22781b6cadd1e4c (origin/master)
 > git config core.sparsecheckout # timeout=10
 > git checkout -f f8896e3f85535f7f367164e7a22781b6cadd1e4c
 > git rev-list 92da915acc848ced9222ac7d3a9cdcfd52d2673c # timeout=10
Parsing POMs
Downloaded artifact http://repo.maven.apache.org/maven2/org/apache/apache/18/apache-18.pom
Failed to transfer Could not find artifact org.jboss.arquillian:arquillian-bom:pom:1.1.8.Final
in Apache Repository (https://repository.apache.org/content/repositories/releases)
Failed to transfer Could not find artifact org.jboss.arquillian:arquillian-bom:pom:1.1.8.Final
in Apache Snapshot Repository (https://repository.apache.org/content/repositories/snapshots)
Downloaded artifact http://repo.maven.apache.org/maven2/org/jboss/arquillian/arquillian-bom/1.1.8.Final/arquillian-bom-1.1.8.Final.pom
Failed to transfer Could not find artifact org.jboss.shrinkwrap:shrinkwrap-bom:pom:1.2.2 in
Apache Repository (https://repository.apache.org/content/repositories/releases)
Failed to transfer Could not find artifact org.jboss.shrinkwrap:shrinkwrap-bom:pom:1.2.2 in
Apache Snapshot Repository (https://repository.apache.org/content/repositories/snapshots)
Downloaded artifact http://repo.maven.apache.org/maven2/org/jboss/shrinkwrap/shrinkwrap-bom/1.2.2/shrinkwrap-bom-1.2.2.pom
Failed to transfer Could not find artifact org.jboss.shrinkwrap.resolver:shrinkwrap-resolver-bom:pom:2.1.1
in Apache Repository (https://repository.apache.org/content/repositories/releases)
Failed to transfer Could not find artifact org.jboss.shrinkwrap.resolver:shrinkwrap-resolver-bom:pom:2.1.1
in Apache Snapshot Repository (https://repository.apache.org/content/repositories/snapshots)
Downloaded artifact http://repo.maven.apache.org/maven2/org/jboss/shrinkwrap/resolver/shrinkwrap-resolver-bom/2.1.1/shrinkwrap-resolver-bom-2.1.1.pom
Failed to transfer Could not find artifact org.jboss.shrinkwrap.descriptors:shrinkwrap-descriptors-bom:pom:2.0.0-alpha-7
in Apache Repository (https://repository.apache.org/content/repositories/releases)
Failed to transfer Could not find artifact org.jboss.shrinkwrap.descriptors:shrinkwrap-descriptors-bom:pom:2.0.0-alpha-7
in Apache Snapshot Repository (https://repository.apache.org/content/repositories/snapshots)
Downloaded artifact http://repo.maven.apache.org/maven2/org/jboss/shrinkwrap/descriptors/shrinkwrap-descriptors-bom/2.0.0-alpha-7/shrinkwrap-descriptors-bom-2.0.0-alpha-7.pom
Failed to transfer Could not find artifact org.jboss.shrinkwrap.resolver:shrinkwrap-resolver-bom:pom:2.0.0
in Apache Repository (https://repository.apache.org/content/repositories/releases)
Failed to transfer Could not find artifact org.jboss.shrinkwrap.resolver:shrinkwrap-resolver-bom:pom:2.0.0
in Apache Snapshot Repository (https://repository.apache.org/content/repositories/snapshots)
Downloaded artifact http://repo.maven.apache.org/maven2/org/jboss/shrinkwrap/resolver/shrinkwrap-resolver-bom/2.0.0/shrinkwrap-resolver-bom-2.0.0.pom
ERROR: Failed to parse POMs
java.io.IOException: remote file operation failed: <https://builds.apache.org/job/DeltaSpike_Wildfly_10/ws/>
at hudson.remoting.Channel@1ac5531d:jenkins-test-3c9: hudson.remoting.ProxyException: hudson.maven.MavenModuleSetBuild$MavenExecutionException:
org.apache.maven.project.ProjectBuildingException: Some problems were encountered while processing
the POMs:
[FATAL] Non-resolvable parent POM: Could not find artifact org.apache.deltaspike.modules:data-module-project:pom:1.6.0-SNAPSHOT
and 'parent.relativePath' points at wrong local POM @ line 23, column 13

	at hudson.FilePath.act(FilePath.java:986)
	at hudson.FilePath.act(FilePath.java:968)
	at hudson.maven.MavenModuleSetBuild$MavenModuleSetBuildExecution.parsePoms(MavenModuleSetBuild.java:960)
	at hudson.maven.MavenModuleSetBuild$MavenModuleSetBuildExecution.doRun(MavenModuleSetBuild.java:679)
	at hudson.model.AbstractBuild$AbstractBuildExecution.run(AbstractBuild.java:534)
	at hudson.model.Run.execute(Run.java:1738)
	at hudson.maven.MavenModuleSetBuild.run(MavenModuleSetBuild.java:531)
	at hudson.model.ResourceController.execute(ResourceController.java:98)
	at hudson.model.Executor.run(Executor.java:410)
Caused by: hudson.remoting.ProxyException: hudson.maven.MavenModuleSetBuild$MavenExecutionException:
org.apache.maven.project.ProjectBuildingException: Some problems were encountered while processing
the POMs:
[FATAL] Non-resolvable parent POM: Could not find artifact org.apache.deltaspike.modules:data-module-project:pom:1.6.0-SNAPSHOT
and 'parent.relativePath' points at wrong local POM @ line 23, column 13

	at hudson.maven.MavenModuleSetBuild$PomParser.invoke(MavenModuleSetBuild.java:1364)
	at hudson.maven.MavenModuleSetBuild$PomParser.invoke(MavenModuleSetBuild.java:1098)
	at hudson.FilePath$FileCallableWrapper.call(FilePath.java:2719)
	at hudson.remoting.UserRequest.perform(UserRequest.java:120)
	at hudson.remoting.UserRequest.perform(UserRequest.java:48)
	at hudson.remoting.Request$2.run(Request.java:326)
	at hudson.remoting.InterceptingExecutorService$1.call(InterceptingExecutorService.java:68)
	at java.util.concurrent.FutureTask.run(FutureTask.java:262)
	at java.util.concurrent.ThreadPoolExecutor.runWorker(ThreadPoolExecutor.java:1145)
	at java.util.concurrent.ThreadPoolExecutor$Worker.run(ThreadPoolExecutor.java:615)
	at java.lang.Thread.run(Thread.java:745)
	at ......remote call to jenkins-test-3c9(Native Method)
	at hudson.remoting.Channel.attachCallSiteStackTrace(Channel.java:1416)
	at hudson.remoting.UserResponse.retrieve(UserRequest.java:220)
	at hudson.remoting.Channel.call(Channel.java:781)
	at hudson.FilePath.act(FilePath.java:979)
	... 8 more
Caused by: hudson.remoting.ProxyException: org.apache.maven.project.ProjectBuildingException:
Some problems were encountered while processing the POMs:
[FATAL] Non-resolvable parent POM: Could not find artifact org.apache.deltaspike.modules:data-module-project:pom:1.6.0-SNAPSHOT
and 'parent.relativePath' points at wrong local POM @ line 23, column 13

	at org.apache.maven.project.DefaultProjectBuilder.build(DefaultProjectBuilder.java:364)
	at hudson.maven.MavenEmbedder.buildProjects(MavenEmbedder.java:361)
	at hudson.maven.MavenEmbedder.readProjects(MavenEmbedder.java:331)
	at hudson.maven.MavenModuleSetBuild$PomParser.invoke(MavenModuleSetBuild.java:1301)
	at hudson.maven.MavenModuleSetBuild$PomParser.invoke(MavenModuleSetBuild.java:1098)
	at hudson.FilePath$FileCallableWrapper.call(FilePath.java:2719)
	at hudson.remoting.UserRequest.perform(UserRequest.java:120)
	at hudson.remoting.UserRequest.perform(UserRequest.java:48)
	at hudson.remoting.Request$2.run(Request.java:326)
	at hudson.remoting.InterceptingExecutorService$1.call(InterceptingExecutorService.java:68)
	at java.util.concurrent.FutureTask.run(FutureTask.java:262)
	at java.util.concurrent.ThreadPoolExecutor.runWorker(ThreadPoolExecutor.java:1145)
	at java.util.concurrent.ThreadPoolExecutor$Worker.run(ThreadPoolExecutor.java:615)
	at java.lang.Thread.run(Thread.java:745)

Mime
View raw message