deltaspike-commits mailing list archives

Site index · List index
Message view « Date » · « Thread »
Top « Date » · « Thread »
From Apache Jenkins Server <jenk...@builds.apache.org>
Subject Build failed in Jenkins: DeltaSpike Examples #1221
Date Tue, 07 Jun 2016 14:10:38 GMT
See <https://builds.apache.org/job/DeltaSpike%20Examples/1221/changes>

Changes:

[johndament] DELTASPIKE-1165 Added support for Streams within a repository.  Added

[johndament] DELTASPIKE-1160 use return type of query method in native queries to

[johndament] DELTASPIKE-1160 Added some docs explaining the new feature.

[johndament] DELTASPIKE-1160 Added tests for Java 8 + primitive return type.

[johndament] DELTASPIKE-1165 Clean up old tests from the pre-java8 module.

------------------------------------------
Started by upstream project "DeltaSpike Deploy" build number 1498
originally caused by:
 Started by timer
 Started by an SCM change
[EnvInject] - Loading node environment variables.
Building remotely on jenkins-test-341 (jenkins-cloud-4GB cloud-slave Ubuntu ubuntu jenkins-cloud-8GB)
in workspace <https://builds.apache.org/job/DeltaSpike%20Examples/ws/>
Unpacking https://repo.maven.apache.org/maven2/org/apache/maven/apache-maven/3.0.4/apache-maven-3.0.4-bin.zip
to /home/jenkins/tools/maven/apache-maven-3.0.4 on jenkins-test-341
Cloning the remote Git repository
Cloning repository https://git-wip-us.apache.org/repos/asf/deltaspike.git
 > git init <https://builds.apache.org/job/DeltaSpike%20Examples/ws/> # timeout=10
Fetching upstream changes from https://git-wip-us.apache.org/repos/asf/deltaspike.git
 > git --version # timeout=10
 > git -c core.askpass=true fetch --tags --progress https://git-wip-us.apache.org/repos/asf/deltaspike.git
+refs/heads/*:refs/remotes/origin/*
 > git config remote.origin.url https://git-wip-us.apache.org/repos/asf/deltaspike.git
# timeout=10
 > git config --add remote.origin.fetch +refs/heads/*:refs/remotes/origin/* # timeout=10
 > git config remote.origin.url https://git-wip-us.apache.org/repos/asf/deltaspike.git
# timeout=10
Fetching upstream changes from https://git-wip-us.apache.org/repos/asf/deltaspike.git
 > git -c core.askpass=true fetch --tags --progress https://git-wip-us.apache.org/repos/asf/deltaspike.git
+refs/heads/*:refs/remotes/origin/*
Seen branch in repository origin/deltaspike-0.1-incubating
Seen branch in repository origin/deltaspike-0.2-incubating
Seen branch in repository origin/deltaspike-0.3-incubating
Seen branch in repository origin/deltaspike-0.4
Seen branch in repository origin/deltaspike-0.5
Seen branch in repository origin/deltaspike-0.6
Seen branch in repository origin/deltaspike-0.7
Seen branch in repository origin/deltaspike-1.0.0
Seen branch in repository origin/deltaspike-1.0.1
Seen branch in repository origin/deltaspike-1.0.2
Seen branch in repository origin/deltaspike-1.0.3
Seen branch in repository origin/deltaspike-1.1.0
Seen branch in repository origin/deltaspike-1.2.0
Seen branch in repository origin/deltaspike-1.2.1
Seen branch in repository origin/ds-1.4.0
Seen branch in repository origin/ds-1.4.1
Seen branch in repository origin/ds-1.4.2
Seen branch in repository origin/ds-1.5.0
Seen branch in repository origin/ds-1.5.1
Seen branch in repository origin/ds-1.5.2
Seen branch in repository origin/ds-1.5.3
Seen branch in repository origin/ds-1.5.4
Seen branch in repository origin/ds-1.6.0
Seen branch in repository origin/ds-1.6.1
Seen branch in repository origin/master
Seen 25 remote branches
Checking out Revision f47b9d30528b6ab9574e078ff0ddff303135d144 (origin/master)
 > git config core.sparsecheckout # timeout=10
 > git checkout -f f47b9d30528b6ab9574e078ff0ddff303135d144
 > git rev-list 42a7ddf01b8db786487c67f1e6d63710f6f562a1 # timeout=10
Parsing POMs
ERROR: Failed to parse POMs
java.io.IOException: remote file operation failed: <https://builds.apache.org/job/DeltaSpike%20Examples/ws/>
at hudson.remoting.Channel@68e56d17:jenkins-test-341: hudson.remoting.ProxyException: hudson.maven.MavenModuleSetBuild$MavenExecutionException:
hudson.maven.MavenEmbedderException: 1 problem was encountered while building the effective
settings
[FATAL] Non-parseable settings /home/jenkins/.m2/settings.xml: unexpected character in markup
% (position: START_TAG seen ...</username>\n     <password><%... @14:18)  @
/home/jenkins/.m2/settings.xml, line 14, column 18

	at hudson.FilePath.act(FilePath.java:986)
	at hudson.FilePath.act(FilePath.java:968)
	at hudson.maven.MavenModuleSetBuild$MavenModuleSetBuildExecution.parsePoms(MavenModuleSetBuild.java:960)
	at hudson.maven.MavenModuleSetBuild$MavenModuleSetBuildExecution.doRun(MavenModuleSetBuild.java:679)
	at hudson.model.AbstractBuild$AbstractBuildExecution.run(AbstractBuild.java:534)
	at hudson.model.Run.execute(Run.java:1738)
	at hudson.maven.MavenModuleSetBuild.run(MavenModuleSetBuild.java:531)
	at hudson.model.ResourceController.execute(ResourceController.java:98)
	at hudson.model.Executor.run(Executor.java:410)
Caused by: hudson.remoting.ProxyException: hudson.maven.MavenModuleSetBuild$MavenExecutionException:
hudson.maven.MavenEmbedderException: 1 problem was encountered while building the effective
settings
[FATAL] Non-parseable settings /home/jenkins/.m2/settings.xml: unexpected character in markup
% (position: START_TAG seen ...</username>\n     <password><%... @14:18)  @
/home/jenkins/.m2/settings.xml, line 14, column 18

	at hudson.maven.MavenModuleSetBuild$PomParser.invoke(MavenModuleSetBuild.java:1362)
	at hudson.maven.MavenModuleSetBuild$PomParser.invoke(MavenModuleSetBuild.java:1098)
	at hudson.FilePath$FileCallableWrapper.call(FilePath.java:2719)
	at hudson.remoting.UserRequest.perform(UserRequest.java:120)
	at hudson.remoting.UserRequest.perform(UserRequest.java:48)
	at hudson.remoting.Request$2.run(Request.java:326)
	at hudson.remoting.InterceptingExecutorService$1.call(InterceptingExecutorService.java:68)
	at java.util.concurrent.FutureTask.run(FutureTask.java:262)
	at java.util.concurrent.ThreadPoolExecutor.runWorker(ThreadPoolExecutor.java:1145)
	at java.util.concurrent.ThreadPoolExecutor$Worker.run(ThreadPoolExecutor.java:615)
	at java.lang.Thread.run(Thread.java:745)
	at ......remote call to jenkins-test-341(Native Method)
	at hudson.remoting.Channel.attachCallSiteStackTrace(Channel.java:1416)
	at hudson.remoting.UserResponse.retrieve(UserRequest.java:220)
	at hudson.remoting.Channel.call(Channel.java:781)
	at hudson.FilePath.act(FilePath.java:979)
	... 8 more
Caused by: hudson.remoting.ProxyException: hudson.maven.MavenEmbedderException: 1 problem
was encountered while building the effective settings
[FATAL] Non-parseable settings /home/jenkins/.m2/settings.xml: unexpected character in markup
% (position: START_TAG seen ...</username>\n     <password><%... @14:18)  @
/home/jenkins/.m2/settings.xml, line 14, column 18

	at hudson.maven.MavenEmbedder.<init>(MavenEmbedder.java:128)
	at hudson.maven.MavenEmbedder.<init>(MavenEmbedder.java:109)
	at hudson.maven.MavenEmbedder.<init>(MavenEmbedder.java:136)
	at hudson.maven.MavenUtil.createEmbedder(MavenUtil.java:212)
	at hudson.maven.MavenModuleSetBuild$PomParser.invoke(MavenModuleSetBuild.java:1295)
	at hudson.maven.MavenModuleSetBuild$PomParser.invoke(MavenModuleSetBuild.java:1098)
	at hudson.FilePath$FileCallableWrapper.call(FilePath.java:2719)
	at hudson.remoting.UserRequest.perform(UserRequest.java:120)
	at hudson.remoting.UserRequest.perform(UserRequest.java:48)
	at hudson.remoting.Request$2.run(Request.java:326)
	at hudson.remoting.InterceptingExecutorService$1.call(InterceptingExecutorService.java:68)
	at java.util.concurrent.FutureTask.run(FutureTask.java:262)
	at java.util.concurrent.ThreadPoolExecutor.runWorker(ThreadPoolExecutor.java:1145)
	at java.util.concurrent.ThreadPoolExecutor$Worker.run(ThreadPoolExecutor.java:615)
	at java.lang.Thread.run(Thread.java:745)
Caused by: hudson.remoting.ProxyException: hudson.maven.MavenEmbedderException: 1 problem
was encountered while building the effective settings
[FATAL] Non-parseable settings /home/jenkins/.m2/settings.xml: unexpected character in markup
% (position: START_TAG seen ...</username>\n     <password><%... @14:18)  @
/home/jenkins/.m2/settings.xml, line 14, column 18

	at hudson.maven.MavenEmbedder.getSettings(MavenEmbedder.java:261)
	at hudson.maven.MavenEmbedder.buildMavenExecutionRequest(MavenEmbedder.java:157)
	at hudson.maven.MavenEmbedder.<init>(MavenEmbedder.java:120)
	... 14 more
Caused by: hudson.remoting.ProxyException: org.apache.maven.settings.building.SettingsBuildingException:
1 problem was encountered while building the effective settings
[FATAL] Non-parseable settings /home/jenkins/.m2/settings.xml: unexpected character in markup
% (position: START_TAG seen ...</username>\n     <password><%... @14:18)  @
/home/jenkins/.m2/settings.xml, line 14, column 18

	at org.apache.maven.settings.building.DefaultSettingsBuilder.build(DefaultSettingsBuilder.java:116)
	at hudson.maven.MavenEmbedder.getSettings(MavenEmbedder.java:259)
	... 16 more

Mime
View raw message