deltaspike-commits mailing list archives

Site index · List index
Message view « Date » · « Thread »
Top « Date » · « Thread »
From Apache Jenkins Server <jenk...@builds.apache.org>
Subject Build failed in Jenkins: DeltaSpike Weld 2.0.0 #667
Date Fri, 24 Jun 2016 03:29:52 GMT
See <https://builds.apache.org/job/DeltaSpike%20Weld%202.0.0/667/changes>

Changes:

[johndament] [maven-release-plugin] prepare release deltaspike-1.7.0

[johndament] [maven-release-plugin] prepare for next development iteration

[johndament] DELTASPIKE-1175 Update weld profiles to match dependency structure.

[johndament] DELTASPIKE-1166 Set the new versions and prep for the next release

[johndament] DELTASPIKE-1166 Updating site for 1.7.0 release.

[johndament] DELTASPIKE-1166 Merge issue, updated parent artifact for cdictrl.

[johndament] DELTASPIKE-1173 Add an annotation to the bean to make it registered by

------------------------------------------
Started by upstream project "DeltaSpike for CDI 1.1 and 1.2" build number 25
originally caused by:
 Started by an SCM change
[EnvInject] - Loading node environment variables.
Building remotely on H11 (docker Ubuntu ubuntu yahoo-not-h2) in workspace <https://builds.apache.org/job/DeltaSpike%20Weld%202.0.0/ws/>
 > git rev-parse --is-inside-work-tree # timeout=10
Fetching changes from the remote Git repository
 > git config remote.origin.url https://git-wip-us.apache.org/repos/asf/deltaspike.git
# timeout=10
Fetching upstream changes from https://git-wip-us.apache.org/repos/asf/deltaspike.git
 > git --version # timeout=10
 > git -c core.askpass=true fetch --tags --progress https://git-wip-us.apache.org/repos/asf/deltaspike.git
+refs/heads/*:refs/remotes/origin/*
 > git rev-parse origin/master^{commit} # timeout=10
Checking out Revision e865363e0f2381428f09aef26a91e6bce8f81a7a (origin/master)
 > git config core.sparsecheckout # timeout=10
 > git checkout -f e865363e0f2381428f09aef26a91e6bce8f81a7a
 > git rev-list 2418bf4a82e38ef364cb6085bce1d88d6a52e9a7 # timeout=10
Parsing POMs
Modules changed, recalculating dependency graph
Established TCP socket on 60107
maven3-agent.jar already up to date
maven3-interceptor.jar already up to date
maven3-interceptor-commons.jar already up to date
[DeltaSpike Weld 2.0.0] $ /home/jenkins/jenkins-slave/tools/hudson.model.JDK/JDK_1.7_latest_/bin/java
-Xmx2g -Xms256m -XX:MaxPermSize=512m -cp /home/jenkins/jenkins-slave/maven3-agent.jar:/home/jenkins/tools/maven/apache-maven-3.0.4/boot/plexus-classworlds-2.4.jar
org.jvnet.hudson.maven3.agent.Maven3Main /home/jenkins/tools/maven/apache-maven-3.0.4 /home/jenkins/jenkins-slave/slave.jar
/home/jenkins/jenkins-slave/maven3-interceptor.jar /home/jenkins/jenkins-slave/maven3-interceptor-commons.jar
60107
<===[JENKINS REMOTING CAPACITY]===>   channel started
Executing Maven:  -B -f <https://builds.apache.org/job/DeltaSpike%20Weld%202.0.0/ws/pom.xml>
-Dmaven.repo.local=/home/jenkins/jenkins-slave/maven-repositories/1 clean install -PWeld2
-Dweld.version=2.0.0.Final
[INFO] Scanning for projects...
[ERROR] The build could not read 4 projects -> [Help 1]
[ERROR]   
[ERROR]   The project org.apache.deltaspike:parent-code:1.7.1-SNAPSHOT (<https://builds.apache.org/job/DeltaSpike%20Weld%202.0.0/ws/deltaspike/parent/code/pom.xml)>
has 1 error
[ERROR]     'dependencies.dependency.version' for org.jboss.weld:weld-core-impl:jar is missing.
@ line 436, column 29
[ERROR]   
[ERROR]   The project org.apache.deltaspike.core:core-project:1.7.1-SNAPSHOT (<https://builds.apache.org/job/DeltaSpike%20Weld%202.0.0/ws/deltaspike/core/pom.xml)>
has 1 error
[ERROR]     'dependencies.dependency.version' for org.jboss.weld:weld-core-impl:jar is missing.
@ org.apache.deltaspike:parent-code:1.7.1-SNAPSHOT, <https://builds.apache.org/job/DeltaSpike%20Weld%202.0.0/ws/deltaspike/parent/code/pom.xml,>
line 436, column 29
[ERROR]   
[ERROR]   The project org.apache.deltaspike.cdictrl:cdictrl-project:1.7.1-SNAPSHOT (<https://builds.apache.org/job/DeltaSpike%20Weld%202.0.0/ws/deltaspike/cdictrl/pom.xml)>
has 1 error
[ERROR]     'dependencies.dependency.version' for org.jboss.weld:weld-core-impl:jar is missing.
@ org.apache.deltaspike:parent-code:1.7.1-SNAPSHOT, <https://builds.apache.org/job/DeltaSpike%20Weld%202.0.0/ws/deltaspike/parent/code/pom.xml,>
line 436, column 29
[ERROR]   
[ERROR]   The project org.apache.deltaspike.modules:modules-project:1.7.1-SNAPSHOT (<https://builds.apache.org/job/DeltaSpike%20Weld%202.0.0/ws/deltaspike/modules/pom.xml)>
has 1 error
[ERROR]     'dependencies.dependency.version' for org.jboss.weld:weld-core-impl:jar is missing.
@ org.apache.deltaspike:parent-code:1.7.1-SNAPSHOT, <https://builds.apache.org/job/DeltaSpike%20Weld%202.0.0/ws/deltaspike/parent/code/pom.xml,>
line 436, column 29
[ERROR] 
[ERROR] To see the full stack trace of the errors, re-run Maven with the -e switch.
[ERROR] Re-run Maven using the -X switch to enable full debug logging.
[ERROR] 
[ERROR] For more information about the errors and possible solutions, please read the following
articles:
[ERROR] [Help 1] http://cwiki.apache.org/confluence/display/MAVEN/ProjectBuildingException
channel stopped

Mime
View raw message