deltaspike-commits mailing list archives

Site index · List index
Message view « Date » · « Thread »
Top « Date » · « Thread »
From Apache Jenkins Server <jenk...@builds.apache.org>
Subject Build failed in Jenkins: DeltaSpike OWB 1.6.2 #193
Date Sun, 19 Jun 2016 23:25:24 GMT
See <https://builds.apache.org/job/DeltaSpike%20OWB%201.6.2/193/changes>

Changes:

[johndament] [maven-release-plugin] prepare release deltaspike-1.7.0

[johndament] [maven-release-plugin] prepare for next development iteration

[johndament] DELTASPIKE-1166 Set the new versions and prep for the next release

------------------------------------------
Started by an SCM change
[EnvInject] - Loading node environment variables.
Building remotely on ubuntu-2 (docker Ubuntu ubuntu yahoo-not-h2) in workspace <https://builds.apache.org/job/DeltaSpike%20OWB%201.6.2/ws/>
Cloning the remote Git repository
Cloning repository https://git-wip-us.apache.org/repos/asf/deltaspike.git
 > git init <https://builds.apache.org/job/DeltaSpike%20OWB%201.6.2/ws/> # timeout=10
Fetching upstream changes from https://git-wip-us.apache.org/repos/asf/deltaspike.git
 > git --version # timeout=10
 > git -c core.askpass=true fetch --tags --progress https://git-wip-us.apache.org/repos/asf/deltaspike.git
+refs/heads/*:refs/remotes/origin/*
 > git config remote.origin.url https://git-wip-us.apache.org/repos/asf/deltaspike.git
# timeout=10
 > git config --add remote.origin.fetch +refs/heads/*:refs/remotes/origin/* # timeout=10
 > git config remote.origin.url https://git-wip-us.apache.org/repos/asf/deltaspike.git
# timeout=10
Fetching upstream changes from https://git-wip-us.apache.org/repos/asf/deltaspike.git
 > git -c core.askpass=true fetch --tags --progress https://git-wip-us.apache.org/repos/asf/deltaspike.git
+refs/heads/*:refs/remotes/origin/*
Seen branch in repository origin/deltaspike-0.1-incubating
Seen branch in repository origin/deltaspike-0.2-incubating
Seen branch in repository origin/deltaspike-0.3-incubating
Seen branch in repository origin/deltaspike-0.4
Seen branch in repository origin/deltaspike-0.5
Seen branch in repository origin/deltaspike-0.6
Seen branch in repository origin/deltaspike-0.7
Seen branch in repository origin/deltaspike-1.0.0
Seen branch in repository origin/deltaspike-1.0.1
Seen branch in repository origin/deltaspike-1.0.2
Seen branch in repository origin/deltaspike-1.0.3
Seen branch in repository origin/deltaspike-1.1.0
Seen branch in repository origin/deltaspike-1.2.0
Seen branch in repository origin/deltaspike-1.2.1
Seen branch in repository origin/ds-1.4.0
Seen branch in repository origin/ds-1.4.1
Seen branch in repository origin/ds-1.4.2
Seen branch in repository origin/ds-1.5.0
Seen branch in repository origin/ds-1.5.1
Seen branch in repository origin/ds-1.5.2
Seen branch in repository origin/ds-1.5.3
Seen branch in repository origin/ds-1.5.4
Seen branch in repository origin/ds-1.6.0
Seen branch in repository origin/ds-1.6.1
Seen branch in repository origin/ds-1.7.0
Seen branch in repository origin/master
Seen 26 remote branches
Checking out Revision c3ddeb236aac02b09bae43bf917c1db329f0b9eb (origin/master)
 > git config core.sparsecheckout # timeout=10
 > git checkout -f c3ddeb236aac02b09bae43bf917c1db329f0b9eb
 > git rev-list 03347f02faf5fff9bd5ea75a3d35263bed22cdc7 # timeout=10
Parsing POMs
ERROR: Failed to parse POMs
java.io.IOException: remote file operation failed: <https://builds.apache.org/job/DeltaSpike%20OWB%201.6.2/ws/>
at hudson.remoting.Channel@1d9e79b0:ubuntu-2: hudson.remoting.ProxyException: hudson.maven.MavenModuleSetBuild$MavenExecutionException:
org.apache.maven.project.ProjectBuildingException: Some problems were encountered while processing
the POMs:
[WARNING] 'parent.relativePath' points at org.apache.deltaspike:parent-code instead of org.apache.deltaspike:parent,
please verify your project structure @ line 23, column 13
[FATAL] Non-resolvable parent POM: Could not find artifact org.apache.deltaspike:parent:pom:1.7.1-SNAPSHOT
and 'parent.relativePath' points at wrong local POM @ line 23, column 13

	at hudson.FilePath.act(FilePath.java:986)
	at hudson.FilePath.act(FilePath.java:968)
	at hudson.maven.MavenModuleSetBuild$MavenModuleSetBuildExecution.parsePoms(MavenModuleSetBuild.java:960)
	at hudson.maven.MavenModuleSetBuild$MavenModuleSetBuildExecution.doRun(MavenModuleSetBuild.java:679)
	at hudson.model.AbstractBuild$AbstractBuildExecution.run(AbstractBuild.java:534)
	at hudson.model.Run.execute(Run.java:1738)
	at hudson.maven.MavenModuleSetBuild.run(MavenModuleSetBuild.java:531)
	at hudson.model.ResourceController.execute(ResourceController.java:98)
	at hudson.model.Executor.run(Executor.java:410)
Caused by: hudson.remoting.ProxyException: hudson.maven.MavenModuleSetBuild$MavenExecutionException:
org.apache.maven.project.ProjectBuildingException: Some problems were encountered while processing
the POMs:
[WARNING] 'parent.relativePath' points at org.apache.deltaspike:parent-code instead of org.apache.deltaspike:parent,
please verify your project structure @ line 23, column 13
[FATAL] Non-resolvable parent POM: Could not find artifact org.apache.deltaspike:parent:pom:1.7.1-SNAPSHOT
and 'parent.relativePath' points at wrong local POM @ line 23, column 13

	at hudson.maven.MavenModuleSetBuild$PomParser.invoke(MavenModuleSetBuild.java:1364)
	at hudson.maven.MavenModuleSetBuild$PomParser.invoke(MavenModuleSetBuild.java:1098)
	at hudson.FilePath$FileCallableWrapper.call(FilePath.java:2719)
	at hudson.remoting.UserRequest.perform(UserRequest.java:120)
	at hudson.remoting.UserRequest.perform(UserRequest.java:48)
	at hudson.remoting.Request$2.run(Request.java:326)
	at hudson.remoting.InterceptingExecutorService$1.call(InterceptingExecutorService.java:68)
	at java.util.concurrent.FutureTask.run(FutureTask.java:262)
	at java.util.concurrent.ThreadPoolExecutor.runWorker(ThreadPoolExecutor.java:1145)
	at java.util.concurrent.ThreadPoolExecutor$Worker.run(ThreadPoolExecutor.java:615)
	at java.lang.Thread.run(Thread.java:745)
	at ......remote call to ubuntu-2(Native Method)
	at hudson.remoting.Channel.attachCallSiteStackTrace(Channel.java:1416)
	at hudson.remoting.UserResponse.retrieve(UserRequest.java:220)
	at hudson.remoting.Channel.call(Channel.java:781)
	at hudson.FilePath.act(FilePath.java:979)
	... 8 more
Caused by: hudson.remoting.ProxyException: org.apache.maven.project.ProjectBuildingException:
Some problems were encountered while processing the POMs:
[WARNING] 'parent.relativePath' points at org.apache.deltaspike:parent-code instead of org.apache.deltaspike:parent,
please verify your project structure @ line 23, column 13
[FATAL] Non-resolvable parent POM: Could not find artifact org.apache.deltaspike:parent:pom:1.7.1-SNAPSHOT
and 'parent.relativePath' points at wrong local POM @ line 23, column 13

	at org.apache.maven.project.DefaultProjectBuilder.build(DefaultProjectBuilder.java:364)
	at hudson.maven.MavenEmbedder.buildProjects(MavenEmbedder.java:361)
	at hudson.maven.MavenEmbedder.readProjects(MavenEmbedder.java:331)
	at hudson.maven.MavenModuleSetBuild$PomParser.invoke(MavenModuleSetBuild.java:1301)
	at hudson.maven.MavenModuleSetBuild$PomParser.invoke(MavenModuleSetBuild.java:1098)
	at hudson.FilePath$FileCallableWrapper.call(FilePath.java:2719)
	at hudson.remoting.UserRequest.perform(UserRequest.java:120)
	at hudson.remoting.UserRequest.perform(UserRequest.java:48)
	at hudson.remoting.Request$2.run(Request.java:326)
	at hudson.remoting.InterceptingExecutorService$1.call(InterceptingExecutorService.java:68)
	at java.util.concurrent.FutureTask.run(FutureTask.java:262)
	at java.util.concurrent.ThreadPoolExecutor.runWorker(ThreadPoolExecutor.java:1145)
	at java.util.concurrent.ThreadPoolExecutor$Worker.run(ThreadPoolExecutor.java:615)
	at java.lang.Thread.run(Thread.java:745)

Mime
View raw message