deltaspike-commits mailing list archives

Site index · List index
Message view « Date » · « Thread »
Top « Date » · « Thread »
From Apache Jenkins Server <jenk...@builds.apache.org>
Subject Build failed in Jenkins: DeltaSpike_Wildfly_10 #99
Date Sat, 04 Jun 2016 07:20:01 GMT
See <https://builds.apache.org/job/DeltaSpike_Wildfly_10/99/changes>

Changes:

[tandraschko] DELTASPIKE-1161 [perf] avoid Instance#Select

[tandraschko] DELTASPIKE-1161 [perf] avoid Instance#Select

[tandraschko] DELTASPIKE-1161 [perf] avoid Instance#Select

[johndament] DELTASPIKE-1159 Switched to a dependency management section.  Update to

[johndament] DELTASPIKE-1166 Reset pom files to 1.7.0

------------------------------------------
[...truncated 1667 lines...]
jdk1.8.0_74/jre/lib/deploy/MixedCodeMainDialog.ui
jdk1.8.0_74/jre/lib/deploy/messages_ja.properties
jdk1.8.0_74/jre/lib/deploy/ffjcext.zip
jdk1.8.0_74/jre/lib/deploy/messages_pt_BR.properties
jdk1.8.0_74/jre/lib/deploy/messages_ko.properties
jdk1.8.0_74/jre/lib/deploy/messages_zh_TW.properties
jdk1.8.0_74/jre/lib/deploy/messages_it.properties
jdk1.8.0_74/jre/lib/deploy/MixedCodeMainDialogJs.ui
jdk1.8.0_74/jre/lib/deploy/messages_fr.properties
jdk1.8.0_74/jre/lib/deploy/java-icon.ico
jdk1.8.0_74/jre/lib/deploy/mixcode_s.png
jdk1.8.0_74/jre/lib/deploy/messages_de.properties
jdk1.8.0_74/jre/lib/deploy/messages_zh_CN.properties
jdk1.8.0_74/jre/lib/deploy/splash_11-lic.gif
jdk1.8.0_74/jre/lib/deploy/splash_11@2x-lic.gif
jdk1.8.0_74/jre/lib/deploy/splash.gif
jdk1.8.0_74/jre/lib/deploy/messages.properties
jdk1.8.0_74/jre/lib/deploy/splash@2x.gif
jdk1.8.0_74/jre/lib/deploy/messages_zh_HK.properties
jdk1.8.0_74/jre/lib/deploy/cautionshield.icns
jdk1.8.0_74/jre/lib/deploy/messages_es.properties
jdk1.8.0_74/jre/lib/deploy/messages_sv.properties
jdk1.8.0_74/jre/lib/fontconfig.properties.src
jdk1.8.0_74/jre/lib/jfr/
jdk1.8.0_74/jre/lib/jfr/profile.jfc
jdk1.8.0_74/jre/lib/jfr/default.jfc
jdk1.8.0_74/jre/lib/jvm.hprof.txt
jdk1.8.0_74/jre/lib/jce.jar
jdk1.8.0_74/jre/lib/calendars.properties
jdk1.8.0_74/jre/lib/fontconfig.SuSE.11.bfc
jdk1.8.0_74/jre/lib/logging.properties
jdk1.8.0_74/jre/lib/meta-index
jdk1.8.0_74/jre/lib/fontconfig.RedHat.5.bfc
jdk1.8.0_74/jre/lib/net.properties
jdk1.8.0_74/jre/lib/applet/
jdk1.8.0_74/jre/lib/psfontj2d.properties
jdk1.8.0_74/jre/LICENSE
jdk1.8.0_74/jre/bin/
jdk1.8.0_74/jre/bin/rmiregistry
jdk1.8.0_74/jre/bin/servertool
jdk1.8.0_74/jre/bin/orbd
jdk1.8.0_74/jre/bin/jcontrol
jdk1.8.0_74/jre/bin/unpack200
jdk1.8.0_74/jre/bin/tnameserv
jdk1.8.0_74/jre/bin/javaws
jdk1.8.0_74/jre/bin/keytool
jdk1.8.0_74/jre/bin/ControlPanel
jdk1.8.0_74/jre/bin/pack200
jdk1.8.0_74/jre/bin/java
jdk1.8.0_74/jre/bin/policytool
jdk1.8.0_74/jre/bin/rmid
jdk1.8.0_74/jre/bin/jjs
jdk1.8.0_74/jre/COPYRIGHT
jdk1.8.0_74/jre/README
jdk1.8.0_74/jre/plugin/
jdk1.8.0_74/jre/plugin/desktop/
jdk1.8.0_74/jre/plugin/desktop/sun_java.png
jdk1.8.0_74/jre/plugin/desktop/sun_java.desktop
jdk1.8.0_74/jre/Welcome.html
jdk1.8.0_74/README.html
jdk1.8.0_74/src.zip
jdk1.8.0_74/include/
jdk1.8.0_74/include/jvmticmlr.h
jdk1.8.0_74/include/jvmti.h
jdk1.8.0_74/include/linux/
jdk1.8.0_74/include/linux/jawt_md.h
jdk1.8.0_74/include/linux/jni_md.h
jdk1.8.0_74/include/jdwpTransport.h
jdk1.8.0_74/include/jni.h
jdk1.8.0_74/include/classfile_constants.h
jdk1.8.0_74/include/jawt.h
jdk1.8.0_74/man/
jdk1.8.0_74/man/ja
jdk1.8.0_74/man/man1/
jdk1.8.0_74/man/man1/java.1
jdk1.8.0_74/man/man1/jmc.1
jdk1.8.0_74/man/man1/xjc.1
jdk1.8.0_74/man/man1/jar.1
jdk1.8.0_74/man/man1/idlj.1
jdk1.8.0_74/man/man1/jsadebugd.1
jdk1.8.0_74/man/man1/appletviewer.1
jdk1.8.0_74/man/man1/javah.1
jdk1.8.0_74/man/man1/schemagen.1
jdk1.8.0_74/man/man1/servertool.1
jdk1.8.0_74/man/man1/jrunscript.1
jdk1.8.0_74/man/man1/javadoc.1
jdk1.8.0_74/man/man1/unpack200.1
jdk1.8.0_74/man/man1/javaws.1
jdk1.8.0_74/man/man1/policytool.1
jdk1.8.0_74/man/man1/jps.1
jdk1.8.0_74/man/man1/extcheck.1
jdk1.8.0_74/man/man1/jhat.1
jdk1.8.0_74/man/man1/wsgen.1
jdk1.8.0_74/man/man1/orbd.1
jdk1.8.0_74/man/man1/jstack.1
jdk1.8.0_74/man/man1/javafxpackager.1
jdk1.8.0_74/man/man1/javap.1
jdk1.8.0_74/man/man1/jstatd.1
jdk1.8.0_74/man/man1/rmiregistry.1
jdk1.8.0_74/man/man1/keytool.1
jdk1.8.0_74/man/man1/jarsigner.1
jdk1.8.0_74/man/man1/serialver.1
jdk1.8.0_74/man/man1/rmic.1
jdk1.8.0_74/man/man1/native2ascii.1
jdk1.8.0_74/man/man1/jjs.1
jdk1.8.0_74/man/man1/jvisualvm.1
jdk1.8.0_74/man/man1/rmid.1
jdk1.8.0_74/man/man1/jconsole.1
jdk1.8.0_74/man/man1/jdeps.1
jdk1.8.0_74/man/man1/jinfo.1
jdk1.8.0_74/man/man1/jdb.1
jdk1.8.0_74/man/man1/jmap.1
jdk1.8.0_74/man/man1/javac.1
jdk1.8.0_74/man/man1/wsimport.1
jdk1.8.0_74/man/man1/tnameserv.1
jdk1.8.0_74/man/man1/pack200.1
jdk1.8.0_74/man/man1/jcmd.1
jdk1.8.0_74/man/man1/javapackager.1
jdk1.8.0_74/man/man1/jstat.1
jdk1.8.0_74/man/ja_JP.UTF-8/
jdk1.8.0_74/man/ja_JP.UTF-8/man1/
jdk1.8.0_74/man/ja_JP.UTF-8/man1/java.1
jdk1.8.0_74/man/ja_JP.UTF-8/man1/jmc.1
jdk1.8.0_74/man/ja_JP.UTF-8/man1/xjc.1
jdk1.8.0_74/man/ja_JP.UTF-8/man1/jar.1
jdk1.8.0_74/man/ja_JP.UTF-8/man1/idlj.1
jdk1.8.0_74/man/ja_JP.UTF-8/man1/jsadebugd.1
jdk1.8.0_74/man/ja_JP.UTF-8/man1/appletviewer.1
jdk1.8.0_74/man/ja_JP.UTF-8/man1/javah.1
jdk1.8.0_74/man/ja_JP.UTF-8/man1/schemagen.1
jdk1.8.0_74/man/ja_JP.UTF-8/man1/servertool.1
jdk1.8.0_74/man/ja_JP.UTF-8/man1/jrunscript.1
jdk1.8.0_74/man/ja_JP.UTF-8/man1/javadoc.1
jdk1.8.0_74/man/ja_JP.UTF-8/man1/unpack200.1
jdk1.8.0_74/man/ja_JP.UTF-8/man1/javaws.1
jdk1.8.0_74/man/ja_JP.UTF-8/man1/policytool.1
jdk1.8.0_74/man/ja_JP.UTF-8/man1/jps.1
jdk1.8.0_74/man/ja_JP.UTF-8/man1/extcheck.1
jdk1.8.0_74/man/ja_JP.UTF-8/man1/jhat.1
jdk1.8.0_74/man/ja_JP.UTF-8/man1/wsgen.1
jdk1.8.0_74/man/ja_JP.UTF-8/man1/orbd.1
jdk1.8.0_74/man/ja_JP.UTF-8/man1/jstack.1
jdk1.8.0_74/man/ja_JP.UTF-8/man1/javafxpackager.1
jdk1.8.0_74/man/ja_JP.UTF-8/man1/javap.1
jdk1.8.0_74/man/ja_JP.UTF-8/man1/jstatd.1
jdk1.8.0_74/man/ja_JP.UTF-8/man1/rmiregistry.1
jdk1.8.0_74/man/ja_JP.UTF-8/man1/keytool.1
jdk1.8.0_74/man/ja_JP.UTF-8/man1/jarsigner.1
jdk1.8.0_74/man/ja_JP.UTF-8/man1/serialver.1
jdk1.8.0_74/man/ja_JP.UTF-8/man1/rmic.1
jdk1.8.0_74/man/ja_JP.UTF-8/man1/native2ascii.1
jdk1.8.0_74/man/ja_JP.UTF-8/man1/jjs.1
jdk1.8.0_74/man/ja_JP.UTF-8/man1/jvisualvm.1
jdk1.8.0_74/man/ja_JP.UTF-8/man1/rmid.1
jdk1.8.0_74/man/ja_JP.UTF-8/man1/jconsole.1
jdk1.8.0_74/man/ja_JP.UTF-8/man1/jdeps.1
jdk1.8.0_74/man/ja_JP.UTF-8/man1/jinfo.1
jdk1.8.0_74/man/ja_JP.UTF-8/man1/jdb.1
jdk1.8.0_74/man/ja_JP.UTF-8/man1/jmap.1
jdk1.8.0_74/man/ja_JP.UTF-8/man1/javac.1
jdk1.8.0_74/man/ja_JP.UTF-8/man1/wsimport.1
jdk1.8.0_74/man/ja_JP.UTF-8/man1/tnameserv.1
jdk1.8.0_74/man/ja_JP.UTF-8/man1/pack200.1
jdk1.8.0_74/man/ja_JP.UTF-8/man1/jcmd.1
jdk1.8.0_74/man/ja_JP.UTF-8/man1/javapackager.1
jdk1.8.0_74/man/ja_JP.UTF-8/man1/jstat.1
Building remotely on jenkins-test-b2e (jenkins-cloud-4GB cloud-slave Ubuntu ubuntu jenkins-cloud-8GB)
in workspace <https://builds.apache.org/job/DeltaSpike_Wildfly_10/ws/>
Unpacking https://repo.maven.apache.org/maven2/org/apache/maven/apache-maven/2.2.1/apache-maven-2.2.1-bin.zip
to /home/jenkins/tools/maven/apache-maven-2.2.1 on jenkins-test-b2e
Cloning the remote Git repository
Cloning repository https://git-wip-us.apache.org/repos/asf/deltaspike.git
 > git init <https://builds.apache.org/job/DeltaSpike_Wildfly_10/ws/> # timeout=10
Fetching upstream changes from https://git-wip-us.apache.org/repos/asf/deltaspike.git
 > git --version # timeout=10
 > git -c core.askpass=true fetch --tags --progress https://git-wip-us.apache.org/repos/asf/deltaspike.git
+refs/heads/*:refs/remotes/origin/*
 > git config remote.origin.url https://git-wip-us.apache.org/repos/asf/deltaspike.git
# timeout=10
 > git config --add remote.origin.fetch +refs/heads/*:refs/remotes/origin/* # timeout=10
 > git config remote.origin.url https://git-wip-us.apache.org/repos/asf/deltaspike.git
# timeout=10
Fetching upstream changes from https://git-wip-us.apache.org/repos/asf/deltaspike.git
 > git -c core.askpass=true fetch --tags --progress https://git-wip-us.apache.org/repos/asf/deltaspike.git
+refs/heads/*:refs/remotes/origin/*
 > git rev-parse origin/master^{commit} # timeout=10
Checking out Revision 42a7ddf01b8db786487c67f1e6d63710f6f562a1 (origin/master)
 > git config core.sparsecheckout # timeout=10
 > git checkout -f 42a7ddf01b8db786487c67f1e6d63710f6f562a1
 > git rev-list d2adacf41a85643616a56130d1ab3e38664e3634 # timeout=10
Parsing POMs
ERROR: Failed to parse POMs
java.io.IOException: remote file operation failed: <https://builds.apache.org/job/DeltaSpike_Wildfly_10/ws/>
at hudson.remoting.Channel@41aaef7b:jenkins-test-b2e: hudson.remoting.ProxyException: hudson.maven.MavenModuleSetBuild$MavenExecutionException:
hudson.maven.MavenEmbedderException: 1 problem was encountered while building the effective
settings
[FATAL] Non-parseable settings /home/jenkins/.m2/settings.xml: unexpected character in markup
% (position: START_TAG seen ...</username>\n     <password><%... @14:18)  @
/home/jenkins/.m2/settings.xml, line 14, column 18

	at hudson.FilePath.act(FilePath.java:986)
	at hudson.FilePath.act(FilePath.java:968)
	at hudson.maven.MavenModuleSetBuild$MavenModuleSetBuildExecution.parsePoms(MavenModuleSetBuild.java:960)
	at hudson.maven.MavenModuleSetBuild$MavenModuleSetBuildExecution.doRun(MavenModuleSetBuild.java:679)
	at hudson.model.AbstractBuild$AbstractBuildExecution.run(AbstractBuild.java:534)
	at hudson.model.Run.execute(Run.java:1738)
	at hudson.maven.MavenModuleSetBuild.run(MavenModuleSetBuild.java:531)
	at hudson.model.ResourceController.execute(ResourceController.java:98)
	at hudson.model.Executor.run(Executor.java:410)
Caused by: hudson.remoting.ProxyException: hudson.maven.MavenModuleSetBuild$MavenExecutionException:
hudson.maven.MavenEmbedderException: 1 problem was encountered while building the effective
settings
[FATAL] Non-parseable settings /home/jenkins/.m2/settings.xml: unexpected character in markup
% (position: START_TAG seen ...</username>\n     <password><%... @14:18)  @
/home/jenkins/.m2/settings.xml, line 14, column 18

	at hudson.maven.MavenModuleSetBuild$PomParser.invoke(MavenModuleSetBuild.java:1362)
	at hudson.maven.MavenModuleSetBuild$PomParser.invoke(MavenModuleSetBuild.java:1098)
	at hudson.FilePath$FileCallableWrapper.call(FilePath.java:2719)
	at hudson.remoting.UserRequest.perform(UserRequest.java:120)
	at hudson.remoting.UserRequest.perform(UserRequest.java:48)
	at hudson.remoting.Request$2.run(Request.java:326)
	at hudson.remoting.InterceptingExecutorService$1.call(InterceptingExecutorService.java:68)
	at java.util.concurrent.FutureTask.run(FutureTask.java:262)
	at java.util.concurrent.ThreadPoolExecutor.runWorker(ThreadPoolExecutor.java:1145)
	at java.util.concurrent.ThreadPoolExecutor$Worker.run(ThreadPoolExecutor.java:615)
	at java.lang.Thread.run(Thread.java:745)
	at ......remote call to jenkins-test-b2e(Native Method)
	at hudson.remoting.Channel.attachCallSiteStackTrace(Channel.java:1416)
	at hudson.remoting.UserResponse.retrieve(UserRequest.java:220)
	at hudson.remoting.Channel.call(Channel.java:781)
	at hudson.FilePath.act(FilePath.java:979)
	... 8 more
Caused by: hudson.remoting.ProxyException: hudson.maven.MavenEmbedderException: 1 problem
was encountered while building the effective settings
[FATAL] Non-parseable settings /home/jenkins/.m2/settings.xml: unexpected character in markup
% (position: START_TAG seen ...</username>\n     <password><%... @14:18)  @
/home/jenkins/.m2/settings.xml, line 14, column 18

	at hudson.maven.MavenEmbedder.<init>(MavenEmbedder.java:128)
	at hudson.maven.MavenEmbedder.<init>(MavenEmbedder.java:109)
	at hudson.maven.MavenEmbedder.<init>(MavenEmbedder.java:136)
	at hudson.maven.MavenUtil.createEmbedder(MavenUtil.java:212)
	at hudson.maven.MavenModuleSetBuild$PomParser.invoke(MavenModuleSetBuild.java:1295)
	at hudson.maven.MavenModuleSetBuild$PomParser.invoke(MavenModuleSetBuild.java:1098)
	at hudson.FilePath$FileCallableWrapper.call(FilePath.java:2719)
	at hudson.remoting.UserRequest.perform(UserRequest.java:120)
	at hudson.remoting.UserRequest.perform(UserRequest.java:48)
	at hudson.remoting.Request$2.run(Request.java:326)
	at hudson.remoting.InterceptingExecutorService$1.call(InterceptingExecutorService.java:68)
	at java.util.concurrent.FutureTask.run(FutureTask.java:262)
	at java.util.concurrent.ThreadPoolExecutor.runWorker(ThreadPoolExecutor.java:1145)
	at java.util.concurrent.ThreadPoolExecutor$Worker.run(ThreadPoolExecutor.java:615)
	at java.lang.Thread.run(Thread.java:745)
Caused by: hudson.remoting.ProxyException: hudson.maven.MavenEmbedderException: 1 problem
was encountered while building the effective settings
[FATAL] Non-parseable settings /home/jenkins/.m2/settings.xml: unexpected character in markup
% (position: START_TAG seen ...</username>\n     <password><%... @14:18)  @
/home/jenkins/.m2/settings.xml, line 14, column 18

	at hudson.maven.MavenEmbedder.getSettings(MavenEmbedder.java:261)
	at hudson.maven.MavenEmbedder.buildMavenExecutionRequest(MavenEmbedder.java:157)
	at hudson.maven.MavenEmbedder.<init>(MavenEmbedder.java:120)
	... 14 more
Caused by: hudson.remoting.ProxyException: org.apache.maven.settings.building.SettingsBuildingException:
1 problem was encountered while building the effective settings
[FATAL] Non-parseable settings /home/jenkins/.m2/settings.xml: unexpected character in markup
% (position: START_TAG seen ...</username>\n     <password><%... @14:18)  @
/home/jenkins/.m2/settings.xml, line 14, column 18

	at org.apache.maven.settings.building.DefaultSettingsBuilder.build(DefaultSettingsBuilder.java:116)
	at hudson.maven.MavenEmbedder.getSettings(MavenEmbedder.java:259)
	... 16 more

Mime
View raw message