deltaspike-commits mailing list archives

Site index · List index
Message view « Date » · « Thread »
Top « Date » · « Thread »
From Apache Jenkins Server <jenk...@builds.apache.org>
Subject Build failed in Jenkins: DeltaSpike_TomEE #1142
Date Sat, 04 Jun 2016 07:40:09 GMT
See <https://builds.apache.org/job/DeltaSpike_TomEE/1142/changes>

Changes:

[tandraschko] DELTASPIKE-1161 [perf] avoid Instance#Select

[tandraschko] DELTASPIKE-1161 [perf] avoid Instance#Select

[tandraschko] DELTASPIKE-1161 [perf] avoid Instance#Select

[johndament] DELTASPIKE-1159 Switched to a dependency management section.  Update to

[johndament] DELTASPIKE-1166 Reset pom files to 1.7.0

------------------------------------------
[...truncated 2299 lines...]
Audit done.

[INFO] 
[INFO] --- maven-install-plugin:2.5.2:install (default-install) @ deltaspike-cdictrl-tck ---
[INFO] Installing <https://builds.apache.org/job/DeltaSpike_TomEE/ws/deltaspike/cdictrl/tck/target/deltaspike-cdictrl-tck-1.7.0-SNAPSHOT.jar>
to /home/jenkins/jenkins-slave/maven-repositories/1/org/apache/deltaspike/test/deltaspike-cdictrl-tck/1.7.0-SNAPSHOT/deltaspike-cdictrl-tck-1.7.0-SNAPSHOT.jar
[INFO] Installing <https://builds.apache.org/job/DeltaSpike_TomEE/ws/deltaspike/cdictrl/tck/pom.xml>
to /home/jenkins/jenkins-slave/maven-repositories/1/org/apache/deltaspike/test/deltaspike-cdictrl-tck/1.7.0-SNAPSHOT/deltaspike-cdictrl-tck-1.7.0-SNAPSHOT.pom
[INFO] Installing <https://builds.apache.org/job/DeltaSpike_TomEE/ws/deltaspike/cdictrl/tck/target/deltaspike-cdictrl-tck-1.7.0-SNAPSHOT-sources.jar>
to /home/jenkins/jenkins-slave/maven-repositories/1/org/apache/deltaspike/test/deltaspike-cdictrl-tck/1.7.0-SNAPSHOT/deltaspike-cdictrl-tck-1.7.0-SNAPSHOT-sources.jar
[INFO]                                                                         
[INFO] ------------------------------------------------------------------------
[INFO] Building Apache DeltaSpike CDI OpenEJB-ContainerControl 1.7.0-SNAPSHOT
[INFO] ------------------------------------------------------------------------
[INFO] 
[INFO] --- maven-clean-plugin:3.0.0:clean (default-clean) @ deltaspike-cdictrl-openejb ---
[INFO] Deleting <https://builds.apache.org/job/DeltaSpike_TomEE/ws/deltaspike/cdictrl/impl-openejb/target>
[INFO] 
[INFO] --- maven-bundle-plugin:2.3.7:cleanVersions (versions) @ deltaspike-cdictrl-openejb
---
[INFO] 
[INFO] --- maven-antrun-plugin:1.8:run (javadoc.resources) @ deltaspike-cdictrl-openejb ---
[WARNING] Parameter tasks is deprecated, use target instead
[INFO] Executing tasks

main:
[INFO] Executed tasks
[INFO] 
[INFO] --- maven-dependency-plugin:2.4:unpack (unpack-context) @ deltaspike-cdictrl-openejb
---
[INFO] Configured Artifact: org.apache.deltaspike.cdictrl:deltaspike-cdictrl-owb:1.7.0-SNAPSHOT:jar
Downloading: https://repository.apache.org/content/repositories/releases/org/apache/deltaspike/cdictrl/deltaspike-cdictrl-owb/1.7.0-SNAPSHOT/maven-metadata.xml
Downloading: https://repository.apache.org/content/repositories/snapshots/org/apache/deltaspike/cdictrl/deltaspike-cdictrl-owb/1.7.0-SNAPSHOT/maven-metadata.xml
Downloading: http://repository.apache.org/snapshots/org/apache/deltaspike/cdictrl/deltaspike-cdictrl-owb/1.7.0-SNAPSHOT/maven-metadata.xml
Downloading: https://repository.apache.org/content/repositories/releases/org/apache/deltaspike/cdictrl/deltaspike-cdictrl-owb/1.7.0-SNAPSHOT/deltaspike-cdictrl-owb-1.7.0-SNAPSHOT.jar
Downloading: https://repository.apache.org/content/repositories/snapshots/org/apache/deltaspike/cdictrl/deltaspike-cdictrl-owb/1.7.0-SNAPSHOT/deltaspike-cdictrl-owb-1.7.0-SNAPSHOT.jar
Downloading: http://repository.apache.org/snapshots/org/apache/deltaspike/cdictrl/deltaspike-cdictrl-owb/1.7.0-SNAPSHOT/deltaspike-cdictrl-owb-1.7.0-SNAPSHOT.jar
[INFO] ------------------------------------------------------------------------
[INFO] Reactor Summary:
[INFO] 
[INFO] Apache DeltaSpike ................................. SUCCESS [6.177s]
[INFO] Apache DeltaSpike Sources ......................... SUCCESS [1.183s]
[INFO] Apache DeltaSpike CheckStyle-rules ................ SUCCESS [4.887s]
[INFO] Apache DeltaSpike Parent .......................... SUCCESS [7.467s]
[INFO] Apache DeltaSpike Test-Utils ...................... SUCCESS [7.967s]
[INFO] Apache DeltaSpike Code Parent ..................... SUCCESS [8.499s]
[INFO] Apache DeltaSpike Core ............................ SUCCESS [4.329s]
[INFO] Apache DeltaSpike Core-API ........................ SUCCESS [26.677s]
[INFO] Apache DeltaSpike Core-Implementation ............. SUCCESS [2:44.837s]
[INFO] Apache DeltaSpike ContainerControl parent ......... SUCCESS [1.483s]
[INFO] Apache DeltaSpike CDI ContainerControl API ........ SUCCESS [1.981s]
[INFO] Apache DeltaSpike CDI ContainerControl TCK ........ SUCCESS [2.736s]
[INFO] Apache DeltaSpike CDI OpenEJB-ContainerControl .... FAILURE [3.449s]
[INFO] Apache DeltaSpike Modules ......................... SKIPPED
[INFO] Apache DeltaSpike Proxy-Module .................... SKIPPED
[INFO] Apache DeltaSpike Proxy-Module API ................ SKIPPED
[INFO] Apache DeltaSpike Proxy-Module Impl ASM5 .......... SKIPPED
[INFO] Apache DeltaSpike Security-Module ................. SKIPPED
[INFO] Apache DeltaSpike Security-Module API ............. SKIPPED
[INFO] Apache DeltaSpike Security-Module Impl ............ SKIPPED
[INFO] Apache DeltaSpike JPA-Module ...................... SKIPPED
[INFO] Apache DeltaSpike JPA-Module API .................. SKIPPED
[INFO] Apache DeltaSpike JPA-Module Impl ................. SKIPPED
[INFO] Apache DeltaSpike Servlet-Module .................. SKIPPED
[INFO] Apache DeltaSpike Servlet-Module API .............. SKIPPED
[INFO] Apache DeltaSpike Servlet-Module Impl ............. SKIPPED
[INFO] Apache DeltaSpike JSF-Module ...................... SKIPPED
[INFO] Apache DeltaSpike JSF-Module API .................. SKIPPED
[INFO] Apache DeltaSpike JSF-Module Impl ................. SKIPPED
[INFO] Apache DeltaSpike JSF-Module Impl (EE6 only) ...... SKIPPED
[INFO] Apache DeltaSpike Partial-Bean-Module ............. SKIPPED
[INFO] Apache DeltaSpike Partial-Bean-Module API ......... SKIPPED
[INFO] Apache DeltaSpike Partial-Bean-Module Impl ........ SKIPPED
[INFO] Apache DeltaSpike BeanValidation-Module ........... SKIPPED
[INFO] Apache DeltaSpike BeanValidation-Module API ....... SKIPPED
[INFO] Apache DeltaSpike BeanValidation-Module Impl ...... SKIPPED
[INFO] Apache DeltaSpike Data-Module ..................... SKIPPED
[INFO] Apache DeltaSpike Data-Module API ................. SKIPPED
[INFO] Apache DeltaSpike Data-Module Impl ................ SKIPPED
[INFO] Apache DeltaSpike Scheduler-Module ................ SKIPPED
[INFO] Apache DeltaSpike Scheduler-Module API ............ SKIPPED
[INFO] Apache DeltaSpike Scheduler-Module Impl ........... SKIPPED
[INFO] Apache DeltaSpike Test-Control-Module ............. SKIPPED
[INFO] Apache DeltaSpike Test-Control-Module API ......... SKIPPED
[INFO] Apache DeltaSpike Test-Control-Module Impl ........ SKIPPED
[INFO] Apache DeltaSpike Examples ........................ SKIPPED
[INFO] Apache DeltaSpike Java-SE Examples ................ SKIPPED
[INFO] Apache DeltaSpike JSF Examples .................... SKIPPED
[INFO] Apache DeltaSpike JSF Playground .................. SKIPPED
[INFO] Apache DeltaSpike Security Example CDI ............ SKIPPED
[INFO] Apache DeltaSpike Security Example PicketLink ..... SKIPPED
[INFO] Apache DeltaSpike Java-SE Scheduler Examples ...... SKIPPED
[INFO] Apache DeltaSpike Documentation ................... SKIPPED
[INFO] Apache DeltaSpike Site ............................ SKIPPED
[INFO] ------------------------------------------------------------------------
[INFO] BUILD FAILURE
[INFO] ------------------------------------------------------------------------
[INFO] Total time: 4:27.613s
[INFO] Finished at: Sat Jun 04 07:38:37 UTC 2016
[INFO] Final Memory: 64M/932M
[INFO] ------------------------------------------------------------------------
Waiting for Jenkins to finish collecting data
[ERROR] Failed to execute goal org.apache.maven.plugins:maven-dependency-plugin:2.4:unpack
(unpack-context) on project deltaspike-cdictrl-openejb: Unable to find artifact. Could not
find artifact org.apache.deltaspike.cdictrl:deltaspike-cdictrl-owb:jar:1.7.0-SNAPSHOT in Apache
Repository (https://repository.apache.org/content/repositories/releases)
[ERROR] 
[ERROR] Try downloading the file manually from the project website.
[ERROR] 
[ERROR] Then, install it using the command:
[ERROR] mvn install:install-file -DgroupId=org.apache.deltaspike.cdictrl -DartifactId=deltaspike-cdictrl-owb
-Dversion=1.7.0-SNAPSHOT -Dpackaging=jar -Dfile=/path/to/file
[ERROR] 
[ERROR] Alternatively, if you host your own repository you can deploy the file there:
[ERROR] mvn deploy:deploy-file -DgroupId=org.apache.deltaspike.cdictrl -DartifactId=deltaspike-cdictrl-owb
-Dversion=1.7.0-SNAPSHOT -Dpackaging=jar -Dfile=/path/to/file -Durl=[url] -DrepositoryId=[id]
[ERROR] 
[ERROR] 
[ERROR] org.apache.deltaspike.cdictrl:deltaspike-cdictrl-owb:jar:1.7.0-SNAPSHOT
[ERROR] 
[ERROR] from the specified remote repositories:
[ERROR] Apache Repository (https://repository.apache.org/content/repositories/releases, releases=true,
snapshots=true),
[ERROR] Apache Snapshot Repository (https://repository.apache.org/content/repositories/snapshots,
releases=true, snapshots=true),
[ERROR] Nexus (http://repository.apache.org/snapshots, releases=false, snapshots=true),
[ERROR] central (http://repo.maven.apache.org/maven2, releases=true, snapshots=false)
[ERROR] -> [Help 1]
[ERROR] 
[ERROR] To see the full stack trace of the errors, re-run Maven with the -e switch.
[ERROR] Re-run Maven using the -X switch to enable full debug logging.
[ERROR] 
[ERROR] For more information about the errors and possible solutions, please read the following
articles:
[ERROR] [Help 1] http://cwiki.apache.org/confluence/display/MAVEN/MojoExecutionException
[ERROR] 
[ERROR] After correcting the problems, you can resume the build with the command
[ERROR]   mvn <goals> -rf :deltaspike-cdictrl-openejb
[JENKINS] Archiving <https://builds.apache.org/job/DeltaSpike_TomEE/ws/deltaspike/examples/jse-examples/pom.xml>
to org.apache.deltaspike.examples/deltaspike-jse-example/1.7.0-SNAPSHOT/deltaspike-jse-example-1.7.0-SNAPSHOT.pom
No artifacts from DeltaSpike_TomEE » Apache DeltaSpike Java-SE Examples #1139 to compare,
so performing full copy of artifacts
[JENKINS] Archiving <https://builds.apache.org/job/DeltaSpike_TomEE/ws/deltaspike/examples/security-requested-page-after-login-cdi/pom.xml>
to org.apache.deltaspike.examples/deltaspike-security-requested-page-after-login-cdi/1.7.0-SNAPSHOT/deltaspike-security-requested-page-after-login-cdi-1.7.0-SNAPSHOT.pom
No artifacts from DeltaSpike_TomEE » Apache DeltaSpike Security Example CDI #1139 to compare,
so performing full copy of artifacts
[JENKINS] Archiving <https://builds.apache.org/job/DeltaSpike_TomEE/ws/deltaspike/test-utils/pom.xml>
to org.apache.deltaspike.test/test-utils/1.7.0-SNAPSHOT/test-utils-1.7.0-SNAPSHOT.pom
[JENKINS] Archiving <https://builds.apache.org/job/DeltaSpike_TomEE/ws/deltaspike/test-utils/target/test-utils-1.7.0-SNAPSHOT.jar>
to org.apache.deltaspike.test/test-utils/1.7.0-SNAPSHOT/test-utils-1.7.0-SNAPSHOT.jar
[JENKINS] Archiving <https://builds.apache.org/job/DeltaSpike_TomEE/ws/deltaspike/test-utils/target/test-utils-1.7.0-SNAPSHOT-sources.jar>
to org.apache.deltaspike.test/test-utils/1.7.0-SNAPSHOT/test-utils-1.7.0-SNAPSHOT-sources.jar
No artifacts from DeltaSpike_TomEE » Apache DeltaSpike Test-Utils #1139 to compare, so performing
full copy of artifacts
[JENKINS] Archiving <https://builds.apache.org/job/DeltaSpike_TomEE/ws/documentation/pom.xml>
to org.apache.deltaspike/deltaspike-documentation/1.7.0-SNAPSHOT/deltaspike-documentation-1.7.0-SNAPSHOT.pom
No artifacts from DeltaSpike_TomEE » Apache DeltaSpike Documentation #1139 to compare, so
performing full copy of artifacts
[JENKINS] Archiving <https://builds.apache.org/job/DeltaSpike_TomEE/ws/deltaspike/modules/data/impl/pom.xml>
to org.apache.deltaspike.modules/deltaspike-data-module-impl/1.7.0-SNAPSHOT/deltaspike-data-module-impl-1.7.0-SNAPSHOT.pom
No artifacts from DeltaSpike_TomEE » Apache DeltaSpike Data-Module Impl #1139 to compare,
so performing full copy of artifacts
[JENKINS] Archiving <https://builds.apache.org/job/DeltaSpike_TomEE/ws/deltaspike/modules/data/api/pom.xml>
to org.apache.deltaspike.modules/deltaspike-data-module-api/1.7.0-SNAPSHOT/deltaspike-data-module-api-1.7.0-SNAPSHOT.pom
No artifacts from DeltaSpike_TomEE » Apache DeltaSpike Data-Module API #1139 to compare,
so performing full copy of artifacts
[JENKINS] Archiving <https://builds.apache.org/job/DeltaSpike_TomEE/ws/deltaspike/core/impl/pom.xml>
to org.apache.deltaspike.core/deltaspike-core-impl/1.7.0-SNAPSHOT/deltaspike-core-impl-1.7.0-SNAPSHOT.pom
[JENKINS] Archiving <https://builds.apache.org/job/DeltaSpike_TomEE/ws/deltaspike/core/impl/target/deltaspike-core-impl-1.7.0-SNAPSHOT.jar>
to org.apache.deltaspike.core/deltaspike-core-impl/1.7.0-SNAPSHOT/deltaspike-core-impl-1.7.0-SNAPSHOT.jar
[JENKINS] Archiving <https://builds.apache.org/job/DeltaSpike_TomEE/ws/deltaspike/core/impl/target/deltaspike-core-impl-1.7.0-SNAPSHOT-tests.jar>
to org.apache.deltaspike.core/deltaspike-core-impl/1.7.0-SNAPSHOT/deltaspike-core-impl-1.7.0-SNAPSHOT-tests.jar
[JENKINS] Archiving <https://builds.apache.org/job/DeltaSpike_TomEE/ws/deltaspike/core/impl/target/deltaspike-core-impl-1.7.0-SNAPSHOT-sources.jar>
to org.apache.deltaspike.core/deltaspike-core-impl/1.7.0-SNAPSHOT/deltaspike-core-impl-1.7.0-SNAPSHOT-sources.jar
No artifacts from DeltaSpike_TomEE » Apache DeltaSpike Core-Implementation #1139 to compare,
so performing full copy of artifacts
[JENKINS] Archiving <https://builds.apache.org/job/DeltaSpike_TomEE/ws/deltaspike/modules/pom.xml>
to org.apache.deltaspike.modules/modules-project/1.7.0-SNAPSHOT/modules-project-1.7.0-SNAPSHOT.pom
No artifacts from DeltaSpike_TomEE » Apache DeltaSpike Modules #1139 to compare, so performing
full copy of artifacts
[JENKINS] Archiving <https://builds.apache.org/job/DeltaSpike_TomEE/ws/deltaspike/modules/test-control/pom.xml>
to org.apache.deltaspike.modules/test-control-module-project/1.7.0-SNAPSHOT/test-control-module-project-1.7.0-SNAPSHOT.pom
No artifacts from DeltaSpike_TomEE » Apache DeltaSpike Test-Control-Module #1139 to compare,
so performing full copy of artifacts
[JENKINS] Archiving <https://builds.apache.org/job/DeltaSpike_TomEE/ws/deltaspike/examples/jsf-examples/pom.xml>
to org.apache.deltaspike.examples/deltaspike-jsf-example/1.7.0-SNAPSHOT/deltaspike-jsf-example-1.7.0-SNAPSHOT.pom
No artifacts from DeltaSpike_TomEE » Apache DeltaSpike JSF Examples #1139 to compare, so
performing full copy of artifacts
[JENKINS] Archiving <https://builds.apache.org/job/DeltaSpike_TomEE/ws/deltaspike/cdictrl/api/pom.xml>
to org.apache.deltaspike.cdictrl/deltaspike-cdictrl-api/1.7.0-SNAPSHOT/deltaspike-cdictrl-api-1.7.0-SNAPSHOT.pom
[JENKINS] Archiving <https://builds.apache.org/job/DeltaSpike_TomEE/ws/deltaspike/cdictrl/api/target/deltaspike-cdictrl-api-1.7.0-SNAPSHOT.jar>
to org.apache.deltaspike.cdictrl/deltaspike-cdictrl-api/1.7.0-SNAPSHOT/deltaspike-cdictrl-api-1.7.0-SNAPSHOT.jar
[JENKINS] Archiving <https://builds.apache.org/job/DeltaSpike_TomEE/ws/deltaspike/cdictrl/api/target/deltaspike-cdictrl-api-1.7.0-SNAPSHOT-sources.jar>
to org.apache.deltaspike.cdictrl/deltaspike-cdictrl-api/1.7.0-SNAPSHOT/deltaspike-cdictrl-api-1.7.0-SNAPSHOT-sources.jar
No artifacts from DeltaSpike_TomEE » Apache DeltaSpike CDI ContainerControl API #1139 to
compare, so performing full copy of artifacts
[JENKINS] Archiving <https://builds.apache.org/job/DeltaSpike_TomEE/ws/deltaspike/examples/scheduler-playground/pom.xml>
to org.apache.deltaspike.examples/deltaspike-scheduler-example/1.7.0-SNAPSHOT/deltaspike-scheduler-example-1.7.0-SNAPSHOT.pom
No artifacts from DeltaSpike_TomEE » Apache DeltaSpike Java-SE Scheduler Examples #1139 to
compare, so performing full copy of artifacts
[JENKINS] Archiving <https://builds.apache.org/job/DeltaSpike_TomEE/ws/deltaspike/checkstyle-rules/pom.xml>
to org.apache.deltaspike/checkstyle-rules/1.7.0-SNAPSHOT/checkstyle-rules-1.7.0-SNAPSHOT.pom
[JENKINS] Archiving <https://builds.apache.org/job/DeltaSpike_TomEE/ws/deltaspike/checkstyle-rules/target/checkstyle-rules-1.7.0-SNAPSHOT.jar>
to org.apache.deltaspike/checkstyle-rules/1.7.0-SNAPSHOT/checkstyle-rules-1.7.0-SNAPSHOT.jar
No artifacts from DeltaSpike_TomEE » Apache DeltaSpike CheckStyle-rules #1139 to compare,
so performing full copy of artifacts
[JENKINS] Archiving <https://builds.apache.org/job/DeltaSpike_TomEE/ws/deltaspike/parent/code/pom.xml>
to org.apache.deltaspike/parent-code/1.7.0-SNAPSHOT/parent-code-1.7.0-SNAPSHOT.pom
[JENKINS] Archiving <https://builds.apache.org/job/DeltaSpike_TomEE/ws/deltaspike/parent/code/target/parent-code-1.7.0-SNAPSHOT-tests.jar>
to org.apache.deltaspike/parent-code/1.7.0-SNAPSHOT/parent-code-1.7.0-SNAPSHOT-tests.jar
No artifacts from DeltaSpike_TomEE » Apache DeltaSpike Code Parent #1139 to compare, so performing
full copy of artifacts
[JENKINS] Archiving <https://builds.apache.org/job/DeltaSpike_TomEE/ws/deltaspike/modules/jsf/impl/pom.xml>
to org.apache.deltaspike.modules/deltaspike-jsf-module-impl/1.7.0-SNAPSHOT/deltaspike-jsf-module-impl-1.7.0-SNAPSHOT.pom
No artifacts from DeltaSpike_TomEE » Apache DeltaSpike JSF-Module Impl #1139 to compare,
so performing full copy of artifacts
[JENKINS] Archiving <https://builds.apache.org/job/DeltaSpike_TomEE/ws/deltaspike/modules/partial-bean/pom.xml>
to org.apache.deltaspike.modules/partial-bean-module-project/1.7.0-SNAPSHOT/partial-bean-module-project-1.7.0-SNAPSHOT.pom
No artifacts from DeltaSpike_TomEE » Apache DeltaSpike Partial-Bean-Module #1139 to compare,
so performing full copy of artifacts
[JENKINS] Archiving <https://builds.apache.org/job/DeltaSpike_TomEE/ws/deltaspike/examples/pom.xml>
to org.apache.deltaspike.examples/examples-project/1.7.0-SNAPSHOT/examples-project-1.7.0-SNAPSHOT.pom
No artifacts from DeltaSpike_TomEE » Apache DeltaSpike Examples #1139 to compare, so performing
full copy of artifacts
[JENKINS] Archiving <https://builds.apache.org/job/DeltaSpike_TomEE/ws/deltaspike/cdictrl/impl-openejb/pom.xml>
to org.apache.deltaspike.cdictrl/deltaspike-cdictrl-openejb/1.7.0-SNAPSHOT/deltaspike-cdictrl-openejb-1.7.0-SNAPSHOT.pom
No artifacts from DeltaSpike_TomEE » Apache DeltaSpike CDI OpenEJB-ContainerControl #1139
to compare, so performing full copy of artifacts
[JENKINS] Archiving <https://builds.apache.org/job/DeltaSpike_TomEE/ws/deltaspike/modules/jsf/pom.xml>
to org.apache.deltaspike.modules/jsf-module-project/1.7.0-SNAPSHOT/jsf-module-project-1.7.0-SNAPSHOT.pom
No artifacts from DeltaSpike_TomEE » Apache DeltaSpike JSF-Module #1139 to compare, so performing
full copy of artifacts
[JENKINS] Archiving <https://builds.apache.org/job/DeltaSpike_TomEE/ws/deltaspike/cdictrl/tck/pom.xml>
to org.apache.deltaspike.test/deltaspike-cdictrl-tck/1.7.0-SNAPSHOT/deltaspike-cdictrl-tck-1.7.0-SNAPSHOT.pom
[JENKINS] Archiving <https://builds.apache.org/job/DeltaSpike_TomEE/ws/deltaspike/cdictrl/tck/target/deltaspike-cdictrl-tck-1.7.0-SNAPSHOT.jar>
to org.apache.deltaspike.test/deltaspike-cdictrl-tck/1.7.0-SNAPSHOT/deltaspike-cdictrl-tck-1.7.0-SNAPSHOT.jar
[JENKINS] Archiving <https://builds.apache.org/job/DeltaSpike_TomEE/ws/deltaspike/cdictrl/tck/target/deltaspike-cdictrl-tck-1.7.0-SNAPSHOT-sources.jar>
to org.apache.deltaspike.test/deltaspike-cdictrl-tck/1.7.0-SNAPSHOT/deltaspike-cdictrl-tck-1.7.0-SNAPSHOT-sources.jar
No artifacts from DeltaSpike_TomEE » Apache DeltaSpike CDI ContainerControl TCK #1139 to
compare, so performing full copy of artifacts
[JENKINS] Archiving <https://builds.apache.org/job/DeltaSpike_TomEE/ws/deltaspike/modules/jsf/api/pom.xml>
to org.apache.deltaspike.modules/deltaspike-jsf-module-api/1.7.0-SNAPSHOT/deltaspike-jsf-module-api-1.7.0-SNAPSHOT.pom
No artifacts from DeltaSpike_TomEE » Apache DeltaSpike JSF-Module API #1139 to compare, so
performing full copy of artifacts
[JENKINS] Archiving <https://builds.apache.org/job/DeltaSpike_TomEE/ws/deltaspike/modules/security/pom.xml>
to org.apache.deltaspike.modules/security-module-project/1.7.0-SNAPSHOT/security-module-project-1.7.0-SNAPSHOT.pom
No artifacts from DeltaSpike_TomEE » Apache DeltaSpike Security-Module #1139 to compare,
so performing full copy of artifacts
[JENKINS] Archiving <https://builds.apache.org/job/DeltaSpike_TomEE/ws/deltaspike/modules/bean-validation/pom.xml>
to org.apache.deltaspike.modules/bean-validation-module-project/1.7.0-SNAPSHOT/bean-validation-module-project-1.7.0-SNAPSHOT.pom
No artifacts from DeltaSpike_TomEE » Apache DeltaSpike BeanValidation-Module #1139 to compare,
so performing full copy of artifacts
[JENKINS] Archiving <https://builds.apache.org/job/DeltaSpike_TomEE/ws/deltaspike/modules/partial-bean/impl/pom.xml>
to org.apache.deltaspike.modules/deltaspike-partial-bean-module-impl/1.7.0-SNAPSHOT/deltaspike-partial-bean-module-impl-1.7.0-SNAPSHOT.pom
No artifacts from DeltaSpike_TomEE » Apache DeltaSpike Partial-Bean-Module Impl #1139 to
compare, so performing full copy of artifacts
[JENKINS] Archiving <https://builds.apache.org/job/DeltaSpike_TomEE/ws/deltaspike/modules/proxy/api/pom.xml>
to org.apache.deltaspike.modules/deltaspike-proxy-module-api/1.7.0-SNAPSHOT/deltaspike-proxy-module-api-1.7.0-SNAPSHOT.pom
No artifacts from DeltaSpike_TomEE » Apache DeltaSpike Proxy-Module API #1139 to compare,
so performing full copy of artifacts
[JENKINS] Archiving <https://builds.apache.org/job/DeltaSpike_TomEE/ws/deltaspike/modules/jpa/api/pom.xml>
to org.apache.deltaspike.modules/deltaspike-jpa-module-api/1.7.0-SNAPSHOT/deltaspike-jpa-module-api-1.7.0-SNAPSHOT.pom
No artifacts from DeltaSpike_TomEE » Apache DeltaSpike JPA-Module API #1139 to compare, so
performing full copy of artifacts
[JENKINS] Archiving <https://builds.apache.org/job/DeltaSpike_TomEE/ws/deltaspike/modules/servlet/api/pom.xml>
to org.apache.deltaspike.modules/deltaspike-servlet-module-api/1.7.0-SNAPSHOT/deltaspike-servlet-module-api-1.7.0-SNAPSHOT.pom
No artifacts from DeltaSpike_TomEE » Apache DeltaSpike Servlet-Module API #1139 to compare,
so performing full copy of artifacts
[JENKINS] Archiving <https://builds.apache.org/job/DeltaSpike_TomEE/ws/deltaspike/modules/jpa/pom.xml>
to org.apache.deltaspike.modules/jpa-module-project/1.7.0-SNAPSHOT/jpa-module-project-1.7.0-SNAPSHOT.pom
No artifacts from DeltaSpike_TomEE » Apache DeltaSpike JPA-Module #1139 to compare, so performing
full copy of artifacts
[JENKINS] Archiving <https://builds.apache.org/job/DeltaSpike_TomEE/ws/deltaspike/cdictrl/pom.xml>
to org.apache.deltaspike.cdictrl/cdictrl-project/1.7.0-SNAPSHOT/cdictrl-project-1.7.0-SNAPSHOT.pom
No artifacts from DeltaSpike_TomEE » Apache DeltaSpike ContainerControl parent #1139 to compare,
so performing full copy of artifacts
[JENKINS] Archiving <https://builds.apache.org/job/DeltaSpike_TomEE/ws/deltaspike/modules/scheduler/api/pom.xml>
to org.apache.deltaspike.modules/deltaspike-scheduler-module-api/1.7.0-SNAPSHOT/deltaspike-scheduler-module-api-1.7.0-SNAPSHOT.pom
No artifacts from DeltaSpike_TomEE » Apache DeltaSpike Scheduler-Module API #1139 to compare,
so performing full copy of artifacts
[JENKINS] Archiving <https://builds.apache.org/job/DeltaSpike_TomEE/ws/deltaspike/modules/test-control/impl/pom.xml>
to org.apache.deltaspike.modules/deltaspike-test-control-module-impl/1.7.0-SNAPSHOT/deltaspike-test-control-module-impl-1.7.0-SNAPSHOT.pom
No artifacts from DeltaSpike_TomEE » Apache DeltaSpike Test-Control-Module Impl #1139 to
compare, so performing full copy of artifacts
[JENKINS] Archiving <https://builds.apache.org/job/DeltaSpike_TomEE/ws/deltaspike/modules/servlet/pom.xml>
to org.apache.deltaspike.modules/servlet-module-project/1.7.0-SNAPSHOT/servlet-module-project-1.7.0-SNAPSHOT.pom
No artifacts from DeltaSpike_TomEE » Apache DeltaSpike Servlet-Module #1139 to compare, so
performing full copy of artifacts
[JENKINS] Archiving <https://builds.apache.org/job/DeltaSpike_TomEE/ws/deltaspike/modules/test-control/api/pom.xml>
to org.apache.deltaspike.modules/deltaspike-test-control-module-api/1.7.0-SNAPSHOT/deltaspike-test-control-module-api-1.7.0-SNAPSHOT.pom
No artifacts from DeltaSpike_TomEE » Apache DeltaSpike Test-Control-Module API #1139 to compare,
so performing full copy of artifacts
[JENKINS] Archiving <https://builds.apache.org/job/DeltaSpike_TomEE/ws/deltaspike/modules/jsf/impl-ee6/pom.xml>
to org.apache.deltaspike.modules/deltaspike-jsf-module-impl-ee6/1.7.0-SNAPSHOT/deltaspike-jsf-module-impl-ee6-1.7.0-SNAPSHOT.pom
No artifacts from DeltaSpike_TomEE » Apache DeltaSpike JSF-Module Impl (EE6 only) #1139 to
compare, so performing full copy of artifacts
[JENKINS] Archiving <https://builds.apache.org/job/DeltaSpike_TomEE/ws/deltaspike/modules/proxy/pom.xml>
to org.apache.deltaspike.modules/proxy-module-project/1.7.0-SNAPSHOT/proxy-module-project-1.7.0-SNAPSHOT.pom
No artifacts from DeltaSpike_TomEE » Apache DeltaSpike Proxy-Module #1139 to compare, so
performing full copy of artifacts
[JENKINS] Archiving <https://builds.apache.org/job/DeltaSpike_TomEE/ws/deltaspike/modules/partial-bean/api/pom.xml>
to org.apache.deltaspike.modules/deltaspike-partial-bean-module-api/1.7.0-SNAPSHOT/deltaspike-partial-bean-module-api-1.7.0-SNAPSHOT.pom
No artifacts from DeltaSpike_TomEE » Apache DeltaSpike Partial-Bean-Module API #1139 to compare,
so performing full copy of artifacts
[JENKINS] Archiving <https://builds.apache.org/job/DeltaSpike_TomEE/ws/deltaspike/modules/scheduler/impl/pom.xml>
to org.apache.deltaspike.modules/deltaspike-scheduler-module-impl/1.7.0-SNAPSHOT/deltaspike-scheduler-module-impl-1.7.0-SNAPSHOT.pom
No artifacts from DeltaSpike_TomEE » Apache DeltaSpike Scheduler-Module Impl #1139 to compare,
so performing full copy of artifacts
[JENKINS] Archiving <https://builds.apache.org/job/DeltaSpike_TomEE/ws/deltaspike/parent/pom.xml>
to org.apache.deltaspike/parent/1.7.0-SNAPSHOT/parent-1.7.0-SNAPSHOT.pom
No artifacts from DeltaSpike_TomEE » Apache DeltaSpike Parent #1139 to compare, so performing
full copy of artifacts
[JENKINS] Archiving <https://builds.apache.org/job/DeltaSpike_TomEE/ws/deltaspike/core/pom.xml>
to org.apache.deltaspike.core/core-project/1.7.0-SNAPSHOT/core-project-1.7.0-SNAPSHOT.pom
[JENKINS] Archiving <https://builds.apache.org/job/DeltaSpike_TomEE/ws/deltaspike/core/target/core-project-1.7.0-SNAPSHOT-tests.jar>
to org.apache.deltaspike.core/core-project/1.7.0-SNAPSHOT/core-project-1.7.0-SNAPSHOT-tests.jar
No artifacts from DeltaSpike_TomEE » Apache DeltaSpike Core #1139 to compare, so performing
full copy of artifacts
[JENKINS] Archiving <https://builds.apache.org/job/DeltaSpike_TomEE/ws/deltaspike/modules/bean-validation/api/pom.xml>
to org.apache.deltaspike.modules/deltaspike-bean-validation-module-api/1.7.0-SNAPSHOT/deltaspike-bean-validation-module-api-1.7.0-SNAPSHOT.pom
No artifacts from DeltaSpike_TomEE » Apache DeltaSpike BeanValidation-Module API #1139 to
compare, so performing full copy of artifacts
[JENKINS] Archiving <https://builds.apache.org/job/DeltaSpike_TomEE/ws/deltaspike/core/api/pom.xml>
to org.apache.deltaspike.core/deltaspike-core-api/1.7.0-SNAPSHOT/deltaspike-core-api-1.7.0-SNAPSHOT.pom
[JENKINS] Archiving <https://builds.apache.org/job/DeltaSpike_TomEE/ws/deltaspike/core/api/target/deltaspike-core-api-1.7.0-SNAPSHOT.jar>
to org.apache.deltaspike.core/deltaspike-core-api/1.7.0-SNAPSHOT/deltaspike-core-api-1.7.0-SNAPSHOT.jar
[JENKINS] Archiving <https://builds.apache.org/job/DeltaSpike_TomEE/ws/deltaspike/core/api/target/deltaspike-core-api-1.7.0-SNAPSHOT-tests.jar>
to org.apache.deltaspike.core/deltaspike-core-api/1.7.0-SNAPSHOT/deltaspike-core-api-1.7.0-SNAPSHOT-tests.jar
[JENKINS] Archiving <https://builds.apache.org/job/DeltaSpike_TomEE/ws/deltaspike/core/api/target/deltaspike-core-api-1.7.0-SNAPSHOT-sources.jar>
to org.apache.deltaspike.core/deltaspike-core-api/1.7.0-SNAPSHOT/deltaspike-core-api-1.7.0-SNAPSHOT-sources.jar
No artifacts from DeltaSpike_TomEE » Apache DeltaSpike Core-API #1139 to compare, so performing
full copy of artifacts
[JENKINS] Archiving <https://builds.apache.org/job/DeltaSpike_TomEE/ws/deltaspike/modules/security/impl/pom.xml>
to org.apache.deltaspike.modules/deltaspike-security-module-impl/1.7.0-SNAPSHOT/deltaspike-security-module-impl-1.7.0-SNAPSHOT.pom
No artifacts from DeltaSpike_TomEE » Apache DeltaSpike Security-Module Impl #1139 to compare,
so performing full copy of artifacts
[JENKINS] Archiving <https://builds.apache.org/job/DeltaSpike_TomEE/ws/deltaspike/modules/scheduler/pom.xml>
to org.apache.deltaspike.modules/scheduler-module-project/1.7.0-SNAPSHOT/scheduler-module-project-1.7.0-SNAPSHOT.pom
No artifacts from DeltaSpike_TomEE » Apache DeltaSpike Scheduler-Module #1139 to compare,
so performing full copy of artifacts
[JENKINS] Archiving <https://builds.apache.org/job/DeltaSpike_TomEE/ws/site/pom.xml>
to org.apache.deltaspike/deltaspike-site/1.7.0-SNAPSHOT/deltaspike-site-1.7.0-SNAPSHOT.pom
No artifacts from DeltaSpike_TomEE » Apache DeltaSpike Site #1139 to compare, so performing
full copy of artifacts
[JENKINS] Archiving <https://builds.apache.org/job/DeltaSpike_TomEE/ws/deltaspike/modules/proxy/impl-asm5/pom.xml>
to org.apache.deltaspike.modules/deltaspike-proxy-module-impl-asm5/1.7.0-SNAPSHOT/deltaspike-proxy-module-impl-asm5-1.7.0-SNAPSHOT.pom
No artifacts from DeltaSpike_TomEE » Apache DeltaSpike Proxy-Module Impl ASM5 #1139 to compare,
so performing full copy of artifacts
[JENKINS] Archiving <https://builds.apache.org/job/DeltaSpike_TomEE/ws/deltaspike/examples/jsf-playground/pom.xml>
to org.apache.deltaspike.examples/deltaspike-jsf-playground/1.7.0-SNAPSHOT/deltaspike-jsf-playground-1.7.0-SNAPSHOT.pom
No artifacts from DeltaSpike_TomEE » Apache DeltaSpike JSF Playground #1139 to compare, so
performing full copy of artifacts
[JENKINS] Archiving <https://builds.apache.org/job/DeltaSpike_TomEE/ws/deltaspike/modules/servlet/impl/pom.xml>
to org.apache.deltaspike.modules/deltaspike-servlet-module-impl/1.7.0-SNAPSHOT/deltaspike-servlet-module-impl-1.7.0-SNAPSHOT.pom
No artifacts from DeltaSpike_TomEE » Apache DeltaSpike Servlet-Module Impl #1139 to compare,
so performing full copy of artifacts
[JENKINS] Archiving <https://builds.apache.org/job/DeltaSpike_TomEE/ws/deltaspike/modules/bean-validation/impl/pom.xml>
to org.apache.deltaspike.modules/deltaspike-bean-validation-module-impl/1.7.0-SNAPSHOT/deltaspike-bean-validation-module-impl-1.7.0-SNAPSHOT.pom
No artifacts from DeltaSpike_TomEE » Apache DeltaSpike BeanValidation-Module Impl #1139 to
compare, so performing full copy of artifacts
[JENKINS] Archiving <https://builds.apache.org/job/DeltaSpike_TomEE/ws/pom.xml> to org.apache.deltaspike/deltaspike/1.7.0-SNAPSHOT/deltaspike-1.7.0-SNAPSHOT.pom
No artifacts from DeltaSpike_TomEE » Apache DeltaSpike #1139 to compare, so performing full
copy of artifacts
[JENKINS] Archiving <https://builds.apache.org/job/DeltaSpike_TomEE/ws/deltaspike/modules/jpa/impl/pom.xml>
to org.apache.deltaspike.modules/deltaspike-jpa-module-impl/1.7.0-SNAPSHOT/deltaspike-jpa-module-impl-1.7.0-SNAPSHOT.pom
No artifacts from DeltaSpike_TomEE » Apache DeltaSpike JPA-Module Impl #1139 to compare,
so performing full copy of artifacts
[JENKINS] Archiving <https://builds.apache.org/job/DeltaSpike_TomEE/ws/deltaspike/modules/data/pom.xml>
to org.apache.deltaspike.modules/data-module-project/1.7.0-SNAPSHOT/data-module-project-1.7.0-SNAPSHOT.pom
No artifacts from DeltaSpike_TomEE » Apache DeltaSpike Data-Module #1139 to compare, so performing
full copy of artifacts
[JENKINS] Archiving <https://builds.apache.org/job/DeltaSpike_TomEE/ws/deltaspike/examples/security-requested-page-after-login-picketlink/pom.xml>
to org.apache.deltaspike.examples/deltaspike-security-requested-page-after-login-picketlink/1.7.0-SNAPSHOT/deltaspike-security-requested-page-after-login-picketlink-1.7.0-SNAPSHOT.pom
No artifacts from DeltaSpike_TomEE » Apache DeltaSpike Security Example PicketLink #1139
to compare, so performing full copy of artifacts
[JENKINS] Archiving <https://builds.apache.org/job/DeltaSpike_TomEE/ws/deltaspike/pom.xml>
to org.apache.deltaspike/deltaspike-project/1.7.0-SNAPSHOT/deltaspike-project-1.7.0-SNAPSHOT.pom
No artifacts from DeltaSpike_TomEE » Apache DeltaSpike Sources #1139 to compare, so performing
full copy of artifacts
[JENKINS] Archiving <https://builds.apache.org/job/DeltaSpike_TomEE/ws/deltaspike/modules/security/api/pom.xml>
to org.apache.deltaspike.modules/deltaspike-security-module-api/1.7.0-SNAPSHOT/deltaspike-security-module-api-1.7.0-SNAPSHOT.pom
No artifacts from DeltaSpike_TomEE » Apache DeltaSpike Security-Module API #1139 to compare,
so performing full copy of artifacts
channel stopped

Mime
View raw message