deltaspike-commits mailing list archives

Site index · List index
Message view « Date » · « Thread »
Top « Date » · « Thread »
From Apache Jenkins Server <jenk...@builds.apache.org>
Subject Build failed in Jenkins: DeltaSpike Weld 1.1.23 #240
Date Fri, 06 May 2016 08:20:39 GMT
See <https://builds.apache.org/job/DeltaSpike%20Weld%201.1.23/240/changes>

Changes:

[manovotn] DELTASPIKE-1091 created separate profiles for Weld versions, changed

[manovotn] DELTASPIKE-1091 add default values to Weld profiles.

[manovotn] DELTASPIKE-1141 modify FutureableTest and LockedTest to contain

------------------------------------------
[...truncated 5261 lines...]
[ERROR] location: class org.apache.deltaspike.data.test.service.SimpleCriteriaRepository
[ERROR] <https://builds.apache.org/job/DeltaSpike%20Weld%201.1.23/ws/deltaspike/modules/data/impl/src/test/java/org/apache/deltaspike/data/test/service/SimpleCriteriaRepository.java>:[80,20]
cannot find symbol
[ERROR] symbol  : variable Simple_
[ERROR] location: class org.apache.deltaspike.data.test.service.SimpleCriteriaRepository
[ERROR] <https://builds.apache.org/job/DeltaSpike%20Weld%201.1.23/ws/deltaspike/modules/data/impl/src/test/java/org/apache/deltaspike/data/test/service/SimpleCriteriaRepository.java>:[79,20]
cannot find symbol
[ERROR] symbol  : variable Simple_
[ERROR] location: class org.apache.deltaspike.data.test.service.SimpleCriteriaRepository
[ERROR] <https://builds.apache.org/job/DeltaSpike%20Weld%201.1.23/ws/deltaspike/modules/data/impl/src/test/java/org/apache/deltaspike/data/test/service/SimpleCriteriaRepository.java>:[87,20]
cannot find symbol
[ERROR] symbol  : variable SuperSimple_
[ERROR] location: class org.apache.deltaspike.data.test.service.SimpleCriteriaRepository
[ERROR] <https://builds.apache.org/job/DeltaSpike%20Weld%201.1.23/ws/deltaspike/modules/data/impl/src/test/java/org/apache/deltaspike/data/test/service/SimpleCriteriaRepository.java>:[95,20]
cannot find symbol
[ERROR] symbol  : variable Simple_
[ERROR] location: class org.apache.deltaspike.data.test.service.SimpleCriteriaRepository
[ERROR] <https://builds.apache.org/job/DeltaSpike%20Weld%201.1.23/ws/deltaspike/modules/data/impl/src/test/java/org/apache/deltaspike/data/test/service/SimpleCriteriaRepository.java>:[94,50]
cannot find symbol
[ERROR] symbol  : variable Simple_
[ERROR] location: class org.apache.deltaspike.data.test.service.SimpleCriteriaRepository
[ERROR] <https://builds.apache.org/job/DeltaSpike%20Weld%201.1.23/ws/deltaspike/modules/data/impl/src/test/java/org/apache/deltaspike/data/test/service/SimpleCriteriaRepository.java>:[103,20]
cannot find symbol
[ERROR] symbol  : variable Simple_
[ERROR] location: class org.apache.deltaspike.data.test.service.SimpleCriteriaRepository
[ERROR] <https://builds.apache.org/job/DeltaSpike%20Weld%201.1.23/ws/deltaspike/modules/data/impl/src/test/java/org/apache/deltaspike/data/test/service/SimpleCriteriaRepository.java>:[102,46]
cannot find symbol
[ERROR] symbol  : variable Simple_
[ERROR] location: class org.apache.deltaspike.data.test.service.SimpleCriteriaRepository
[ERROR] <https://builds.apache.org/job/DeltaSpike%20Weld%201.1.23/ws/deltaspike/modules/data/impl/src/test/java/org/apache/deltaspike/data/test/service/SimpleCriteriaRepository.java>:[102,70]
cannot find symbol
[ERROR] symbol  : variable Simple_
[ERROR] location: class org.apache.deltaspike.data.test.service.SimpleCriteriaRepository
[ERROR] <https://builds.apache.org/job/DeltaSpike%20Weld%201.1.23/ws/deltaspike/modules/data/impl/src/test/java/org/apache/deltaspike/data/test/service/SimpleCriteriaRepository.java>:[112,20]
cannot find symbol
[ERROR] symbol  : variable Simple_
[ERROR] location: class org.apache.deltaspike.data.test.service.SimpleCriteriaRepository
[ERROR] <https://builds.apache.org/job/DeltaSpike%20Weld%201.1.23/ws/deltaspike/modules/data/impl/src/test/java/org/apache/deltaspike/data/test/service/SimpleCriteriaRepository.java>:[110,28]
cannot find symbol
[ERROR] symbol  : variable Simple_
[ERROR] location: class org.apache.deltaspike.data.test.service.SimpleCriteriaRepository
[ERROR] <https://builds.apache.org/job/DeltaSpike%20Weld%201.1.23/ws/deltaspike/modules/data/impl/src/test/java/org/apache/deltaspike/data/test/service/SimpleCriteriaRepository.java>:[110,50]
cannot find symbol
[ERROR] symbol  : variable Simple_
[ERROR] location: class org.apache.deltaspike.data.test.service.SimpleCriteriaRepository
[ERROR] <https://builds.apache.org/job/DeltaSpike%20Weld%201.1.23/ws/deltaspike/modules/data/impl/src/test/java/org/apache/deltaspike/data/test/service/SimpleCriteriaRepository.java>:[123,20]
cannot find symbol
[ERROR] symbol  : variable Simple_
[ERROR] location: class org.apache.deltaspike.data.test.service.SimpleCriteriaRepository
[ERROR] <https://builds.apache.org/job/DeltaSpike%20Weld%201.1.23/ws/deltaspike/modules/data/impl/src/test/java/org/apache/deltaspike/data/test/service/SimpleCriteriaRepository.java>:[120,34]
cannot find symbol
[ERROR] symbol  : variable Simple_
[ERROR] location: class org.apache.deltaspike.data.test.service.SimpleCriteriaRepository
[ERROR] <https://builds.apache.org/job/DeltaSpike%20Weld%201.1.23/ws/deltaspike/modules/data/impl/src/test/java/org/apache/deltaspike/data/test/service/SimpleCriteriaRepository.java>:[121,30]
cannot find symbol
[ERROR] symbol  : variable Simple_
[ERROR] location: class org.apache.deltaspike.data.test.service.SimpleCriteriaRepository
[ERROR] <https://builds.apache.org/job/DeltaSpike%20Weld%201.1.23/ws/deltaspike/modules/data/impl/src/test/java/org/apache/deltaspike/data/test/service/SimpleCriteriaRepository.java>:[121,51]
cannot find symbol
[ERROR] symbol  : variable Simple_
[ERROR] location: class org.apache.deltaspike.data.test.service.SimpleCriteriaRepository
[ERROR] <https://builds.apache.org/job/DeltaSpike%20Weld%201.1.23/ws/deltaspike/modules/data/impl/src/test/java/org/apache/deltaspike/data/test/service/SimpleCriteriaRepository.java>:[122,34]
cannot find symbol
[ERROR] symbol  : variable Simple_
[ERROR] location: class org.apache.deltaspike.data.test.service.SimpleCriteriaRepository
[ERROR] <https://builds.apache.org/job/DeltaSpike%20Weld%201.1.23/ws/deltaspike/modules/data/impl/src/test/java/org/apache/deltaspike/data/test/service/SimpleCriteriaRepository.java>:[122,62]
cannot find symbol
[ERROR] symbol  : variable Simple_
[ERROR] location: class org.apache.deltaspike.data.test.service.SimpleCriteriaRepository
[ERROR] <https://builds.apache.org/job/DeltaSpike%20Weld%201.1.23/ws/deltaspike/modules/data/impl/src/test/java/org/apache/deltaspike/data/test/service/SimpleCriteriaRepository.java>:[132,26]
cannot find symbol
[ERROR] symbol  : variable Simple_
[ERROR] location: class org.apache.deltaspike.data.test.service.SimpleCriteriaRepository
[ERROR] <https://builds.apache.org/job/DeltaSpike%20Weld%201.1.23/ws/deltaspike/modules/data/impl/src/test/java/org/apache/deltaspike/data/test/service/SimpleCriteriaRepository.java>:[131,27]
cannot find symbol
[ERROR] symbol  : variable Simple_
[ERROR] location: class org.apache.deltaspike.data.test.service.SimpleCriteriaRepository
[ERROR] <https://builds.apache.org/job/DeltaSpike%20Weld%201.1.23/ws/deltaspike/modules/data/impl/src/test/java/org/apache/deltaspike/data/test/service/SimpleCriteriaRepository.java>:[141,20]
cannot find symbol
[ERROR] symbol  : variable Simple_
[ERROR] location: class org.apache.deltaspike.data.test.service.SimpleCriteriaRepository
[ERROR] <https://builds.apache.org/job/DeltaSpike%20Weld%201.1.23/ws/deltaspike/modules/data/impl/src/test/java/org/apache/deltaspike/data/test/service/SimpleCriteriaRepository.java>:[139,34]
cannot find symbol
[ERROR] symbol  : variable Simple_
[ERROR] location: class org.apache.deltaspike.data.test.service.SimpleCriteriaRepository
[ERROR] <https://builds.apache.org/job/DeltaSpike%20Weld%201.1.23/ws/deltaspike/modules/data/impl/src/test/java/org/apache/deltaspike/data/test/service/SimpleCriteriaRepository.java>:[139,54]
cannot find symbol
[ERROR] symbol  : variable Simple_
[ERROR] location: class org.apache.deltaspike.data.test.service.SimpleCriteriaRepository
[ERROR] <https://builds.apache.org/job/DeltaSpike%20Weld%201.1.23/ws/deltaspike/modules/data/impl/src/test/java/org/apache/deltaspike/data/test/service/SimpleCriteriaRepository.java>:[140,63]
cannot find symbol
[ERROR] symbol  : variable Simple_
[ERROR] location: class org.apache.deltaspike.data.test.service.SimpleCriteriaRepository
[ERROR] -> [Help 1]
[ERROR] 
[ERROR] To see the full stack trace of the errors, re-run Maven with the -e switch.
[ERROR] Re-run Maven using the -X switch to enable full debug logging.
[ERROR] 
[ERROR] For more information about the errors and possible solutions, please read the following
articles:
[ERROR] [Help 1] http://cwiki.apache.org/confluence/display/MAVEN/MojoFailureException
[ERROR] 
[ERROR] After correcting the problems, you can resume the build with the command
[ERROR]   mvn <goals> -rf :deltaspike-data-module-impl
[JENKINS] Archiving <https://builds.apache.org/job/DeltaSpike%20Weld%201.1.23/ws/deltaspike/examples/jse-examples/pom.xml>
to org.apache.deltaspike.examples/deltaspike-jse-example/1.6.2-SNAPSHOT/deltaspike-jse-example-1.6.2-SNAPSHOT.pom
[JENKINS] Archiving <https://builds.apache.org/job/DeltaSpike%20Weld%201.1.23/ws/deltaspike/examples/security-requested-page-after-login-cdi/pom.xml>
to org.apache.deltaspike.examples/deltaspike-security-requested-page-after-login-cdi/1.6.2-SNAPSHOT/deltaspike-security-requested-page-after-login-cdi-1.6.2-SNAPSHOT.pom
[JENKINS] Archiving <https://builds.apache.org/job/DeltaSpike%20Weld%201.1.23/ws/deltaspike/test-utils/pom.xml>
to org.apache.deltaspike.test/test-utils/1.6.2-SNAPSHOT/test-utils-1.6.2-SNAPSHOT.pom
[JENKINS] Archiving <https://builds.apache.org/job/DeltaSpike%20Weld%201.1.23/ws/deltaspike/test-utils/target/test-utils-1.6.2-SNAPSHOT.jar>
to org.apache.deltaspike.test/test-utils/1.6.2-SNAPSHOT/test-utils-1.6.2-SNAPSHOT.jar
[JENKINS] Archiving <https://builds.apache.org/job/DeltaSpike%20Weld%201.1.23/ws/deltaspike/test-utils/target/test-utils-1.6.2-SNAPSHOT-sources.jar>
to org.apache.deltaspike.test/test-utils/1.6.2-SNAPSHOT/test-utils-1.6.2-SNAPSHOT-sources.jar
[JENKINS] Archiving <https://builds.apache.org/job/DeltaSpike%20Weld%201.1.23/ws/deltaspike/modules/data/impl/pom.xml>
to org.apache.deltaspike.modules/deltaspike-data-module-impl/1.6.2-SNAPSHOT/deltaspike-data-module-impl-1.6.2-SNAPSHOT.pom
[JENKINS] Archiving <https://builds.apache.org/job/DeltaSpike%20Weld%201.1.23/ws/deltaspike/modules/data/api/pom.xml>
to org.apache.deltaspike.modules/deltaspike-data-module-api/1.6.2-SNAPSHOT/deltaspike-data-module-api-1.6.2-SNAPSHOT.pom
[JENKINS] Archiving <https://builds.apache.org/job/DeltaSpike%20Weld%201.1.23/ws/deltaspike/modules/data/api/target/deltaspike-data-module-api-1.6.2-SNAPSHOT.jar>
to org.apache.deltaspike.modules/deltaspike-data-module-api/1.6.2-SNAPSHOT/deltaspike-data-module-api-1.6.2-SNAPSHOT.jar
[JENKINS] Archiving <https://builds.apache.org/job/DeltaSpike%20Weld%201.1.23/ws/deltaspike/modules/data/api/target/deltaspike-data-module-api-1.6.2-SNAPSHOT-tests.jar>
to org.apache.deltaspike.modules/deltaspike-data-module-api/1.6.2-SNAPSHOT/deltaspike-data-module-api-1.6.2-SNAPSHOT-tests.jar
[JENKINS] Archiving <https://builds.apache.org/job/DeltaSpike%20Weld%201.1.23/ws/deltaspike/modules/data/api/target/deltaspike-data-module-api-1.6.2-SNAPSHOT-sources.jar>
to org.apache.deltaspike.modules/deltaspike-data-module-api/1.6.2-SNAPSHOT/deltaspike-data-module-api-1.6.2-SNAPSHOT-sources.jar
[JENKINS] Archiving <https://builds.apache.org/job/DeltaSpike%20Weld%201.1.23/ws/deltaspike/core/impl/pom.xml>
to org.apache.deltaspike.core/deltaspike-core-impl/1.6.2-SNAPSHOT/deltaspike-core-impl-1.6.2-SNAPSHOT.pom
[JENKINS] Archiving <https://builds.apache.org/job/DeltaSpike%20Weld%201.1.23/ws/deltaspike/core/impl/target/deltaspike-core-impl-1.6.2-SNAPSHOT.jar>
to org.apache.deltaspike.core/deltaspike-core-impl/1.6.2-SNAPSHOT/deltaspike-core-impl-1.6.2-SNAPSHOT.jar
[JENKINS] Archiving <https://builds.apache.org/job/DeltaSpike%20Weld%201.1.23/ws/deltaspike/core/impl/target/deltaspike-core-impl-1.6.2-SNAPSHOT-tests.jar>
to org.apache.deltaspike.core/deltaspike-core-impl/1.6.2-SNAPSHOT/deltaspike-core-impl-1.6.2-SNAPSHOT-tests.jar
[JENKINS] Archiving <https://builds.apache.org/job/DeltaSpike%20Weld%201.1.23/ws/deltaspike/core/impl/target/deltaspike-core-impl-1.6.2-SNAPSHOT-sources.jar>
to org.apache.deltaspike.core/deltaspike-core-impl/1.6.2-SNAPSHOT/deltaspike-core-impl-1.6.2-SNAPSHOT-sources.jar
[JENKINS] Archiving <https://builds.apache.org/job/DeltaSpike%20Weld%201.1.23/ws/deltaspike/modules/pom.xml>
to org.apache.deltaspike.modules/modules-project/1.6.2-SNAPSHOT/modules-project-1.6.2-SNAPSHOT.pom
[JENKINS] Archiving <https://builds.apache.org/job/DeltaSpike%20Weld%201.1.23/ws/deltaspike/modules/target/modules-project-1.6.2-SNAPSHOT-tests.jar>
to org.apache.deltaspike.modules/modules-project/1.6.2-SNAPSHOT/modules-project-1.6.2-SNAPSHOT-tests.jar
[JENKINS] Archiving <https://builds.apache.org/job/DeltaSpike%20Weld%201.1.23/ws/deltaspike/modules/test-control/pom.xml>
to org.apache.deltaspike.modules/test-control-module-project/1.6.2-SNAPSHOT/test-control-module-project-1.6.2-SNAPSHOT.pom
[JENKINS] Archiving <https://builds.apache.org/job/DeltaSpike%20Weld%201.1.23/ws/deltaspike/examples/jsf-examples/pom.xml>
to org.apache.deltaspike.examples/deltaspike-jsf-example/1.6.2-SNAPSHOT/deltaspike-jsf-example-1.6.2-SNAPSHOT.pom
[JENKINS] Archiving <https://builds.apache.org/job/DeltaSpike%20Weld%201.1.23/ws/deltaspike/cdictrl/api/pom.xml>
to org.apache.deltaspike.cdictrl/deltaspike-cdictrl-api/1.6.2-SNAPSHOT/deltaspike-cdictrl-api-1.6.2-SNAPSHOT.pom
[JENKINS] Archiving <https://builds.apache.org/job/DeltaSpike%20Weld%201.1.23/ws/deltaspike/cdictrl/api/target/deltaspike-cdictrl-api-1.6.2-SNAPSHOT.jar>
to org.apache.deltaspike.cdictrl/deltaspike-cdictrl-api/1.6.2-SNAPSHOT/deltaspike-cdictrl-api-1.6.2-SNAPSHOT.jar
[JENKINS] Archiving <https://builds.apache.org/job/DeltaSpike%20Weld%201.1.23/ws/deltaspike/cdictrl/api/target/deltaspike-cdictrl-api-1.6.2-SNAPSHOT-sources.jar>
to org.apache.deltaspike.cdictrl/deltaspike-cdictrl-api/1.6.2-SNAPSHOT/deltaspike-cdictrl-api-1.6.2-SNAPSHOT-sources.jar
[JENKINS] Archiving <https://builds.apache.org/job/DeltaSpike%20Weld%201.1.23/ws/deltaspike/cdictrl/servlet/pom.xml>
to org.apache.deltaspike.cdictrl/deltaspike-cdictrl-servlet/1.6.2-SNAPSHOT/deltaspike-cdictrl-servlet-1.6.2-SNAPSHOT.pom
[JENKINS] Archiving <https://builds.apache.org/job/DeltaSpike%20Weld%201.1.23/ws/deltaspike/cdictrl/servlet/target/deltaspike-cdictrl-servlet-1.6.2-SNAPSHOT.jar>
to org.apache.deltaspike.cdictrl/deltaspike-cdictrl-servlet/1.6.2-SNAPSHOT/deltaspike-cdictrl-servlet-1.6.2-SNAPSHOT.jar
[JENKINS] Archiving <https://builds.apache.org/job/DeltaSpike%20Weld%201.1.23/ws/deltaspike/cdictrl/servlet/target/deltaspike-cdictrl-servlet-1.6.2-SNAPSHOT-sources.jar>
to org.apache.deltaspike.cdictrl/deltaspike-cdictrl-servlet/1.6.2-SNAPSHOT/deltaspike-cdictrl-servlet-1.6.2-SNAPSHOT-sources.jar
[JENKINS] Archiving <https://builds.apache.org/job/DeltaSpike%20Weld%201.1.23/ws/deltaspike/examples/scheduler-playground/pom.xml>
to org.apache.deltaspike.examples/deltaspike-scheduler-example/1.6.2-SNAPSHOT/deltaspike-scheduler-example-1.6.2-SNAPSHOT.pom
[JENKINS] Archiving <https://builds.apache.org/job/DeltaSpike%20Weld%201.1.23/ws/deltaspike/checkstyle-rules/pom.xml>
to org.apache.deltaspike/checkstyle-rules/1.6.2-SNAPSHOT/checkstyle-rules-1.6.2-SNAPSHOT.pom
[JENKINS] Archiving <https://builds.apache.org/job/DeltaSpike%20Weld%201.1.23/ws/deltaspike/checkstyle-rules/target/checkstyle-rules-1.6.2-SNAPSHOT.jar>
to org.apache.deltaspike/checkstyle-rules/1.6.2-SNAPSHOT/checkstyle-rules-1.6.2-SNAPSHOT.jar
[JENKINS] Archiving <https://builds.apache.org/job/DeltaSpike%20Weld%201.1.23/ws/deltaspike/parent/code/pom.xml>
to org.apache.deltaspike/parent-code/1.6.2-SNAPSHOT/parent-code-1.6.2-SNAPSHOT.pom
[JENKINS] Archiving <https://builds.apache.org/job/DeltaSpike%20Weld%201.1.23/ws/deltaspike/parent/code/target/parent-code-1.6.2-SNAPSHOT-tests.jar>
to org.apache.deltaspike/parent-code/1.6.2-SNAPSHOT/parent-code-1.6.2-SNAPSHOT-tests.jar
Compressed 87.71 KB of artifacts by 36.5% relative to #232
[JENKINS] Archiving <https://builds.apache.org/job/DeltaSpike%20Weld%201.1.23/ws/deltaspike/modules/jsf/impl/pom.xml>
to org.apache.deltaspike.modules/deltaspike-jsf-module-impl/1.6.2-SNAPSHOT/deltaspike-jsf-module-impl-1.6.2-SNAPSHOT.pom
[JENKINS] Archiving <https://builds.apache.org/job/DeltaSpike%20Weld%201.1.23/ws/deltaspike/modules/jsf/impl/target/deltaspike-jsf-module-impl-1.6.2-SNAPSHOT.jar>
to org.apache.deltaspike.modules/deltaspike-jsf-module-impl/1.6.2-SNAPSHOT/deltaspike-jsf-module-impl-1.6.2-SNAPSHOT.jar
[JENKINS] Archiving <https://builds.apache.org/job/DeltaSpike%20Weld%201.1.23/ws/deltaspike/modules/jsf/impl/target/deltaspike-jsf-module-impl-1.6.2-SNAPSHOT-tests.jar>
to org.apache.deltaspike.modules/deltaspike-jsf-module-impl/1.6.2-SNAPSHOT/deltaspike-jsf-module-impl-1.6.2-SNAPSHOT-tests.jar
[JENKINS] Archiving <https://builds.apache.org/job/DeltaSpike%20Weld%201.1.23/ws/deltaspike/modules/jsf/impl/target/deltaspike-jsf-module-impl-1.6.2-SNAPSHOT-sources.jar>
to org.apache.deltaspike.modules/deltaspike-jsf-module-impl/1.6.2-SNAPSHOT/deltaspike-jsf-module-impl-1.6.2-SNAPSHOT-sources.jar
[JENKINS] Archiving <https://builds.apache.org/job/DeltaSpike%20Weld%201.1.23/ws/deltaspike/modules/partial-bean/pom.xml>
to org.apache.deltaspike.modules/partial-bean-module-project/1.6.2-SNAPSHOT/partial-bean-module-project-1.6.2-SNAPSHOT.pom
[JENKINS] Archiving <https://builds.apache.org/job/DeltaSpike%20Weld%201.1.23/ws/deltaspike/modules/partial-bean/target/partial-bean-module-project-1.6.2-SNAPSHOT-tests.jar>
to org.apache.deltaspike.modules/partial-bean-module-project/1.6.2-SNAPSHOT/partial-bean-module-project-1.6.2-SNAPSHOT-tests.jar
[JENKINS] Archiving <https://builds.apache.org/job/DeltaSpike%20Weld%201.1.23/ws/deltaspike/examples/pom.xml>
to org.apache.deltaspike.examples/examples-project/1.6.2-SNAPSHOT/examples-project-1.6.2-SNAPSHOT.pom
[JENKINS] Archiving <https://builds.apache.org/job/DeltaSpike%20Weld%201.1.23/ws/deltaspike/modules/jsf/pom.xml>
to org.apache.deltaspike.modules/jsf-module-project/1.6.2-SNAPSHOT/jsf-module-project-1.6.2-SNAPSHOT.pom
[JENKINS] Archiving <https://builds.apache.org/job/DeltaSpike%20Weld%201.1.23/ws/deltaspike/modules/jsf/target/jsf-module-project-1.6.2-SNAPSHOT-tests.jar>
to org.apache.deltaspike.modules/jsf-module-project/1.6.2-SNAPSHOT/jsf-module-project-1.6.2-SNAPSHOT-tests.jar
[JENKINS] Archiving <https://builds.apache.org/job/DeltaSpike%20Weld%201.1.23/ws/deltaspike/cdictrl/tck/pom.xml>
to org.apache.deltaspike.test/deltaspike-cdictrl-tck/1.6.2-SNAPSHOT/deltaspike-cdictrl-tck-1.6.2-SNAPSHOT.pom
[JENKINS] Archiving <https://builds.apache.org/job/DeltaSpike%20Weld%201.1.23/ws/deltaspike/cdictrl/tck/target/deltaspike-cdictrl-tck-1.6.2-SNAPSHOT.jar>
to org.apache.deltaspike.test/deltaspike-cdictrl-tck/1.6.2-SNAPSHOT/deltaspike-cdictrl-tck-1.6.2-SNAPSHOT.jar
[JENKINS] Archiving <https://builds.apache.org/job/DeltaSpike%20Weld%201.1.23/ws/deltaspike/cdictrl/tck/target/deltaspike-cdictrl-tck-1.6.2-SNAPSHOT-sources.jar>
to org.apache.deltaspike.test/deltaspike-cdictrl-tck/1.6.2-SNAPSHOT/deltaspike-cdictrl-tck-1.6.2-SNAPSHOT-sources.jar
[JENKINS] Archiving <https://builds.apache.org/job/DeltaSpike%20Weld%201.1.23/ws/deltaspike/modules/jsf/api/pom.xml>
to org.apache.deltaspike.modules/deltaspike-jsf-module-api/1.6.2-SNAPSHOT/deltaspike-jsf-module-api-1.6.2-SNAPSHOT.pom
[JENKINS] Archiving <https://builds.apache.org/job/DeltaSpike%20Weld%201.1.23/ws/deltaspike/modules/jsf/api/target/deltaspike-jsf-module-api-1.6.2-SNAPSHOT.jar>
to org.apache.deltaspike.modules/deltaspike-jsf-module-api/1.6.2-SNAPSHOT/deltaspike-jsf-module-api-1.6.2-SNAPSHOT.jar
[JENKINS] Archiving <https://builds.apache.org/job/DeltaSpike%20Weld%201.1.23/ws/deltaspike/modules/jsf/api/target/deltaspike-jsf-module-api-1.6.2-SNAPSHOT-tests.jar>
to org.apache.deltaspike.modules/deltaspike-jsf-module-api/1.6.2-SNAPSHOT/deltaspike-jsf-module-api-1.6.2-SNAPSHOT-tests.jar
[JENKINS] Archiving <https://builds.apache.org/job/DeltaSpike%20Weld%201.1.23/ws/deltaspike/modules/jsf/api/target/deltaspike-jsf-module-api-1.6.2-SNAPSHOT-sources.jar>
to org.apache.deltaspike.modules/deltaspike-jsf-module-api/1.6.2-SNAPSHOT/deltaspike-jsf-module-api-1.6.2-SNAPSHOT-sources.jar
[JENKINS] Archiving <https://builds.apache.org/job/DeltaSpike%20Weld%201.1.23/ws/deltaspike/modules/security/pom.xml>
to org.apache.deltaspike.modules/security-module-project/1.6.2-SNAPSHOT/security-module-project-1.6.2-SNAPSHOT.pom
[JENKINS] Archiving <https://builds.apache.org/job/DeltaSpike%20Weld%201.1.23/ws/deltaspike/modules/security/target/security-module-project-1.6.2-SNAPSHOT-tests.jar>
to org.apache.deltaspike.modules/security-module-project/1.6.2-SNAPSHOT/security-module-project-1.6.2-SNAPSHOT-tests.jar
[JENKINS] Archiving <https://builds.apache.org/job/DeltaSpike%20Weld%201.1.23/ws/deltaspike/modules/bean-validation/pom.xml>
to org.apache.deltaspike.modules/bean-validation-module-project/1.6.2-SNAPSHOT/bean-validation-module-project-1.6.2-SNAPSHOT.pom
[JENKINS] Archiving <https://builds.apache.org/job/DeltaSpike%20Weld%201.1.23/ws/deltaspike/modules/bean-validation/target/bean-validation-module-project-1.6.2-SNAPSHOT-tests.jar>
to org.apache.deltaspike.modules/bean-validation-module-project/1.6.2-SNAPSHOT/bean-validation-module-project-1.6.2-SNAPSHOT-tests.jar
[JENKINS] Archiving <https://builds.apache.org/job/DeltaSpike%20Weld%201.1.23/ws/deltaspike/modules/partial-bean/impl/pom.xml>
to org.apache.deltaspike.modules/deltaspike-partial-bean-module-impl/1.6.2-SNAPSHOT/deltaspike-partial-bean-module-impl-1.6.2-SNAPSHOT.pom
[JENKINS] Archiving <https://builds.apache.org/job/DeltaSpike%20Weld%201.1.23/ws/deltaspike/modules/partial-bean/impl/target/deltaspike-partial-bean-module-impl-1.6.2-SNAPSHOT.jar>
to org.apache.deltaspike.modules/deltaspike-partial-bean-module-impl/1.6.2-SNAPSHOT/deltaspike-partial-bean-module-impl-1.6.2-SNAPSHOT.jar
[JENKINS] Archiving <https://builds.apache.org/job/DeltaSpike%20Weld%201.1.23/ws/deltaspike/modules/partial-bean/impl/target/deltaspike-partial-bean-module-impl-1.6.2-SNAPSHOT-tests.jar>
to org.apache.deltaspike.modules/deltaspike-partial-bean-module-impl/1.6.2-SNAPSHOT/deltaspike-partial-bean-module-impl-1.6.2-SNAPSHOT-tests.jar
[JENKINS] Archiving <https://builds.apache.org/job/DeltaSpike%20Weld%201.1.23/ws/deltaspike/modules/partial-bean/impl/target/deltaspike-partial-bean-module-impl-1.6.2-SNAPSHOT-sources.jar>
to org.apache.deltaspike.modules/deltaspike-partial-bean-module-impl/1.6.2-SNAPSHOT/deltaspike-partial-bean-module-impl-1.6.2-SNAPSHOT-sources.jar
[JENKINS] Archiving <https://builds.apache.org/job/DeltaSpike%20Weld%201.1.23/ws/deltaspike/modules/proxy/api/pom.xml>
to org.apache.deltaspike.modules/deltaspike-proxy-module-api/1.6.2-SNAPSHOT/deltaspike-proxy-module-api-1.6.2-SNAPSHOT.pom
[JENKINS] Archiving <https://builds.apache.org/job/DeltaSpike%20Weld%201.1.23/ws/deltaspike/modules/proxy/api/target/deltaspike-proxy-module-api-1.6.2-SNAPSHOT.jar>
to org.apache.deltaspike.modules/deltaspike-proxy-module-api/1.6.2-SNAPSHOT/deltaspike-proxy-module-api-1.6.2-SNAPSHOT.jar
[JENKINS] Archiving <https://builds.apache.org/job/DeltaSpike%20Weld%201.1.23/ws/deltaspike/modules/proxy/api/target/deltaspike-proxy-module-api-1.6.2-SNAPSHOT-tests.jar>
to org.apache.deltaspike.modules/deltaspike-proxy-module-api/1.6.2-SNAPSHOT/deltaspike-proxy-module-api-1.6.2-SNAPSHOT-tests.jar
[JENKINS] Archiving <https://builds.apache.org/job/DeltaSpike%20Weld%201.1.23/ws/deltaspike/modules/proxy/api/target/deltaspike-proxy-module-api-1.6.2-SNAPSHOT-sources.jar>
to org.apache.deltaspike.modules/deltaspike-proxy-module-api/1.6.2-SNAPSHOT/deltaspike-proxy-module-api-1.6.2-SNAPSHOT-sources.jar
[JENKINS] Archiving <https://builds.apache.org/job/DeltaSpike%20Weld%201.1.23/ws/deltaspike/cdictrl/impl-weld/pom.xml>
to org.apache.deltaspike.cdictrl/deltaspike-cdictrl-weld/1.6.2-SNAPSHOT/deltaspike-cdictrl-weld-1.6.2-SNAPSHOT.pom
[JENKINS] Archiving <https://builds.apache.org/job/DeltaSpike%20Weld%201.1.23/ws/deltaspike/cdictrl/impl-weld/target/deltaspike-cdictrl-weld-1.6.2-SNAPSHOT.jar>
to org.apache.deltaspike.cdictrl/deltaspike-cdictrl-weld/1.6.2-SNAPSHOT/deltaspike-cdictrl-weld-1.6.2-SNAPSHOT.jar
[JENKINS] Archiving <https://builds.apache.org/job/DeltaSpike%20Weld%201.1.23/ws/deltaspike/cdictrl/impl-weld/target/deltaspike-cdictrl-weld-1.6.2-SNAPSHOT-sources.jar>
to org.apache.deltaspike.cdictrl/deltaspike-cdictrl-weld/1.6.2-SNAPSHOT/deltaspike-cdictrl-weld-1.6.2-SNAPSHOT-sources.jar
[JENKINS] Archiving <https://builds.apache.org/job/DeltaSpike%20Weld%201.1.23/ws/deltaspike/modules/jpa/api/pom.xml>
to org.apache.deltaspike.modules/deltaspike-jpa-module-api/1.6.2-SNAPSHOT/deltaspike-jpa-module-api-1.6.2-SNAPSHOT.pom
[JENKINS] Archiving <https://builds.apache.org/job/DeltaSpike%20Weld%201.1.23/ws/deltaspike/modules/jpa/api/target/deltaspike-jpa-module-api-1.6.2-SNAPSHOT.jar>
to org.apache.deltaspike.modules/deltaspike-jpa-module-api/1.6.2-SNAPSHOT/deltaspike-jpa-module-api-1.6.2-SNAPSHOT.jar
[JENKINS] Archiving <https://builds.apache.org/job/DeltaSpike%20Weld%201.1.23/ws/deltaspike/modules/jpa/api/target/deltaspike-jpa-module-api-1.6.2-SNAPSHOT-tests.jar>
to org.apache.deltaspike.modules/deltaspike-jpa-module-api/1.6.2-SNAPSHOT/deltaspike-jpa-module-api-1.6.2-SNAPSHOT-tests.jar
[JENKINS] Archiving <https://builds.apache.org/job/DeltaSpike%20Weld%201.1.23/ws/deltaspike/modules/jpa/api/target/deltaspike-jpa-module-api-1.6.2-SNAPSHOT-sources.jar>
to org.apache.deltaspike.modules/deltaspike-jpa-module-api/1.6.2-SNAPSHOT/deltaspike-jpa-module-api-1.6.2-SNAPSHOT-sources.jar
[JENKINS] Archiving <https://builds.apache.org/job/DeltaSpike%20Weld%201.1.23/ws/deltaspike/modules/servlet/api/pom.xml>
to org.apache.deltaspike.modules/deltaspike-servlet-module-api/1.6.2-SNAPSHOT/deltaspike-servlet-module-api-1.6.2-SNAPSHOT.pom
[JENKINS] Archiving <https://builds.apache.org/job/DeltaSpike%20Weld%201.1.23/ws/deltaspike/modules/servlet/api/target/deltaspike-servlet-module-api-1.6.2-SNAPSHOT.jar>
to org.apache.deltaspike.modules/deltaspike-servlet-module-api/1.6.2-SNAPSHOT/deltaspike-servlet-module-api-1.6.2-SNAPSHOT.jar
[JENKINS] Archiving <https://builds.apache.org/job/DeltaSpike%20Weld%201.1.23/ws/deltaspike/modules/servlet/api/target/deltaspike-servlet-module-api-1.6.2-SNAPSHOT-tests.jar>
to org.apache.deltaspike.modules/deltaspike-servlet-module-api/1.6.2-SNAPSHOT/deltaspike-servlet-module-api-1.6.2-SNAPSHOT-tests.jar
[JENKINS] Archiving <https://builds.apache.org/job/DeltaSpike%20Weld%201.1.23/ws/deltaspike/modules/servlet/api/target/deltaspike-servlet-module-api-1.6.2-SNAPSHOT-sources.jar>
to org.apache.deltaspike.modules/deltaspike-servlet-module-api/1.6.2-SNAPSHOT/deltaspike-servlet-module-api-1.6.2-SNAPSHOT-sources.jar
[JENKINS] Archiving <https://builds.apache.org/job/DeltaSpike%20Weld%201.1.23/ws/deltaspike/modules/jpa/pom.xml>
to org.apache.deltaspike.modules/jpa-module-project/1.6.2-SNAPSHOT/jpa-module-project-1.6.2-SNAPSHOT.pom
[JENKINS] Archiving <https://builds.apache.org/job/DeltaSpike%20Weld%201.1.23/ws/deltaspike/modules/jpa/target/jpa-module-project-1.6.2-SNAPSHOT-tests.jar>
to org.apache.deltaspike.modules/jpa-module-project/1.6.2-SNAPSHOT/jpa-module-project-1.6.2-SNAPSHOT-tests.jar
[JENKINS] Archiving <https://builds.apache.org/job/DeltaSpike%20Weld%201.1.23/ws/deltaspike/cdictrl/pom.xml>
to org.apache.deltaspike.cdictrl/cdictrl-project/1.6.2-SNAPSHOT/cdictrl-project-1.6.2-SNAPSHOT.pom
[JENKINS] Archiving <https://builds.apache.org/job/DeltaSpike%20Weld%201.1.23/ws/deltaspike/modules/scheduler/api/pom.xml>
to org.apache.deltaspike.modules/deltaspike-scheduler-module-api/1.6.2-SNAPSHOT/deltaspike-scheduler-module-api-1.6.2-SNAPSHOT.pom
[JENKINS] Archiving <https://builds.apache.org/job/DeltaSpike%20Weld%201.1.23/ws/deltaspike/modules/test-control/impl/pom.xml>
to org.apache.deltaspike.modules/deltaspike-test-control-module-impl/1.6.2-SNAPSHOT/deltaspike-test-control-module-impl-1.6.2-SNAPSHOT.pom
[JENKINS] Archiving <https://builds.apache.org/job/DeltaSpike%20Weld%201.1.23/ws/deltaspike/modules/servlet/pom.xml>
to org.apache.deltaspike.modules/servlet-module-project/1.6.2-SNAPSHOT/servlet-module-project-1.6.2-SNAPSHOT.pom
[JENKINS] Archiving <https://builds.apache.org/job/DeltaSpike%20Weld%201.1.23/ws/deltaspike/modules/servlet/target/servlet-module-project-1.6.2-SNAPSHOT-tests.jar>
to org.apache.deltaspike.modules/servlet-module-project/1.6.2-SNAPSHOT/servlet-module-project-1.6.2-SNAPSHOT-tests.jar
[JENKINS] Archiving <https://builds.apache.org/job/DeltaSpike%20Weld%201.1.23/ws/deltaspike/modules/test-control/api/pom.xml>
to org.apache.deltaspike.modules/deltaspike-test-control-module-api/1.6.2-SNAPSHOT/deltaspike-test-control-module-api-1.6.2-SNAPSHOT.pom
[JENKINS] Archiving <https://builds.apache.org/job/DeltaSpike%20Weld%201.1.23/ws/deltaspike/modules/jsf/impl-ee6/pom.xml>
to org.apache.deltaspike.modules/deltaspike-jsf-module-impl-ee6/1.6.2-SNAPSHOT/deltaspike-jsf-module-impl-ee6-1.6.2-SNAPSHOT.pom
[JENKINS] Archiving <https://builds.apache.org/job/DeltaSpike%20Weld%201.1.23/ws/deltaspike/modules/jsf/impl-ee6/target/deltaspike-jsf-module-impl-ee6-1.6.2-SNAPSHOT.jar>
to org.apache.deltaspike.modules/deltaspike-jsf-module-impl-ee6/1.6.2-SNAPSHOT/deltaspike-jsf-module-impl-ee6-1.6.2-SNAPSHOT.jar
[JENKINS] Archiving <https://builds.apache.org/job/DeltaSpike%20Weld%201.1.23/ws/deltaspike/modules/jsf/impl-ee6/target/deltaspike-jsf-module-impl-ee6-1.6.2-SNAPSHOT-tests.jar>
to org.apache.deltaspike.modules/deltaspike-jsf-module-impl-ee6/1.6.2-SNAPSHOT/deltaspike-jsf-module-impl-ee6-1.6.2-SNAPSHOT-tests.jar
[JENKINS] Archiving <https://builds.apache.org/job/DeltaSpike%20Weld%201.1.23/ws/deltaspike/modules/jsf/impl-ee6/target/deltaspike-jsf-module-impl-ee6-1.6.2-SNAPSHOT-sources.jar>
to org.apache.deltaspike.modules/deltaspike-jsf-module-impl-ee6/1.6.2-SNAPSHOT/deltaspike-jsf-module-impl-ee6-1.6.2-SNAPSHOT-sources.jar
[JENKINS] Archiving <https://builds.apache.org/job/DeltaSpike%20Weld%201.1.23/ws/deltaspike/modules/proxy/pom.xml>
to org.apache.deltaspike.modules/proxy-module-project/1.6.2-SNAPSHOT/proxy-module-project-1.6.2-SNAPSHOT.pom
[JENKINS] Archiving <https://builds.apache.org/job/DeltaSpike%20Weld%201.1.23/ws/deltaspike/modules/proxy/target/proxy-module-project-1.6.2-SNAPSHOT-tests.jar>
to org.apache.deltaspike.modules/proxy-module-project/1.6.2-SNAPSHOT/proxy-module-project-1.6.2-SNAPSHOT-tests.jar
[JENKINS] Archiving <https://builds.apache.org/job/DeltaSpike%20Weld%201.1.23/ws/deltaspike/modules/partial-bean/api/pom.xml>
to org.apache.deltaspike.modules/deltaspike-partial-bean-module-api/1.6.2-SNAPSHOT/deltaspike-partial-bean-module-api-1.6.2-SNAPSHOT.pom
[JENKINS] Archiving <https://builds.apache.org/job/DeltaSpike%20Weld%201.1.23/ws/deltaspike/modules/partial-bean/api/target/deltaspike-partial-bean-module-api-1.6.2-SNAPSHOT.jar>
to org.apache.deltaspike.modules/deltaspike-partial-bean-module-api/1.6.2-SNAPSHOT/deltaspike-partial-bean-module-api-1.6.2-SNAPSHOT.jar
[JENKINS] Archiving <https://builds.apache.org/job/DeltaSpike%20Weld%201.1.23/ws/deltaspike/modules/partial-bean/api/target/deltaspike-partial-bean-module-api-1.6.2-SNAPSHOT-tests.jar>
to org.apache.deltaspike.modules/deltaspike-partial-bean-module-api/1.6.2-SNAPSHOT/deltaspike-partial-bean-module-api-1.6.2-SNAPSHOT-tests.jar
[JENKINS] Archiving <https://builds.apache.org/job/DeltaSpike%20Weld%201.1.23/ws/deltaspike/modules/partial-bean/api/target/deltaspike-partial-bean-module-api-1.6.2-SNAPSHOT-sources.jar>
to org.apache.deltaspike.modules/deltaspike-partial-bean-module-api/1.6.2-SNAPSHOT/deltaspike-partial-bean-module-api-1.6.2-SNAPSHOT-sources.jar
[JENKINS] Archiving <https://builds.apache.org/job/DeltaSpike%20Weld%201.1.23/ws/deltaspike/modules/scheduler/impl/pom.xml>
to org.apache.deltaspike.modules/deltaspike-scheduler-module-impl/1.6.2-SNAPSHOT/deltaspike-scheduler-module-impl-1.6.2-SNAPSHOT.pom
[JENKINS] Archiving <https://builds.apache.org/job/DeltaSpike%20Weld%201.1.23/ws/deltaspike/parent/pom.xml>
to org.apache.deltaspike/parent/1.6.2-SNAPSHOT/parent-1.6.2-SNAPSHOT.pom
[JENKINS] Archiving <https://builds.apache.org/job/DeltaSpike%20Weld%201.1.23/ws/deltaspike/core/pom.xml>
to org.apache.deltaspike.core/core-project/1.6.2-SNAPSHOT/core-project-1.6.2-SNAPSHOT.pom
[JENKINS] Archiving <https://builds.apache.org/job/DeltaSpike%20Weld%201.1.23/ws/deltaspike/core/target/core-project-1.6.2-SNAPSHOT-tests.jar>
to org.apache.deltaspike.core/core-project/1.6.2-SNAPSHOT/core-project-1.6.2-SNAPSHOT-tests.jar
[JENKINS] Archiving <https://builds.apache.org/job/DeltaSpike%20Weld%201.1.23/ws/deltaspike/modules/bean-validation/api/pom.xml>
to org.apache.deltaspike.modules/deltaspike-bean-validation-module-api/1.6.2-SNAPSHOT/deltaspike-bean-validation-module-api-1.6.2-SNAPSHOT.pom
[JENKINS] Archiving <https://builds.apache.org/job/DeltaSpike%20Weld%201.1.23/ws/deltaspike/modules/bean-validation/api/target/deltaspike-bean-validation-module-api-1.6.2-SNAPSHOT.jar>
to org.apache.deltaspike.modules/deltaspike-bean-validation-module-api/1.6.2-SNAPSHOT/deltaspike-bean-validation-module-api-1.6.2-SNAPSHOT.jar
[JENKINS] Archiving <https://builds.apache.org/job/DeltaSpike%20Weld%201.1.23/ws/deltaspike/modules/bean-validation/api/target/deltaspike-bean-validation-module-api-1.6.2-SNAPSHOT-tests.jar>
to org.apache.deltaspike.modules/deltaspike-bean-validation-module-api/1.6.2-SNAPSHOT/deltaspike-bean-validation-module-api-1.6.2-SNAPSHOT-tests.jar
[JENKINS] Archiving <https://builds.apache.org/job/DeltaSpike%20Weld%201.1.23/ws/deltaspike/modules/bean-validation/api/target/deltaspike-bean-validation-module-api-1.6.2-SNAPSHOT-sources.jar>
to org.apache.deltaspike.modules/deltaspike-bean-validation-module-api/1.6.2-SNAPSHOT/deltaspike-bean-validation-module-api-1.6.2-SNAPSHOT-sources.jar
[JENKINS] Archiving <https://builds.apache.org/job/DeltaSpike%20Weld%201.1.23/ws/deltaspike/core/api/pom.xml>
to org.apache.deltaspike.core/deltaspike-core-api/1.6.2-SNAPSHOT/deltaspike-core-api-1.6.2-SNAPSHOT.pom
[JENKINS] Archiving <https://builds.apache.org/job/DeltaSpike%20Weld%201.1.23/ws/deltaspike/core/api/target/deltaspike-core-api-1.6.2-SNAPSHOT.jar>
to org.apache.deltaspike.core/deltaspike-core-api/1.6.2-SNAPSHOT/deltaspike-core-api-1.6.2-SNAPSHOT.jar
[JENKINS] Archiving <https://builds.apache.org/job/DeltaSpike%20Weld%201.1.23/ws/deltaspike/core/api/target/deltaspike-core-api-1.6.2-SNAPSHOT-tests.jar>
to org.apache.deltaspike.core/deltaspike-core-api/1.6.2-SNAPSHOT/deltaspike-core-api-1.6.2-SNAPSHOT-tests.jar
[JENKINS] Archiving <https://builds.apache.org/job/DeltaSpike%20Weld%201.1.23/ws/deltaspike/core/api/target/deltaspike-core-api-1.6.2-SNAPSHOT-sources.jar>
to org.apache.deltaspike.core/deltaspike-core-api/1.6.2-SNAPSHOT/deltaspike-core-api-1.6.2-SNAPSHOT-sources.jar
[JENKINS] Archiving <https://builds.apache.org/job/DeltaSpike%20Weld%201.1.23/ws/deltaspike/modules/security/impl/pom.xml>
to org.apache.deltaspike.modules/deltaspike-security-module-impl/1.6.2-SNAPSHOT/deltaspike-security-module-impl-1.6.2-SNAPSHOT.pom
[JENKINS] Archiving <https://builds.apache.org/job/DeltaSpike%20Weld%201.1.23/ws/deltaspike/modules/security/impl/target/deltaspike-security-module-impl-1.6.2-SNAPSHOT.jar>
to org.apache.deltaspike.modules/deltaspike-security-module-impl/1.6.2-SNAPSHOT/deltaspike-security-module-impl-1.6.2-SNAPSHOT.jar
[JENKINS] Archiving <https://builds.apache.org/job/DeltaSpike%20Weld%201.1.23/ws/deltaspike/modules/security/impl/target/deltaspike-security-module-impl-1.6.2-SNAPSHOT-tests.jar>
to org.apache.deltaspike.modules/deltaspike-security-module-impl/1.6.2-SNAPSHOT/deltaspike-security-module-impl-1.6.2-SNAPSHOT-tests.jar
[JENKINS] Archiving <https://builds.apache.org/job/DeltaSpike%20Weld%201.1.23/ws/deltaspike/modules/security/impl/target/deltaspike-security-module-impl-1.6.2-SNAPSHOT-sources.jar>
to org.apache.deltaspike.modules/deltaspike-security-module-impl/1.6.2-SNAPSHOT/deltaspike-security-module-impl-1.6.2-SNAPSHOT-sources.jar
[JENKINS] Archiving <https://builds.apache.org/job/DeltaSpike%20Weld%201.1.23/ws/deltaspike/modules/scheduler/pom.xml>
to org.apache.deltaspike.modules/scheduler-module-project/1.6.2-SNAPSHOT/scheduler-module-project-1.6.2-SNAPSHOT.pom
[JENKINS] Archiving <https://builds.apache.org/job/DeltaSpike%20Weld%201.1.23/ws/deltaspike/modules/proxy/impl-asm5/pom.xml>
to org.apache.deltaspike.modules/deltaspike-proxy-module-impl-asm5/1.6.2-SNAPSHOT/deltaspike-proxy-module-impl-asm5-1.6.2-SNAPSHOT.pom
[JENKINS] Archiving <https://builds.apache.org/job/DeltaSpike%20Weld%201.1.23/ws/deltaspike/modules/proxy/impl-asm5/target/deltaspike-proxy-module-impl-asm5-1.6.2-SNAPSHOT.jar>
to org.apache.deltaspike.modules/deltaspike-proxy-module-impl-asm5/1.6.2-SNAPSHOT/deltaspike-proxy-module-impl-asm5-1.6.2-SNAPSHOT.jar
[JENKINS] Archiving <https://builds.apache.org/job/DeltaSpike%20Weld%201.1.23/ws/deltaspike/modules/proxy/impl-asm5/target/deltaspike-proxy-module-impl-asm5-1.6.2-SNAPSHOT-tests.jar>
to org.apache.deltaspike.modules/deltaspike-proxy-module-impl-asm5/1.6.2-SNAPSHOT/deltaspike-proxy-module-impl-asm5-1.6.2-SNAPSHOT-tests.jar
[JENKINS] Archiving <https://builds.apache.org/job/DeltaSpike%20Weld%201.1.23/ws/deltaspike/modules/proxy/impl-asm5/target/deltaspike-proxy-module-impl-asm5-1.6.2-SNAPSHOT-sources.jar>
to org.apache.deltaspike.modules/deltaspike-proxy-module-impl-asm5/1.6.2-SNAPSHOT/deltaspike-proxy-module-impl-asm5-1.6.2-SNAPSHOT-sources.jar
[JENKINS] Archiving <https://builds.apache.org/job/DeltaSpike%20Weld%201.1.23/ws/deltaspike/examples/jsf-playground/pom.xml>
to org.apache.deltaspike.examples/deltaspike-jsf-playground/1.6.2-SNAPSHOT/deltaspike-jsf-playground-1.6.2-SNAPSHOT.pom
[JENKINS] Archiving <https://builds.apache.org/job/DeltaSpike%20Weld%201.1.23/ws/deltaspike/modules/servlet/impl/pom.xml>
to org.apache.deltaspike.modules/deltaspike-servlet-module-impl/1.6.2-SNAPSHOT/deltaspike-servlet-module-impl-1.6.2-SNAPSHOT.pom
[JENKINS] Archiving <https://builds.apache.org/job/DeltaSpike%20Weld%201.1.23/ws/deltaspike/modules/servlet/impl/target/deltaspike-servlet-module-impl-1.6.2-SNAPSHOT.jar>
to org.apache.deltaspike.modules/deltaspike-servlet-module-impl/1.6.2-SNAPSHOT/deltaspike-servlet-module-impl-1.6.2-SNAPSHOT.jar
[JENKINS] Archiving <https://builds.apache.org/job/DeltaSpike%20Weld%201.1.23/ws/deltaspike/modules/servlet/impl/target/deltaspike-servlet-module-impl-1.6.2-SNAPSHOT-tests.jar>
to org.apache.deltaspike.modules/deltaspike-servlet-module-impl/1.6.2-SNAPSHOT/deltaspike-servlet-module-impl-1.6.2-SNAPSHOT-tests.jar
[JENKINS] Archiving <https://builds.apache.org/job/DeltaSpike%20Weld%201.1.23/ws/deltaspike/modules/servlet/impl/target/deltaspike-servlet-module-impl-1.6.2-SNAPSHOT-sources.jar>
to org.apache.deltaspike.modules/deltaspike-servlet-module-impl/1.6.2-SNAPSHOT/deltaspike-servlet-module-impl-1.6.2-SNAPSHOT-sources.jar
[JENKINS] Archiving <https://builds.apache.org/job/DeltaSpike%20Weld%201.1.23/ws/deltaspike/modules/bean-validation/impl/pom.xml>
to org.apache.deltaspike.modules/deltaspike-bean-validation-module-impl/1.6.2-SNAPSHOT/deltaspike-bean-validation-module-impl-1.6.2-SNAPSHOT.pom
[JENKINS] Archiving <https://builds.apache.org/job/DeltaSpike%20Weld%201.1.23/ws/deltaspike/modules/bean-validation/impl/target/deltaspike-bean-validation-module-impl-1.6.2-SNAPSHOT.jar>
to org.apache.deltaspike.modules/deltaspike-bean-validation-module-impl/1.6.2-SNAPSHOT/deltaspike-bean-validation-module-impl-1.6.2-SNAPSHOT.jar
[JENKINS] Archiving <https://builds.apache.org/job/DeltaSpike%20Weld%201.1.23/ws/deltaspike/modules/bean-validation/impl/target/deltaspike-bean-validation-module-impl-1.6.2-SNAPSHOT-tests.jar>
to org.apache.deltaspike.modules/deltaspike-bean-validation-module-impl/1.6.2-SNAPSHOT/deltaspike-bean-validation-module-impl-1.6.2-SNAPSHOT-tests.jar
[JENKINS] Archiving <https://builds.apache.org/job/DeltaSpike%20Weld%201.1.23/ws/deltaspike/modules/bean-validation/impl/target/deltaspike-bean-validation-module-impl-1.6.2-SNAPSHOT-sources.jar>
to org.apache.deltaspike.modules/deltaspike-bean-validation-module-impl/1.6.2-SNAPSHOT/deltaspike-bean-validation-module-impl-1.6.2-SNAPSHOT-sources.jar
[JENKINS] Archiving <https://builds.apache.org/job/DeltaSpike%20Weld%201.1.23/ws/deltaspike/modules/jpa/impl/pom.xml>
to org.apache.deltaspike.modules/deltaspike-jpa-module-impl/1.6.2-SNAPSHOT/deltaspike-jpa-module-impl-1.6.2-SNAPSHOT.pom
[JENKINS] Archiving <https://builds.apache.org/job/DeltaSpike%20Weld%201.1.23/ws/deltaspike/modules/jpa/impl/target/deltaspike-jpa-module-impl-1.6.2-SNAPSHOT.jar>
to org.apache.deltaspike.modules/deltaspike-jpa-module-impl/1.6.2-SNAPSHOT/deltaspike-jpa-module-impl-1.6.2-SNAPSHOT.jar
[JENKINS] Archiving <https://builds.apache.org/job/DeltaSpike%20Weld%201.1.23/ws/deltaspike/modules/jpa/impl/target/deltaspike-jpa-module-impl-1.6.2-SNAPSHOT-tests.jar>
to org.apache.deltaspike.modules/deltaspike-jpa-module-impl/1.6.2-SNAPSHOT/deltaspike-jpa-module-impl-1.6.2-SNAPSHOT-tests.jar
[JENKINS] Archiving <https://builds.apache.org/job/DeltaSpike%20Weld%201.1.23/ws/deltaspike/modules/jpa/impl/target/deltaspike-jpa-module-impl-1.6.2-SNAPSHOT-sources.jar>
to org.apache.deltaspike.modules/deltaspike-jpa-module-impl/1.6.2-SNAPSHOT/deltaspike-jpa-module-impl-1.6.2-SNAPSHOT-sources.jar
[JENKINS] Archiving <https://builds.apache.org/job/DeltaSpike%20Weld%201.1.23/ws/deltaspike/modules/data/pom.xml>
to org.apache.deltaspike.modules/data-module-project/1.6.2-SNAPSHOT/data-module-project-1.6.2-SNAPSHOT.pom
[JENKINS] Archiving <https://builds.apache.org/job/DeltaSpike%20Weld%201.1.23/ws/deltaspike/modules/data/target/data-module-project-1.6.2-SNAPSHOT-tests.jar>
to org.apache.deltaspike.modules/data-module-project/1.6.2-SNAPSHOT/data-module-project-1.6.2-SNAPSHOT-tests.jar
[JENKINS] Archiving <https://builds.apache.org/job/DeltaSpike%20Weld%201.1.23/ws/deltaspike/examples/security-requested-page-after-login-picketlink/pom.xml>
to org.apache.deltaspike.examples/deltaspike-security-requested-page-after-login-picketlink/1.6.2-SNAPSHOT/deltaspike-security-requested-page-after-login-picketlink-1.6.2-SNAPSHOT.pom
[JENKINS] Archiving <https://builds.apache.org/job/DeltaSpike%20Weld%201.1.23/ws/deltaspike/pom.xml>
to org.apache.deltaspike/deltaspike-project/1.6.2-SNAPSHOT/deltaspike-project-1.6.2-SNAPSHOT.pom
[JENKINS] Archiving <https://builds.apache.org/job/DeltaSpike%20Weld%201.1.23/ws/deltaspike/modules/security/api/pom.xml>
to org.apache.deltaspike.modules/deltaspike-security-module-api/1.6.2-SNAPSHOT/deltaspike-security-module-api-1.6.2-SNAPSHOT.pom
[JENKINS] Archiving <https://builds.apache.org/job/DeltaSpike%20Weld%201.1.23/ws/deltaspike/modules/security/api/target/deltaspike-security-module-api-1.6.2-SNAPSHOT.jar>
to org.apache.deltaspike.modules/deltaspike-security-module-api/1.6.2-SNAPSHOT/deltaspike-security-module-api-1.6.2-SNAPSHOT.jar
[JENKINS] Archiving <https://builds.apache.org/job/DeltaSpike%20Weld%201.1.23/ws/deltaspike/modules/security/api/target/deltaspike-security-module-api-1.6.2-SNAPSHOT-tests.jar>
to org.apache.deltaspike.modules/deltaspike-security-module-api/1.6.2-SNAPSHOT/deltaspike-security-module-api-1.6.2-SNAPSHOT-tests.jar
[JENKINS] Archiving <https://builds.apache.org/job/DeltaSpike%20Weld%201.1.23/ws/deltaspike/modules/security/api/target/deltaspike-security-module-api-1.6.2-SNAPSHOT-sources.jar>
to org.apache.deltaspike.modules/deltaspike-security-module-api/1.6.2-SNAPSHOT/deltaspike-security-module-api-1.6.2-SNAPSHOT-sources.jar
Sending e-mails to: commits@deltaspike.apache.org
Sending e-mails to: commits@deltaspike.apache.org
Sending e-mails to: commits@deltaspike.apache.org
Sending e-mails to: commits@deltaspike.apache.org
Sending e-mails to: commits@deltaspike.apache.org
Sending e-mails to: commits@deltaspike.apache.org
Sending e-mails to: commits@deltaspike.apache.org
Sending e-mails to: commits@deltaspike.apache.org
Sending e-mails to: commits@deltaspike.apache.org
Sending e-mails to: commits@deltaspike.apache.org
Sending e-mails to: commits@deltaspike.apache.org
Sending e-mails to: commits@deltaspike.apache.org
Sending e-mails to: commits@deltaspike.apache.org
Sending e-mails to: commits@deltaspike.apache.org
Sending e-mails to: commits@deltaspike.apache.org
Sending e-mails to: commits@deltaspike.apache.org
Sending e-mails to: commits@deltaspike.apache.org
Sending e-mails to: commits@deltaspike.apache.org
Sending e-mails to: commits@deltaspike.apache.org
Sending e-mails to: commits@deltaspike.apache.org
Sending e-mails to: commits@deltaspike.apache.org
Sending e-mails to: commits@deltaspike.apache.org
Sending e-mails to: commits@deltaspike.apache.org
Sending e-mails to: commits@deltaspike.apache.org
Sending e-mails to: commits@deltaspike.apache.org
Sending e-mails to: commits@deltaspike.apache.org
Sending e-mails to: commits@deltaspike.apache.org
Sending e-mails to: commits@deltaspike.apache.org
Sending e-mails to: commits@deltaspike.apache.org
Sending e-mails to: commits@deltaspike.apache.org
Sending e-mails to: commits@deltaspike.apache.org
Sending e-mails to: commits@deltaspike.apache.org
Sending e-mails to: commits@deltaspike.apache.org
Sending e-mails to: commits@deltaspike.apache.org
Sending e-mails to: commits@deltaspike.apache.org
Sending e-mails to: commits@deltaspike.apache.org
Sending e-mails to: commits@deltaspike.apache.org
Sending e-mails to: commits@deltaspike.apache.org
Sending e-mails to: commits@deltaspike.apache.org
channel stopped

Mime
View raw message