deltaspike-commits mailing list archives

Site index · List index
Message view « Date » · « Thread »
Top « Date » · « Thread »
From Apache Jenkins Server <jenk...@builds.apache.org>
Subject Build failed in Jenkins: DeltaSpike Weld 2.0.0.SP1 #639
Date Tue, 10 May 2016 10:45:30 GMT
See <https://builds.apache.org/job/DeltaSpike%20Weld%202.0.0.SP1/639/changes>

Changes:

[manovotn] DELTASPIKE-1141 fix EnableInterceptorsTest for CDI 1.0/Weld 1.x

------------------------------------------
Started by user gpetracek
[EnvInject] - Loading node environment variables.
Building remotely on ubuntu-5 (docker Ubuntu ubuntu5 ubuntu yahoo-not-h2) in workspace <https://builds.apache.org/job/DeltaSpike%20Weld%202.0.0.SP1/ws/>
Cloning the remote Git repository
Cloning repository https://git-wip-us.apache.org/repos/asf/deltaspike.git
 > git init <https://builds.apache.org/job/DeltaSpike%20Weld%202.0.0.SP1/ws/> # timeout=10
Fetching upstream changes from https://git-wip-us.apache.org/repos/asf/deltaspike.git
 > git --version # timeout=10
 > git -c core.askpass=true fetch --tags --progress https://git-wip-us.apache.org/repos/asf/deltaspike.git
+refs/heads/*:refs/remotes/origin/*
 > git config remote.origin.url https://git-wip-us.apache.org/repos/asf/deltaspike.git
# timeout=10
 > git config --add remote.origin.fetch +refs/heads/*:refs/remotes/origin/* # timeout=10
 > git config remote.origin.url https://git-wip-us.apache.org/repos/asf/deltaspike.git
# timeout=10
Fetching upstream changes from https://git-wip-us.apache.org/repos/asf/deltaspike.git
 > git -c core.askpass=true fetch --tags --progress https://git-wip-us.apache.org/repos/asf/deltaspike.git
+refs/heads/*:refs/remotes/origin/*
 > git rev-parse origin/master^{commit} # timeout=10
Checking out Revision 07f5199529a0e2cdb6dfbda20e4b16f060378b84 (origin/master)
 > git config core.sparsecheckout # timeout=10
 > git checkout -f 07f5199529a0e2cdb6dfbda20e4b16f060378b84
 > git rev-list d2558b7ddf682e41bc829d69bbdafa4927c23887 # timeout=10
Parsing POMs
Failed to transfer Could not find artifact org.jboss.weld:weld-core-bom:pom:2.3.4.Final in
Apache Repository (https://repository.apache.org/content/repositories/releases)
Failed to transfer Could not find artifact org.jboss.weld:weld-core-bom:pom:2.3.4.Final in
Apache Snapshot Repository (https://repository.apache.org/content/repositories/snapshots)
Downloaded artifact http://repo.maven.apache.org/maven2/org/jboss/weld/weld-core-bom/2.3.4.Final/weld-core-bom-2.3.4.Final.pom
Discovered a new module org.apache.deltaspike:deltaspike Apache DeltaSpike
Discovered a new module org.apache.deltaspike:deltaspike-documentation Apache DeltaSpike Documentation
Discovered a new module org.apache.deltaspike:deltaspike-site Apache DeltaSpike Site
Modules changed, recalculating dependency graph
Established TCP socket on 33805
maven3-agent.jar already up to date
maven3-interceptor.jar already up to date
maven3-interceptor-commons.jar already up to date
[DeltaSpike Weld 2.0.0.SP1] $ /home/jenkins/jenkins-slave/tools/hudson.model.JDK/JDK_1.7_latest_/bin/java
-Xmx2g -Xms256m -XX:MaxPermSize=512m -cp /home/jenkins/jenkins-slave/maven3-agent.jar:/home/jenkins/tools/maven/apache-maven-3.0.4/boot/plexus-classworlds-2.4.jar
org.jvnet.hudson.maven3.agent.Maven3Main /home/jenkins/tools/maven/apache-maven-3.0.4 /home/jenkins/jenkins-slave/slave.jar
/home/jenkins/jenkins-slave/maven3-interceptor.jar /home/jenkins/jenkins-slave/maven3-interceptor-commons.jar
33805
<===[JENKINS REMOTING CAPACITY]===>   channel started
Executing Maven:  -B -f <https://builds.apache.org/job/DeltaSpike%20Weld%202.0.0.SP1/ws/pom.xml>
-Dmaven.repo.local=/home/jenkins/jenkins-slave/maven-repositories/1 clean install -PWeld2
-Dweld.version=2.0.0.SP1
[INFO] Scanning for projects...
[ERROR] The build could not read 3 projects -> [Help 1]
[ERROR]   
[ERROR]   The project org.apache.deltaspike:parent-code:1.6.2-SNAPSHOT (<https://builds.apache.org/job/DeltaSpike%20Weld%202.0.0.SP1/ws/deltaspike/parent/code/pom.xml)>
has 1 error
[ERROR]     'dependencies.dependency.version' for org.jboss.weld:weld-core-impl:jar is missing.
@ line 435, column 29
[ERROR]   
[ERROR]   The project org.apache.deltaspike.core:core-project:1.6.2-SNAPSHOT (<https://builds.apache.org/job/DeltaSpike%20Weld%202.0.0.SP1/ws/deltaspike/core/pom.xml)>
has 1 error
[ERROR]     'dependencies.dependency.version' for org.jboss.weld:weld-core-impl:jar is missing.
@ org.apache.deltaspike:parent-code:1.6.2-SNAPSHOT, <https://builds.apache.org/job/DeltaSpike%20Weld%202.0.0.SP1/ws/deltaspike/parent/code/pom.xml,>
line 435, column 29
[ERROR]   
[ERROR]   The project org.apache.deltaspike.modules:modules-project:1.6.2-SNAPSHOT (<https://builds.apache.org/job/DeltaSpike%20Weld%202.0.0.SP1/ws/deltaspike/modules/pom.xml)>
has 1 error
[ERROR]     'dependencies.dependency.version' for org.jboss.weld:weld-core-impl:jar is missing.
@ org.apache.deltaspike:parent-code:1.6.2-SNAPSHOT, <https://builds.apache.org/job/DeltaSpike%20Weld%202.0.0.SP1/ws/deltaspike/parent/code/pom.xml,>
line 435, column 29
[ERROR] 
[ERROR] To see the full stack trace of the errors, re-run Maven with the -e switch.
[ERROR] Re-run Maven using the -X switch to enable full debug logging.
[ERROR] 
[ERROR] For more information about the errors and possible solutions, please read the following
articles:
[ERROR] [Help 1] http://cwiki.apache.org/confluence/display/MAVEN/ProjectBuildingException
channel stopped

Mime
View raw message