deltaspike-commits mailing list archives

Site index · List index
Message view « Date » · « Thread »
Top « Date » · « Thread »
From Apache Jenkins Server <jenk...@builds.apache.org>
Subject Build failed in Jenkins: DeltaSpike_TomEE-SNAPSHOT #876
Date Wed, 04 May 2016 07:33:47 GMT
See <https://builds.apache.org/job/DeltaSpike_TomEE-SNAPSHOT/876/changes>

Changes:

[manovotn] DELTASPIKE-1091 add default values to Weld profiles.

------------------------------------------
[...truncated 3906 lines...]
Downloaded: http://repo.maven.apache.org/maven2/org/apache/maven/surefire/common-junit3/2.11/common-junit3-2.11.pom
(2 KB at 84.9 KB/sec)
Downloading: http://repo.maven.apache.org/maven2/org/apache/maven/surefire/surefire-api/2.11/surefire-api-2.11.pom
Downloaded: http://repo.maven.apache.org/maven2/org/apache/maven/surefire/surefire-api/2.11/surefire-api-2.11.pom
(3 KB at 124.0 KB/sec)
Downloading: http://repo.maven.apache.org/maven2/org/apache/maven/surefire/surefire-booter/2.11/surefire-booter-2.11.pom
Downloaded: http://repo.maven.apache.org/maven2/org/apache/maven/surefire/surefire-booter/2.11/surefire-booter-2.11.pom
(3 KB at 164.3 KB/sec)
Downloading: http://repo.maven.apache.org/maven2/org/apache/maven/surefire/maven-surefire-common/2.11/maven-surefire-common-2.11.pom
Downloaded: http://repo.maven.apache.org/maven2/org/apache/maven/surefire/maven-surefire-common/2.11/maven-surefire-common-2.11.pom
(4 KB at 217.5 KB/sec)
Downloading: http://repo.maven.apache.org/maven2/org/apache/maven/reporting/maven-reporting-api/2.0.9/maven-reporting-api-2.0.9.pom
Downloaded: http://repo.maven.apache.org/maven2/org/apache/maven/reporting/maven-reporting-api/2.0.9/maven-reporting-api-2.0.9.pom
(2 KB at 103.5 KB/sec)
Downloading: http://repo.maven.apache.org/maven2/org/apache/maven/reporting/maven-reporting/2.0.9/maven-reporting-2.0.9.pom
Downloaded: http://repo.maven.apache.org/maven2/org/apache/maven/reporting/maven-reporting/2.0.9/maven-reporting-2.0.9.pom
(2 KB at 84.8 KB/sec)
Downloading: http://repo.maven.apache.org/maven2/org/apache/maven/maven-toolchain/2.0.9/maven-toolchain-2.0.9.pom
Downloaded: http://repo.maven.apache.org/maven2/org/apache/maven/maven-toolchain/2.0.9/maven-toolchain-2.0.9.pom
(4 KB at 199.7 KB/sec)
Downloading: http://repo.maven.apache.org/maven2/org/apache/maven/shared/maven-common-artifact-filters/1.3/maven-common-artifact-filters-1.3.pom
Downloaded: http://repo.maven.apache.org/maven2/org/apache/maven/shared/maven-common-artifact-filters/1.3/maven-common-artifact-filters-1.3.pom
(4 KB at 212.7 KB/sec)
Downloading: http://repo.maven.apache.org/maven2/org/apache/maven/surefire/surefire-junit47/2.11/surefire-junit47-2.11.jar
Downloading: http://repo.maven.apache.org/maven2/org/apache/maven/surefire/common-junit4/2.11/common-junit4-2.11.jar
Downloading: http://repo.maven.apache.org/maven2/org/apache/maven/surefire/common-junit48/2.11/common-junit48-2.11.jar
Downloading: http://repo.maven.apache.org/maven2/org/apache/maven/surefire/surefire-api/2.11/surefire-api-2.11.jar
Downloading: http://repo.maven.apache.org/maven2/org/apache/maven/surefire/common-junit3/2.11/common-junit3-2.11.jar
Downloaded: http://repo.maven.apache.org/maven2/org/apache/maven/surefire/surefire-junit47/2.11/surefire-junit47-2.11.jar
(45 KB at 2136.4 KB/sec)
Downloading: http://repo.maven.apache.org/maven2/org/apache/maven/surefire/surefire-booter/2.11/surefire-booter-2.11.jar
Downloaded: http://repo.maven.apache.org/maven2/org/apache/maven/surefire/common-junit4/2.11/common-junit4-2.11.jar
(14 KB at 502.0 KB/sec)
Downloaded: http://repo.maven.apache.org/maven2/org/apache/maven/surefire/common-junit48/2.11/common-junit48-2.11.jar
(24 KB at 860.2 KB/sec)
Downloading: http://repo.maven.apache.org/maven2/org/apache/maven/surefire/maven-surefire-common/2.11/maven-surefire-common-2.11.jar
Downloading: http://repo.maven.apache.org/maven2/org/apache/maven/shared/maven-common-artifact-filters/1.3/maven-common-artifact-filters-1.3.jar
Downloaded: http://repo.maven.apache.org/maven2/org/apache/maven/surefire/surefire-api/2.11/surefire-api-2.11.jar
(157 KB at 5583.1 KB/sec)
Downloading: http://repo.maven.apache.org/maven2/org/apache/maven/reporting/maven-reporting-api/2.0.9/maven-reporting-api-2.0.9.jar
Downloaded: http://repo.maven.apache.org/maven2/org/apache/maven/surefire/common-junit3/2.11/common-junit3-2.11.jar
(12 KB at 393.7 KB/sec)
Downloaded: http://repo.maven.apache.org/maven2/org/apache/maven/surefire/surefire-booter/2.11/surefire-booter-2.11.jar
(33 KB at 1685.8 KB/sec)
Downloaded: http://repo.maven.apache.org/maven2/org/apache/maven/shared/maven-common-artifact-filters/1.3/maven-common-artifact-filters-1.3.jar
(31 KB at 1685.1 KB/sec)
Downloaded: http://repo.maven.apache.org/maven2/org/apache/maven/reporting/maven-reporting-api/2.0.9/maven-reporting-api-2.0.9.jar
(10 KB at 618.7 KB/sec)
Downloaded: http://repo.maven.apache.org/maven2/org/apache/maven/surefire/maven-surefire-common/2.11/maven-surefire-common-2.11.jar
(83 KB at 4106.4 KB/sec)
[INFO] Surefire report directory: <https://builds.apache.org/job/DeltaSpike_TomEE-SNAPSHOT/ws/deltaspike/test-utils/target/surefire-reports>
[INFO] Using configured provider org.apache.maven.surefire.junitcore.JUnitCoreProvider

-------------------------------------------------------
 T E S T S
-------------------------------------------------------
Concurrency config is parallel='none', perCoreThreadCount=true, threadCount=2, useUnlimitedThreads=false

Results :

Tests run: 0, Failures: 0, Errors: 0, Skipped: 0

[JENKINS] Recording test results
[INFO] 
[INFO] --- maven-jar-plugin:2.4:jar (default-jar) @ test-utils ---
Downloading: http://repo.maven.apache.org/maven2/org/codehaus/plexus/plexus-archiver/2.1/plexus-archiver-2.1.jar
Downloading: http://repo.maven.apache.org/maven2/org/codehaus/plexus/plexus-io/2.0.2/plexus-io-2.0.2.jar
Downloaded: http://repo.maven.apache.org/maven2/org/codehaus/plexus/plexus-archiver/2.1/plexus-archiver-2.1.jar
(181 KB at 8577.0 KB/sec)
Downloaded: http://repo.maven.apache.org/maven2/org/codehaus/plexus/plexus-io/2.0.2/plexus-io-2.0.2.jar
(57 KB at 2473.9 KB/sec)
[INFO] Building jar: <https://builds.apache.org/job/DeltaSpike_TomEE-SNAPSHOT/ws/deltaspike/test-utils/target/test-utils-1.6.2-SNAPSHOT.jar>
[INFO] 
[INFO] --- maven-site-plugin:3.4:attach-descriptor (attach-descriptor) @ test-utils ---
[INFO] 
[INFO] --- maven-bundle-plugin:2.3.7:cleanVersions (versions) @ test-utils ---
[INFO] 
[INFO] --- maven-antrun-plugin:1.7:run (javadoc.resources) @ test-utils ---
[WARNING] Parameter tasks is deprecated, use target instead
[INFO] Executing tasks

main:
[INFO] Executed tasks
[WARNING] Failed to getClass for org.apache.maven.plugin.source.SourceJarMojo
[INFO] 
[INFO] --- maven-source-plugin:2.4:jar (attach-sources) @ test-utils ---
[INFO] Building jar: <https://builds.apache.org/job/DeltaSpike_TomEE-SNAPSHOT/ws/deltaspike/test-utils/target/test-utils-1.6.2-SNAPSHOT-sources.jar>
[INFO] 
[INFO] --- maven-checkstyle-plugin:2.9.1:check (verify-style) @ test-utils ---
[INFO] Starting audit...
Audit done.

[INFO] 
[INFO] --- maven-install-plugin:2.5.2:install (default-install) @ test-utils ---
[INFO] Installing <https://builds.apache.org/job/DeltaSpike_TomEE-SNAPSHOT/ws/deltaspike/test-utils/target/test-utils-1.6.2-SNAPSHOT.jar>
to /home/jenkins/jenkins-slave/maven-repositories/0/org/apache/deltaspike/test/test-utils/1.6.2-SNAPSHOT/test-utils-1.6.2-SNAPSHOT.jar
[INFO] Installing <https://builds.apache.org/job/DeltaSpike_TomEE-SNAPSHOT/ws/deltaspike/test-utils/pom.xml>
to /home/jenkins/jenkins-slave/maven-repositories/0/org/apache/deltaspike/test/test-utils/1.6.2-SNAPSHOT/test-utils-1.6.2-SNAPSHOT.pom
[INFO] Installing <https://builds.apache.org/job/DeltaSpike_TomEE-SNAPSHOT/ws/deltaspike/test-utils/target/test-utils-1.6.2-SNAPSHOT-sources.jar>
to /home/jenkins/jenkins-slave/maven-repositories/0/org/apache/deltaspike/test/test-utils/1.6.2-SNAPSHOT/test-utils-1.6.2-SNAPSHOT-sources.jar
[INFO]                                                                         
[INFO] ------------------------------------------------------------------------
[INFO] Building Apache DeltaSpike Code Parent 1.6.2-SNAPSHOT
[INFO] ------------------------------------------------------------------------
Downloading: https://repository.apache.org/content/repositories/releases/org/apache/openejb/javaee-api/6.0-5/javaee-api-6.0-5.pom
Downloaded: https://repository.apache.org/content/repositories/releases/org/apache/openejb/javaee-api/6.0-5/javaee-api-6.0-5.pom
(21 KB at 34.2 KB/sec)
Downloading: https://repository.apache.org/content/repositories/releases/org/apache/openejb/apache-tomee/1.7.3-SNAPSHOT/maven-metadata.xml
Downloading: https://repository.apache.org/content/repositories/snapshots/org/apache/openejb/apache-tomee/1.7.3-SNAPSHOT/maven-metadata.xml
Downloading: http://repository.apache.org/snapshots/org/apache/openejb/apache-tomee/1.7.3-SNAPSHOT/maven-metadata.xml
Downloading: https://repository.apache.org/content/repositories/releases/org/apache/openejb/apache-tomee/1.7.3-SNAPSHOT/apache-tomee-1.7.3-SNAPSHOT.pom
Downloading: https://repository.apache.org/content/repositories/snapshots/org/apache/openejb/apache-tomee/1.7.3-SNAPSHOT/apache-tomee-1.7.3-SNAPSHOT.pom
Downloading: http://repository.apache.org/snapshots/org/apache/openejb/apache-tomee/1.7.3-SNAPSHOT/apache-tomee-1.7.3-SNAPSHOT.pom
[WARNING] The POM for org.apache.openejb:apache-tomee:zip:webprofile:1.7.3-SNAPSHOT is missing,
no dependency information available
Downloading: https://repository.apache.org/content/repositories/releases/org/jboss/arquillian/testenricher/arquillian-testenricher-cdi/1.1.8.Final/arquillian-testenricher-cdi-1.1.8.Final.pom
Downloading: https://repository.apache.org/content/repositories/snapshots/org/jboss/arquillian/testenricher/arquillian-testenricher-cdi/1.1.8.Final/arquillian-testenricher-cdi-1.1.8.Final.pom
Downloading: http://repo.maven.apache.org/maven2/org/jboss/arquillian/testenricher/arquillian-testenricher-cdi/1.1.8.Final/arquillian-testenricher-cdi-1.1.8.Final.pom
Downloaded: http://repo.maven.apache.org/maven2/org/jboss/arquillian/testenricher/arquillian-testenricher-cdi/1.1.8.Final/arquillian-testenricher-cdi-1.1.8.Final.pom
(5 KB at 205.9 KB/sec)
Downloading: https://repository.apache.org/content/repositories/releases/org/apache/openejb/arquillian-tomee-remote/1.7.3-SNAPSHOT/maven-metadata.xml
Downloading: https://repository.apache.org/content/repositories/snapshots/org/apache/openejb/arquillian-tomee-remote/1.7.3-SNAPSHOT/maven-metadata.xml
Downloading: http://repository.apache.org/snapshots/org/apache/openejb/arquillian-tomee-remote/1.7.3-SNAPSHOT/maven-metadata.xml
Downloading: https://repository.apache.org/content/repositories/releases/org/apache/openejb/arquillian-tomee-remote/1.7.3-SNAPSHOT/arquillian-tomee-remote-1.7.3-SNAPSHOT.pom
Downloading: https://repository.apache.org/content/repositories/snapshots/org/apache/openejb/arquillian-tomee-remote/1.7.3-SNAPSHOT/arquillian-tomee-remote-1.7.3-SNAPSHOT.pom
Downloading: http://repository.apache.org/snapshots/org/apache/openejb/arquillian-tomee-remote/1.7.3-SNAPSHOT/arquillian-tomee-remote-1.7.3-SNAPSHOT.pom
[WARNING] The POM for org.apache.openejb:arquillian-tomee-remote:jar:1.7.3-SNAPSHOT is missing,
no dependency information available
Downloading: https://repository.apache.org/content/repositories/releases/org/apache/openejb/javaee-api/6.0-5/javaee-api-6.0-5.jar
Downloading: https://repository.apache.org/content/repositories/releases/org/apache/openejb/apache-tomee/1.7.3-SNAPSHOT/apache-tomee-1.7.3-SNAPSHOT-webprofile.zip
Downloading: https://repository.apache.org/content/repositories/releases/org/jboss/arquillian/testenricher/arquillian-testenricher-cdi/1.1.8.Final/arquillian-testenricher-cdi-1.1.8.Final.jar
Downloading: https://repository.apache.org/content/repositories/releases/org/apache/openejb/arquillian-tomee-remote/1.7.3-SNAPSHOT/arquillian-tomee-remote-1.7.3-SNAPSHOT.jar
Downloaded: https://repository.apache.org/content/repositories/releases/org/apache/openejb/javaee-api/6.0-5/javaee-api-6.0-5.jar
(966 KB at 339.5 KB/sec)
Downloading: https://repository.apache.org/content/repositories/snapshots/org/apache/openejb/apache-tomee/1.7.3-SNAPSHOT/apache-tomee-1.7.3-SNAPSHOT-webprofile.zip
Downloading: https://repository.apache.org/content/repositories/snapshots/org/jboss/arquillian/testenricher/arquillian-testenricher-cdi/1.1.8.Final/arquillian-testenricher-cdi-1.1.8.Final.jar
Downloading: https://repository.apache.org/content/repositories/snapshots/org/apache/openejb/arquillian-tomee-remote/1.7.3-SNAPSHOT/arquillian-tomee-remote-1.7.3-SNAPSHOT.jar
Downloading: http://repo.maven.apache.org/maven2/org/jboss/arquillian/testenricher/arquillian-testenricher-cdi/1.1.8.Final/arquillian-testenricher-cdi-1.1.8.Final.jar
Downloaded: http://repo.maven.apache.org/maven2/org/jboss/arquillian/testenricher/arquillian-testenricher-cdi/1.1.8.Final/arquillian-testenricher-cdi-1.1.8.Final.jar
(27 KB at 1333.3 KB/sec)
Downloading: http://repository.apache.org/snapshots/org/apache/openejb/apache-tomee/1.7.3-SNAPSHOT/apache-tomee-1.7.3-SNAPSHOT-webprofile.zip
Downloading: http://repository.apache.org/snapshots/org/apache/openejb/arquillian-tomee-remote/1.7.3-SNAPSHOT/arquillian-tomee-remote-1.7.3-SNAPSHOT.jar
[INFO] ------------------------------------------------------------------------
[INFO] Reactor Summary:
[INFO] 
[INFO] Apache DeltaSpike ................................. SUCCESS [12.784s]
[INFO] Apache DeltaSpike Sources ......................... SUCCESS [0.539s]
[INFO] Apache DeltaSpike CheckStyle-rules ................ SUCCESS [4.107s]
[INFO] Apache DeltaSpike Parent .......................... SUCCESS [34.193s]
[INFO] Apache DeltaSpike Test-Utils ...................... SUCCESS [8.462s]
[INFO] Apache DeltaSpike Code Parent ..................... FAILURE [10.674s]
[INFO] Apache DeltaSpike Core ............................ SKIPPED
[INFO] Apache DeltaSpike Core-API ........................ SKIPPED
[INFO] Apache DeltaSpike Core-Implementation ............. SKIPPED
[INFO] Apache DeltaSpike ContainerControl parent ......... SKIPPED
[INFO] Apache DeltaSpike CDI ContainerControl API ........ SKIPPED
[INFO] Apache DeltaSpike CDI ContainerControl TCK ........ SKIPPED
[INFO] Apache DeltaSpike CDI OpenEJB-ContainerControl .... SKIPPED
[INFO] Apache DeltaSpike Modules ......................... SKIPPED
[INFO] Apache DeltaSpike Proxy-Module .................... SKIPPED
[INFO] Apache DeltaSpike Proxy-Module API ................ SKIPPED
[INFO] Apache DeltaSpike Proxy-Module Impl ASM5 .......... SKIPPED
[INFO] Apache DeltaSpike Security-Module ................. SKIPPED
[INFO] Apache DeltaSpike Security-Module API ............. SKIPPED
[INFO] Apache DeltaSpike Security-Module Impl ............ SKIPPED
[INFO] Apache DeltaSpike JPA-Module ...................... SKIPPED
[INFO] Apache DeltaSpike JPA-Module API .................. SKIPPED
[INFO] Apache DeltaSpike JPA-Module Impl ................. SKIPPED
[INFO] Apache DeltaSpike Servlet-Module .................. SKIPPED
[INFO] Apache DeltaSpike Servlet-Module API .............. SKIPPED
[INFO] Apache DeltaSpike Servlet-Module Impl ............. SKIPPED
[INFO] Apache DeltaSpike JSF-Module ...................... SKIPPED
[INFO] Apache DeltaSpike JSF-Module API .................. SKIPPED
[INFO] Apache DeltaSpike JSF-Module Impl ................. SKIPPED
[INFO] Apache DeltaSpike JSF-Module Impl (EE6 only) ...... SKIPPED
[INFO] Apache DeltaSpike Partial-Bean-Module ............. SKIPPED
[INFO] Apache DeltaSpike Partial-Bean-Module API ......... SKIPPED
[INFO] Apache DeltaSpike Partial-Bean-Module Impl ........ SKIPPED
[INFO] Apache DeltaSpike BeanValidation-Module ........... SKIPPED
[INFO] Apache DeltaSpike BeanValidation-Module API ....... SKIPPED
[INFO] Apache DeltaSpike BeanValidation-Module Impl ...... SKIPPED
[INFO] Apache DeltaSpike Data-Module ..................... SKIPPED
[INFO] Apache DeltaSpike Data-Module API ................. SKIPPED
[INFO] Apache DeltaSpike Data-Module Impl ................ SKIPPED
[INFO] Apache DeltaSpike Scheduler-Module ................ SKIPPED
[INFO] Apache DeltaSpike Scheduler-Module API ............ SKIPPED
[INFO] Apache DeltaSpike Scheduler-Module Impl ........... SKIPPED
[INFO] Apache DeltaSpike Test-Control-Module ............. SKIPPED
[INFO] Apache DeltaSpike Test-Control-Module API ......... SKIPPED
[INFO] Apache DeltaSpike Test-Control-Module Impl ........ SKIPPED
[INFO] Apache DeltaSpike Examples ........................ SKIPPED
[INFO] Apache DeltaSpike Java-SE Examples ................ SKIPPED
[INFO] Apache DeltaSpike JSF Examples .................... SKIPPED
[INFO] Apache DeltaSpike JSF Playground .................. SKIPPED
[INFO] Apache DeltaSpike Security Example CDI ............ SKIPPED
[INFO] Apache DeltaSpike Security Example PicketLink ..... SKIPPED
[INFO] Apache DeltaSpike Java-SE Scheduler Examples ...... SKIPPED
[INFO] Apache DeltaSpike Documentation ................... SKIPPED
[INFO] Apache DeltaSpike Site ............................ SKIPPED
[INFO] ------------------------------------------------------------------------
[INFO] BUILD FAILURE
[INFO] ------------------------------------------------------------------------
[INFO] Total time: 1:21.173s
[INFO] Finished at: Wed May 04 07:32:53 UTC 2016
[INFO] Final Memory: 44M/627M
[INFO] ------------------------------------------------------------------------
Waiting for Jenkins to finish collecting data
[ERROR] Failed to execute goal on project parent-code: Could not resolve dependencies for
project org.apache.deltaspike:parent-code:pom:1.6.2-SNAPSHOT: The following artifacts could
not be resolved: org.apache.openejb:apache-tomee:zip:webprofile:1.7.3-SNAPSHOT, org.apache.openejb:arquillian-tomee-remote:jar:1.7.3-SNAPSHOT:
Could not find artifact org.apache.openejb:apache-tomee:zip:webprofile:1.7.3-SNAPSHOT in Apache
Repository (https://repository.apache.org/content/repositories/releases) -> [Help 1]
[ERROR] 
[ERROR] To see the full stack trace of the errors, re-run Maven with the -e switch.
[ERROR] Re-run Maven using the -X switch to enable full debug logging.
[ERROR] 
[ERROR] For more information about the errors and possible solutions, please read the following
articles:
[ERROR] [Help 1] http://cwiki.apache.org/confluence/display/MAVEN/DependencyResolutionException
[ERROR] 
[ERROR] After correcting the problems, you can resume the build with the command
[ERROR]   mvn <goals> -rf :parent-code
[JENKINS] Archiving <https://builds.apache.org/job/DeltaSpike_TomEE-SNAPSHOT/ws/deltaspike/examples/jse-examples/pom.xml>
to org.apache.deltaspike.examples/deltaspike-jse-example/1.6.2-SNAPSHOT/deltaspike-jse-example-1.6.2-SNAPSHOT.pom
[JENKINS] Archiving <https://builds.apache.org/job/DeltaSpike_TomEE-SNAPSHOT/ws/deltaspike/examples/security-requested-page-after-login-cdi/pom.xml>
to org.apache.deltaspike.examples/deltaspike-security-requested-page-after-login-cdi/1.6.2-SNAPSHOT/deltaspike-security-requested-page-after-login-cdi-1.6.2-SNAPSHOT.pom
[JENKINS] Archiving <https://builds.apache.org/job/DeltaSpike_TomEE-SNAPSHOT/ws/deltaspike/test-utils/pom.xml>
to org.apache.deltaspike.test/test-utils/1.6.2-SNAPSHOT/test-utils-1.6.2-SNAPSHOT.pom
[JENKINS] Archiving <https://builds.apache.org/job/DeltaSpike_TomEE-SNAPSHOT/ws/deltaspike/test-utils/target/test-utils-1.6.2-SNAPSHOT.jar>
to org.apache.deltaspike.test/test-utils/1.6.2-SNAPSHOT/test-utils-1.6.2-SNAPSHOT.jar
[JENKINS] Archiving <https://builds.apache.org/job/DeltaSpike_TomEE-SNAPSHOT/ws/deltaspike/test-utils/target/test-utils-1.6.2-SNAPSHOT-sources.jar>
to org.apache.deltaspike.test/test-utils/1.6.2-SNAPSHOT/test-utils-1.6.2-SNAPSHOT-sources.jar
[JENKINS] Archiving <https://builds.apache.org/job/DeltaSpike_TomEE-SNAPSHOT/ws/documentation/pom.xml>
to org.apache.deltaspike/deltaspike-documentation/1.6.2-SNAPSHOT/deltaspike-documentation-1.6.2-SNAPSHOT.pom
[JENKINS] Archiving <https://builds.apache.org/job/DeltaSpike_TomEE-SNAPSHOT/ws/deltaspike/modules/data/impl/pom.xml>
to org.apache.deltaspike.modules/deltaspike-data-module-impl/1.6.2-SNAPSHOT/deltaspike-data-module-impl-1.6.2-SNAPSHOT.pom
[JENKINS] Archiving <https://builds.apache.org/job/DeltaSpike_TomEE-SNAPSHOT/ws/deltaspike/modules/data/api/pom.xml>
to org.apache.deltaspike.modules/deltaspike-data-module-api/1.6.2-SNAPSHOT/deltaspike-data-module-api-1.6.2-SNAPSHOT.pom
[JENKINS] Archiving <https://builds.apache.org/job/DeltaSpike_TomEE-SNAPSHOT/ws/deltaspike/core/impl/pom.xml>
to org.apache.deltaspike.core/deltaspike-core-impl/1.6.2-SNAPSHOT/deltaspike-core-impl-1.6.2-SNAPSHOT.pom
[JENKINS] Archiving <https://builds.apache.org/job/DeltaSpike_TomEE-SNAPSHOT/ws/deltaspike/modules/pom.xml>
to org.apache.deltaspike.modules/modules-project/1.6.2-SNAPSHOT/modules-project-1.6.2-SNAPSHOT.pom
[JENKINS] Archiving <https://builds.apache.org/job/DeltaSpike_TomEE-SNAPSHOT/ws/deltaspike/modules/test-control/pom.xml>
to org.apache.deltaspike.modules/test-control-module-project/1.6.2-SNAPSHOT/test-control-module-project-1.6.2-SNAPSHOT.pom
[JENKINS] Archiving <https://builds.apache.org/job/DeltaSpike_TomEE-SNAPSHOT/ws/deltaspike/examples/jsf-examples/pom.xml>
to org.apache.deltaspike.examples/deltaspike-jsf-example/1.6.2-SNAPSHOT/deltaspike-jsf-example-1.6.2-SNAPSHOT.pom
[JENKINS] Archiving <https://builds.apache.org/job/DeltaSpike_TomEE-SNAPSHOT/ws/deltaspike/cdictrl/api/pom.xml>
to org.apache.deltaspike.cdictrl/deltaspike-cdictrl-api/1.6.2-SNAPSHOT/deltaspike-cdictrl-api-1.6.2-SNAPSHOT.pom
[JENKINS] Archiving <https://builds.apache.org/job/DeltaSpike_TomEE-SNAPSHOT/ws/deltaspike/examples/scheduler-playground/pom.xml>
to org.apache.deltaspike.examples/deltaspike-scheduler-example/1.6.2-SNAPSHOT/deltaspike-scheduler-example-1.6.2-SNAPSHOT.pom
[JENKINS] Archiving <https://builds.apache.org/job/DeltaSpike_TomEE-SNAPSHOT/ws/deltaspike/checkstyle-rules/pom.xml>
to org.apache.deltaspike/checkstyle-rules/1.6.2-SNAPSHOT/checkstyle-rules-1.6.2-SNAPSHOT.pom
[JENKINS] Archiving <https://builds.apache.org/job/DeltaSpike_TomEE-SNAPSHOT/ws/deltaspike/checkstyle-rules/target/checkstyle-rules-1.6.2-SNAPSHOT.jar>
to org.apache.deltaspike/checkstyle-rules/1.6.2-SNAPSHOT/checkstyle-rules-1.6.2-SNAPSHOT.jar
[JENKINS] Archiving <https://builds.apache.org/job/DeltaSpike_TomEE-SNAPSHOT/ws/deltaspike/parent/code/pom.xml>
to org.apache.deltaspike/parent-code/1.6.2-SNAPSHOT/parent-code-1.6.2-SNAPSHOT.pom
Compressed 80.72 KB of artifacts by 39.6% relative to #871
[JENKINS] Archiving <https://builds.apache.org/job/DeltaSpike_TomEE-SNAPSHOT/ws/deltaspike/modules/jsf/impl/pom.xml>
to org.apache.deltaspike.modules/deltaspike-jsf-module-impl/1.6.2-SNAPSHOT/deltaspike-jsf-module-impl-1.6.2-SNAPSHOT.pom
[JENKINS] Archiving <https://builds.apache.org/job/DeltaSpike_TomEE-SNAPSHOT/ws/deltaspike/modules/partial-bean/pom.xml>
to org.apache.deltaspike.modules/partial-bean-module-project/1.6.2-SNAPSHOT/partial-bean-module-project-1.6.2-SNAPSHOT.pom
[JENKINS] Archiving <https://builds.apache.org/job/DeltaSpike_TomEE-SNAPSHOT/ws/deltaspike/examples/pom.xml>
to org.apache.deltaspike.examples/examples-project/1.6.2-SNAPSHOT/examples-project-1.6.2-SNAPSHOT.pom
[JENKINS] Archiving <https://builds.apache.org/job/DeltaSpike_TomEE-SNAPSHOT/ws/deltaspike/cdictrl/impl-openejb/pom.xml>
to org.apache.deltaspike.cdictrl/deltaspike-cdictrl-openejb/1.6.2-SNAPSHOT/deltaspike-cdictrl-openejb-1.6.2-SNAPSHOT.pom
[JENKINS] Archiving <https://builds.apache.org/job/DeltaSpike_TomEE-SNAPSHOT/ws/deltaspike/modules/jsf/pom.xml>
to org.apache.deltaspike.modules/jsf-module-project/1.6.2-SNAPSHOT/jsf-module-project-1.6.2-SNAPSHOT.pom
[JENKINS] Archiving <https://builds.apache.org/job/DeltaSpike_TomEE-SNAPSHOT/ws/deltaspike/cdictrl/tck/pom.xml>
to org.apache.deltaspike.test/deltaspike-cdictrl-tck/1.6.2-SNAPSHOT/deltaspike-cdictrl-tck-1.6.2-SNAPSHOT.pom
[JENKINS] Archiving <https://builds.apache.org/job/DeltaSpike_TomEE-SNAPSHOT/ws/deltaspike/modules/jsf/api/pom.xml>
to org.apache.deltaspike.modules/deltaspike-jsf-module-api/1.6.2-SNAPSHOT/deltaspike-jsf-module-api-1.6.2-SNAPSHOT.pom
[JENKINS] Archiving <https://builds.apache.org/job/DeltaSpike_TomEE-SNAPSHOT/ws/deltaspike/modules/security/pom.xml>
to org.apache.deltaspike.modules/security-module-project/1.6.2-SNAPSHOT/security-module-project-1.6.2-SNAPSHOT.pom
[JENKINS] Archiving <https://builds.apache.org/job/DeltaSpike_TomEE-SNAPSHOT/ws/deltaspike/modules/bean-validation/pom.xml>
to org.apache.deltaspike.modules/bean-validation-module-project/1.6.2-SNAPSHOT/bean-validation-module-project-1.6.2-SNAPSHOT.pom
[JENKINS] Archiving <https://builds.apache.org/job/DeltaSpike_TomEE-SNAPSHOT/ws/deltaspike/modules/partial-bean/impl/pom.xml>
to org.apache.deltaspike.modules/deltaspike-partial-bean-module-impl/1.6.2-SNAPSHOT/deltaspike-partial-bean-module-impl-1.6.2-SNAPSHOT.pom
[JENKINS] Archiving <https://builds.apache.org/job/DeltaSpike_TomEE-SNAPSHOT/ws/deltaspike/modules/proxy/api/pom.xml>
to org.apache.deltaspike.modules/deltaspike-proxy-module-api/1.6.2-SNAPSHOT/deltaspike-proxy-module-api-1.6.2-SNAPSHOT.pom
[JENKINS] Archiving <https://builds.apache.org/job/DeltaSpike_TomEE-SNAPSHOT/ws/deltaspike/modules/jpa/api/pom.xml>
to org.apache.deltaspike.modules/deltaspike-jpa-module-api/1.6.2-SNAPSHOT/deltaspike-jpa-module-api-1.6.2-SNAPSHOT.pom
[JENKINS] Archiving <https://builds.apache.org/job/DeltaSpike_TomEE-SNAPSHOT/ws/deltaspike/modules/servlet/api/pom.xml>
to org.apache.deltaspike.modules/deltaspike-servlet-module-api/1.6.2-SNAPSHOT/deltaspike-servlet-module-api-1.6.2-SNAPSHOT.pom
[JENKINS] Archiving <https://builds.apache.org/job/DeltaSpike_TomEE-SNAPSHOT/ws/deltaspike/modules/jpa/pom.xml>
to org.apache.deltaspike.modules/jpa-module-project/1.6.2-SNAPSHOT/jpa-module-project-1.6.2-SNAPSHOT.pom
[JENKINS] Archiving <https://builds.apache.org/job/DeltaSpike_TomEE-SNAPSHOT/ws/deltaspike/cdictrl/pom.xml>
to org.apache.deltaspike.cdictrl/cdictrl-project/1.6.2-SNAPSHOT/cdictrl-project-1.6.2-SNAPSHOT.pom
[JENKINS] Archiving <https://builds.apache.org/job/DeltaSpike_TomEE-SNAPSHOT/ws/deltaspike/modules/scheduler/api/pom.xml>
to org.apache.deltaspike.modules/deltaspike-scheduler-module-api/1.6.2-SNAPSHOT/deltaspike-scheduler-module-api-1.6.2-SNAPSHOT.pom
[JENKINS] Archiving <https://builds.apache.org/job/DeltaSpike_TomEE-SNAPSHOT/ws/deltaspike/modules/test-control/impl/pom.xml>
to org.apache.deltaspike.modules/deltaspike-test-control-module-impl/1.6.2-SNAPSHOT/deltaspike-test-control-module-impl-1.6.2-SNAPSHOT.pom
[JENKINS] Archiving <https://builds.apache.org/job/DeltaSpike_TomEE-SNAPSHOT/ws/deltaspike/modules/servlet/pom.xml>
to org.apache.deltaspike.modules/servlet-module-project/1.6.2-SNAPSHOT/servlet-module-project-1.6.2-SNAPSHOT.pom
[JENKINS] Archiving <https://builds.apache.org/job/DeltaSpike_TomEE-SNAPSHOT/ws/deltaspike/modules/test-control/api/pom.xml>
to org.apache.deltaspike.modules/deltaspike-test-control-module-api/1.6.2-SNAPSHOT/deltaspike-test-control-module-api-1.6.2-SNAPSHOT.pom
[JENKINS] Archiving <https://builds.apache.org/job/DeltaSpike_TomEE-SNAPSHOT/ws/deltaspike/modules/jsf/impl-ee6/pom.xml>
to org.apache.deltaspike.modules/deltaspike-jsf-module-impl-ee6/1.6.2-SNAPSHOT/deltaspike-jsf-module-impl-ee6-1.6.2-SNAPSHOT.pom
[JENKINS] Archiving <https://builds.apache.org/job/DeltaSpike_TomEE-SNAPSHOT/ws/deltaspike/modules/proxy/pom.xml>
to org.apache.deltaspike.modules/proxy-module-project/1.6.2-SNAPSHOT/proxy-module-project-1.6.2-SNAPSHOT.pom
[JENKINS] Archiving <https://builds.apache.org/job/DeltaSpike_TomEE-SNAPSHOT/ws/deltaspike/modules/partial-bean/api/pom.xml>
to org.apache.deltaspike.modules/deltaspike-partial-bean-module-api/1.6.2-SNAPSHOT/deltaspike-partial-bean-module-api-1.6.2-SNAPSHOT.pom
[JENKINS] Archiving <https://builds.apache.org/job/DeltaSpike_TomEE-SNAPSHOT/ws/deltaspike/modules/scheduler/impl/pom.xml>
to org.apache.deltaspike.modules/deltaspike-scheduler-module-impl/1.6.2-SNAPSHOT/deltaspike-scheduler-module-impl-1.6.2-SNAPSHOT.pom
[JENKINS] Archiving <https://builds.apache.org/job/DeltaSpike_TomEE-SNAPSHOT/ws/deltaspike/parent/pom.xml>
to org.apache.deltaspike/parent/1.6.2-SNAPSHOT/parent-1.6.2-SNAPSHOT.pom
[JENKINS] Archiving <https://builds.apache.org/job/DeltaSpike_TomEE-SNAPSHOT/ws/deltaspike/core/pom.xml>
to org.apache.deltaspike.core/core-project/1.6.2-SNAPSHOT/core-project-1.6.2-SNAPSHOT.pom
[JENKINS] Archiving <https://builds.apache.org/job/DeltaSpike_TomEE-SNAPSHOT/ws/deltaspike/modules/bean-validation/api/pom.xml>
to org.apache.deltaspike.modules/deltaspike-bean-validation-module-api/1.6.2-SNAPSHOT/deltaspike-bean-validation-module-api-1.6.2-SNAPSHOT.pom
[JENKINS] Archiving <https://builds.apache.org/job/DeltaSpike_TomEE-SNAPSHOT/ws/deltaspike/core/api/pom.xml>
to org.apache.deltaspike.core/deltaspike-core-api/1.6.2-SNAPSHOT/deltaspike-core-api-1.6.2-SNAPSHOT.pom
[JENKINS] Archiving <https://builds.apache.org/job/DeltaSpike_TomEE-SNAPSHOT/ws/deltaspike/modules/security/impl/pom.xml>
to org.apache.deltaspike.modules/deltaspike-security-module-impl/1.6.2-SNAPSHOT/deltaspike-security-module-impl-1.6.2-SNAPSHOT.pom
[JENKINS] Archiving <https://builds.apache.org/job/DeltaSpike_TomEE-SNAPSHOT/ws/deltaspike/modules/scheduler/pom.xml>
to org.apache.deltaspike.modules/scheduler-module-project/1.6.2-SNAPSHOT/scheduler-module-project-1.6.2-SNAPSHOT.pom
[JENKINS] Archiving <https://builds.apache.org/job/DeltaSpike_TomEE-SNAPSHOT/ws/site/pom.xml>
to org.apache.deltaspike/deltaspike-site/1.6.2-SNAPSHOT/deltaspike-site-1.6.2-SNAPSHOT.pom
[JENKINS] Archiving <https://builds.apache.org/job/DeltaSpike_TomEE-SNAPSHOT/ws/deltaspike/modules/proxy/impl-asm5/pom.xml>
to org.apache.deltaspike.modules/deltaspike-proxy-module-impl-asm5/1.6.2-SNAPSHOT/deltaspike-proxy-module-impl-asm5-1.6.2-SNAPSHOT.pom
[JENKINS] Archiving <https://builds.apache.org/job/DeltaSpike_TomEE-SNAPSHOT/ws/deltaspike/examples/jsf-playground/pom.xml>
to org.apache.deltaspike.examples/deltaspike-jsf-playground/1.6.2-SNAPSHOT/deltaspike-jsf-playground-1.6.2-SNAPSHOT.pom
[JENKINS] Archiving <https://builds.apache.org/job/DeltaSpike_TomEE-SNAPSHOT/ws/deltaspike/modules/servlet/impl/pom.xml>
to org.apache.deltaspike.modules/deltaspike-servlet-module-impl/1.6.2-SNAPSHOT/deltaspike-servlet-module-impl-1.6.2-SNAPSHOT.pom
[JENKINS] Archiving <https://builds.apache.org/job/DeltaSpike_TomEE-SNAPSHOT/ws/deltaspike/modules/bean-validation/impl/pom.xml>
to org.apache.deltaspike.modules/deltaspike-bean-validation-module-impl/1.6.2-SNAPSHOT/deltaspike-bean-validation-module-impl-1.6.2-SNAPSHOT.pom
[JENKINS] Archiving <https://builds.apache.org/job/DeltaSpike_TomEE-SNAPSHOT/ws/pom.xml>
to org.apache.deltaspike/deltaspike/1.6.2-SNAPSHOT/deltaspike-1.6.2-SNAPSHOT.pom
[JENKINS] Archiving <https://builds.apache.org/job/DeltaSpike_TomEE-SNAPSHOT/ws/deltaspike/modules/jpa/impl/pom.xml>
to org.apache.deltaspike.modules/deltaspike-jpa-module-impl/1.6.2-SNAPSHOT/deltaspike-jpa-module-impl-1.6.2-SNAPSHOT.pom
[JENKINS] Archiving <https://builds.apache.org/job/DeltaSpike_TomEE-SNAPSHOT/ws/deltaspike/modules/data/pom.xml>
to org.apache.deltaspike.modules/data-module-project/1.6.2-SNAPSHOT/data-module-project-1.6.2-SNAPSHOT.pom
[JENKINS] Archiving <https://builds.apache.org/job/DeltaSpike_TomEE-SNAPSHOT/ws/deltaspike/examples/security-requested-page-after-login-picketlink/pom.xml>
to org.apache.deltaspike.examples/deltaspike-security-requested-page-after-login-picketlink/1.6.2-SNAPSHOT/deltaspike-security-requested-page-after-login-picketlink-1.6.2-SNAPSHOT.pom
[JENKINS] Archiving <https://builds.apache.org/job/DeltaSpike_TomEE-SNAPSHOT/ws/deltaspike/pom.xml>
to org.apache.deltaspike/deltaspike-project/1.6.2-SNAPSHOT/deltaspike-project-1.6.2-SNAPSHOT.pom
[JENKINS] Archiving <https://builds.apache.org/job/DeltaSpike_TomEE-SNAPSHOT/ws/deltaspike/modules/security/api/pom.xml>
to org.apache.deltaspike.modules/deltaspike-security-module-api/1.6.2-SNAPSHOT/deltaspike-security-module-api-1.6.2-SNAPSHOT.pom
Sending e-mails to: commits@deltaspike.apache.org
channel stopped

Mime
View raw message