deltaspike-commits mailing list archives

Site index · List index
Message view « Date » · « Thread »
Top « Date » · « Thread »
From Apache Jenkins Server <jenk...@builds.apache.org>
Subject Build failed in Jenkins: DeltaSpike_GF4 #360
Date Tue, 10 May 2016 08:06:36 GMT
See <https://builds.apache.org/job/DeltaSpike_GF4/360/changes>

Changes:

[manovotn] DELTASPIKE-1141 fix EnableInterceptorsTest for CDI 1.0/Weld 1.x

------------------------------------------
[...truncated 552 lines...]
[INFO] 
[INFO] --- maven-checkstyle-plugin:2.9.1:check (verify-style) @ parent ---
Downloading: http://repo.maven.apache.org/maven2/org/apache/maven/doxia/doxia-sink-api/1.1.3/doxia-sink-api-1.1.3.pom
Downloaded: http://repo.maven.apache.org/maven2/org/apache/maven/doxia/doxia-sink-api/1.1.3/doxia-sink-api-1.1.3.pom
(2 KB at 192.3 KB/sec)
Downloading: http://repo.maven.apache.org/maven2/org/apache/maven/doxia/doxia/1.1.3/doxia-1.1.3.pom
Downloaded: http://repo.maven.apache.org/maven2/org/apache/maven/doxia/doxia/1.1.3/doxia-1.1.3.pom
(19 KB at 2271.2 KB/sec)
Downloading: http://repo.maven.apache.org/maven2/org/apache/maven/doxia/doxia-logging-api/1.1.3/doxia-logging-api-1.1.3.pom
Downloaded: http://repo.maven.apache.org/maven2/org/apache/maven/doxia/doxia-logging-api/1.1.3/doxia-logging-api-1.1.3.pom
(2 KB at 192.9 KB/sec)
Downloading: http://repo.maven.apache.org/maven2/org/apache/maven/doxia/doxia-decoration-model/1.1.3/doxia-decoration-model-1.1.3.pom
Downloaded: http://repo.maven.apache.org/maven2/org/apache/maven/doxia/doxia-decoration-model/1.1.3/doxia-decoration-model-1.1.3.pom
(3 KB at 415.0 KB/sec)
Downloading: http://repo.maven.apache.org/maven2/org/apache/maven/doxia/doxia-sitetools/1.1.3/doxia-sitetools-1.1.3.pom
Downloaded: http://repo.maven.apache.org/maven2/org/apache/maven/doxia/doxia-sitetools/1.1.3/doxia-sitetools-1.1.3.pom
(16 KB at 2196.1 KB/sec)
Downloading: http://repo.maven.apache.org/maven2/org/apache/maven/doxia/doxia-site-renderer/1.1.3/doxia-site-renderer-1.1.3.pom
Downloaded: http://repo.maven.apache.org/maven2/org/apache/maven/doxia/doxia-site-renderer/1.1.3/doxia-site-renderer-1.1.3.pom
(6 KB at 747.1 KB/sec)
Downloading: http://repo.maven.apache.org/maven2/org/apache/maven/doxia/doxia-core/1.1.3/doxia-core-1.1.3.pom
Downloaded: http://repo.maven.apache.org/maven2/org/apache/maven/doxia/doxia-core/1.1.3/doxia-core-1.1.3.pom
(4 KB at 454.1 KB/sec)
Downloading: http://repo.maven.apache.org/maven2/commons-codec/commons-codec/1.2/commons-codec-1.2.pom
Downloaded: http://repo.maven.apache.org/maven2/commons-codec/commons-codec/1.2/commons-codec-1.2.pom
(4 KB at 466.9 KB/sec)
Downloading: http://repo.maven.apache.org/maven2/org/apache/maven/doxia/doxia-module-xhtml/1.1.3/doxia-module-xhtml-1.1.3.pom
Downloaded: http://repo.maven.apache.org/maven2/org/apache/maven/doxia/doxia-module-xhtml/1.1.3/doxia-module-xhtml-1.1.3.pom
(2 KB at 195.6 KB/sec)
Downloading: http://repo.maven.apache.org/maven2/org/apache/maven/doxia/doxia-modules/1.1.3/doxia-modules-1.1.3.pom
Downloaded: http://repo.maven.apache.org/maven2/org/apache/maven/doxia/doxia-modules/1.1.3/doxia-modules-1.1.3.pom
(3 KB at 340.0 KB/sec)
Downloading: http://repo.maven.apache.org/maven2/org/apache/maven/doxia/doxia-module-fml/1.1.3/doxia-module-fml-1.1.3.pom
Downloaded: http://repo.maven.apache.org/maven2/org/apache/maven/doxia/doxia-module-fml/1.1.3/doxia-module-fml-1.1.3.pom
(6 KB at 766.6 KB/sec)
Downloading: http://repo.maven.apache.org/maven2/org/apache/maven/shared/maven-doxia-tools/1.2.1/maven-doxia-tools-1.2.1.pom
Downloaded: http://repo.maven.apache.org/maven2/org/apache/maven/shared/maven-doxia-tools/1.2.1/maven-doxia-tools-1.2.1.pom
(7 KB at 770.4 KB/sec)
Downloading: http://repo.maven.apache.org/maven2/com/puppycrawl/tools/checkstyle/5.5/checkstyle-5.5.pom
Downloaded: http://repo.maven.apache.org/maven2/com/puppycrawl/tools/checkstyle/5.5/checkstyle-5.5.pom
(19 KB at 2057.5 KB/sec)
Downloading: http://repo.maven.apache.org/maven2/org/apache/maven/doxia/doxia-sink-api/1.1.3/doxia-sink-api-1.1.3.jar
Downloading: http://repo.maven.apache.org/maven2/org/apache/maven/doxia/doxia-logging-api/1.1.3/doxia-logging-api-1.1.3.jar
Downloading: http://repo.maven.apache.org/maven2/org/apache/maven/doxia/doxia-decoration-model/1.1.3/doxia-decoration-model-1.1.3.jar
Downloading: http://repo.maven.apache.org/maven2/org/apache/maven/doxia/doxia-site-renderer/1.1.3/doxia-site-renderer-1.1.3.jar
Downloading: http://repo.maven.apache.org/maven2/org/apache/maven/doxia/doxia-module-xhtml/1.1.3/doxia-module-xhtml-1.1.3.jar
Downloaded: http://repo.maven.apache.org/maven2/org/apache/maven/doxia/doxia-sink-api/1.1.3/doxia-sink-api-1.1.3.jar
(13 KB at 1548.7 KB/sec)
Downloading: http://repo.maven.apache.org/maven2/org/apache/maven/doxia/doxia-module-fml/1.1.3/doxia-module-fml-1.1.3.jar
Downloaded: http://repo.maven.apache.org/maven2/org/apache/maven/doxia/doxia-module-fml/1.1.3/doxia-module-fml-1.1.3.jar
(37 KB at 5216.9 KB/sec)
Downloading: http://repo.maven.apache.org/maven2/org/apache/maven/shared/maven-doxia-tools/1.2.1/maven-doxia-tools-1.2.1.jar
Downloaded: http://repo.maven.apache.org/maven2/org/apache/maven/doxia/doxia-logging-api/1.1.3/doxia-logging-api-1.1.3.jar
(12 KB at 651.1 KB/sec)
Downloading: http://repo.maven.apache.org/maven2/com/puppycrawl/tools/checkstyle/5.5/checkstyle-5.5.jar
Downloaded: http://repo.maven.apache.org/maven2/org/apache/maven/doxia/doxia-decoration-model/1.1.3/doxia-decoration-model-1.1.3.jar
(52 KB at 2688.5 KB/sec)
Downloaded: http://repo.maven.apache.org/maven2/org/apache/maven/doxia/doxia-site-renderer/1.1.3/doxia-site-renderer-1.1.3.jar
(50 KB at 2609.6 KB/sec)
Downloaded: http://repo.maven.apache.org/maven2/org/apache/maven/shared/maven-doxia-tools/1.2.1/maven-doxia-tools-1.2.1.jar
(43 KB at 6024.3 KB/sec)
Downloaded: http://repo.maven.apache.org/maven2/org/apache/maven/doxia/doxia-module-xhtml/1.1.3/doxia-module-xhtml-1.1.3.jar
(15 KB at 771.6 KB/sec)
Downloaded: http://repo.maven.apache.org/maven2/com/puppycrawl/tools/checkstyle/5.5/checkstyle-5.5.jar
(623 KB at 29663.2 KB/sec)
[INFO] Starting audit...
Audit done.

[INFO] 
[INFO] --- maven-install-plugin:2.5.2:install (default-install) @ parent ---
[INFO] Installing <https://builds.apache.org/job/DeltaSpike_GF4/ws/deltaspike/parent/pom.xml>
to /home/jenkins/jenkins-slave/maven-repositories/0/org/apache/deltaspike/parent/1.6.2-SNAPSHOT/parent-1.6.2-SNAPSHOT.pom
[INFO]                                                                         
[INFO] ------------------------------------------------------------------------
[INFO] Building Apache DeltaSpike Test-Utils 1.6.2-SNAPSHOT
[INFO] ------------------------------------------------------------------------
Downloading: http://repo.maven.apache.org/maven2/org/apache/maven/plugins/maven-compiler-plugin/2.5/maven-compiler-plugin-2.5.pom
Downloaded: http://repo.maven.apache.org/maven2/org/apache/maven/plugins/maven-compiler-plugin/2.5/maven-compiler-plugin-2.5.pom
(7 KB at 747.4 KB/sec)
Downloading: http://repo.maven.apache.org/maven2/org/apache/maven/plugins/maven-compiler-plugin/2.5/maven-compiler-plugin-2.5.jar
Downloaded: http://repo.maven.apache.org/maven2/org/apache/maven/plugins/maven-compiler-plugin/2.5/maven-compiler-plugin-2.5.jar
(32 KB at 3137.6 KB/sec)
Downloading: http://repo.maven.apache.org/maven2/org/apache/maven/plugins/maven-surefire-plugin/2.11/maven-surefire-plugin-2.11.pom
Downloaded: http://repo.maven.apache.org/maven2/org/apache/maven/plugins/maven-surefire-plugin/2.11/maven-surefire-plugin-2.11.pom
(11 KB at 1169.9 KB/sec)
Downloading: http://repo.maven.apache.org/maven2/org/apache/maven/surefire/surefire/2.11/surefire-2.11.pom
Downloaded: http://repo.maven.apache.org/maven2/org/apache/maven/surefire/surefire/2.11/surefire-2.11.pom
(12 KB at 1297.5 KB/sec)
Downloading: http://repo.maven.apache.org/maven2/org/apache/maven/plugins/maven-surefire-plugin/2.11/maven-surefire-plugin-2.11.jar
Downloaded: http://repo.maven.apache.org/maven2/org/apache/maven/plugins/maven-surefire-plugin/2.11/maven-surefire-plugin-2.11.jar
(31 KB at 3005.5 KB/sec)
Downloading: https://repository.apache.org/content/repositories/releases/org/jboss/shrinkwrap/shrinkwrap-api/1.0.1/shrinkwrap-api-1.0.1.pom
Downloading: https://repository.apache.org/content/repositories/snapshots/org/jboss/shrinkwrap/shrinkwrap-api/1.0.1/shrinkwrap-api-1.0.1.pom
Downloading: http://repo.maven.apache.org/maven2/org/jboss/shrinkwrap/shrinkwrap-api/1.0.1/shrinkwrap-api-1.0.1.pom
Downloaded: http://repo.maven.apache.org/maven2/org/jboss/shrinkwrap/shrinkwrap-api/1.0.1/shrinkwrap-api-1.0.1.pom
(4 KB at 378.2 KB/sec)
Downloading: https://repository.apache.org/content/repositories/releases/org/jboss/shrinkwrap/shrinkwrap-parent/1.0.1/shrinkwrap-parent-1.0.1.pom
Downloading: https://repository.apache.org/content/repositories/snapshots/org/jboss/shrinkwrap/shrinkwrap-parent/1.0.1/shrinkwrap-parent-1.0.1.pom
Downloading: http://repo.maven.apache.org/maven2/org/jboss/shrinkwrap/shrinkwrap-parent/1.0.1/shrinkwrap-parent-1.0.1.pom
Downloaded: http://repo.maven.apache.org/maven2/org/jboss/shrinkwrap/shrinkwrap-parent/1.0.1/shrinkwrap-parent-1.0.1.pom
(11 KB at 1164.0 KB/sec)
Downloading: https://repository.apache.org/content/repositories/releases/org/jboss/shrinkwrap/shrinkwrap-api/1.0.1/shrinkwrap-api-1.0.1.jar
Downloading: https://repository.apache.org/content/repositories/releases/org/apache/maven/maven-artifact/3.0/maven-artifact-3.0.jar
Downloading: https://repository.apache.org/content/repositories/releases/org/codehaus/plexus/plexus-utils/2.0.4/plexus-utils-2.0.4.jar
Downloaded: https://repository.apache.org/content/repositories/releases/org/apache/maven/maven-artifact/3.0/maven-artifact-3.0.jar
(51 KB at 41.1 KB/sec)
Downloading: https://repository.apache.org/content/repositories/snapshots/org/jboss/shrinkwrap/shrinkwrap-api/1.0.1/shrinkwrap-api-1.0.1.jar
Downloading: https://repository.apache.org/content/repositories/snapshots/org/codehaus/plexus/plexus-utils/2.0.4/plexus-utils-2.0.4.jar
Downloading: http://repo.maven.apache.org/maven2/org/jboss/shrinkwrap/shrinkwrap-api/1.0.1/shrinkwrap-api-1.0.1.jar
Downloading: http://repo.maven.apache.org/maven2/org/codehaus/plexus/plexus-utils/2.0.4/plexus-utils-2.0.4.jar
Downloaded: http://repo.maven.apache.org/maven2/org/jboss/shrinkwrap/shrinkwrap-api/1.0.1/shrinkwrap-api-1.0.1.jar
(62 KB at 5093.5 KB/sec)
Downloaded: http://repo.maven.apache.org/maven2/org/codehaus/plexus/plexus-utils/2.0.4/plexus-utils-2.0.4.jar
(217 KB at 9860.5 KB/sec)
[INFO] 
[INFO] --- maven-clean-plugin:2.5:clean (default-clean) @ test-utils ---
[INFO] 
[INFO] --- maven-bundle-plugin:2.3.7:cleanVersions (versions) @ test-utils ---
[INFO] 
[INFO] --- maven-antrun-plugin:1.7:run (javadoc.resources) @ test-utils ---
[WARNING] Parameter tasks is deprecated, use target instead
[INFO] Executing tasks

main:
[INFO] Executed tasks
[INFO] 
[INFO] --- maven-remote-resources-plugin:1.5:process (default) @ test-utils ---
[INFO] 
[INFO] --- maven-resources-plugin:2.7:resources (default-resources) @ test-utils ---
[INFO] Using 'UTF-8' encoding to copy filtered resources.
[INFO] Copying 3 resources
[INFO] Copying 3 resources
[INFO] 
[INFO] --- maven-compiler-plugin:2.5:compile (default-compile) @ test-utils ---
Downloading: http://repo.maven.apache.org/maven2/org/codehaus/plexus/plexus-compiler-api/1.9/plexus-compiler-api-1.9.pom
Downloaded: http://repo.maven.apache.org/maven2/org/codehaus/plexus/plexus-compiler-api/1.9/plexus-compiler-api-1.9.pom
(778 B at 95.0 KB/sec)
Downloading: http://repo.maven.apache.org/maven2/org/codehaus/plexus/plexus-compiler/1.9/plexus-compiler-1.9.pom
Downloaded: http://repo.maven.apache.org/maven2/org/codehaus/plexus/plexus-compiler/1.9/plexus-compiler-1.9.pom
(4 KB at 471.6 KB/sec)
Downloading: http://repo.maven.apache.org/maven2/org/codehaus/plexus/plexus-components/1.1.20/plexus-components-1.1.20.pom
Downloaded: http://repo.maven.apache.org/maven2/org/codehaus/plexus/plexus-components/1.1.20/plexus-components-1.1.20.pom
(3 KB at 420.9 KB/sec)
Downloading: http://repo.maven.apache.org/maven2/org/codehaus/plexus/plexus/3.1/plexus-3.1.pom
Downloaded: http://repo.maven.apache.org/maven2/org/codehaus/plexus/plexus/3.1/plexus-3.1.pom
(19 KB at 2597.0 KB/sec)
Downloading: http://repo.maven.apache.org/maven2/org/codehaus/plexus/plexus-compiler-manager/1.9/plexus-compiler-manager-1.9.pom
Downloaded: http://repo.maven.apache.org/maven2/org/codehaus/plexus/plexus-compiler-manager/1.9/plexus-compiler-manager-1.9.pom
(690 B at 84.2 KB/sec)
Downloading: http://repo.maven.apache.org/maven2/org/codehaus/plexus/plexus-compiler-javac/1.9/plexus-compiler-javac-1.9.pom
Downloaded: http://repo.maven.apache.org/maven2/org/codehaus/plexus/plexus-compiler-javac/1.9/plexus-compiler-javac-1.9.pom
(686 B at 83.7 KB/sec)
Downloading: http://repo.maven.apache.org/maven2/org/codehaus/plexus/plexus-compilers/1.9/plexus-compilers-1.9.pom
Downloaded: http://repo.maven.apache.org/maven2/org/codehaus/plexus/plexus-compilers/1.9/plexus-compilers-1.9.pom
(2 KB at 156.5 KB/sec)
Downloading: http://repo.maven.apache.org/maven2/org/codehaus/plexus/plexus-compiler-api/1.9/plexus-compiler-api-1.9.jar
Downloading: http://repo.maven.apache.org/maven2/org/codehaus/plexus/plexus-compiler-manager/1.9/plexus-compiler-manager-1.9.jar
Downloading: http://repo.maven.apache.org/maven2/org/codehaus/plexus/plexus-compiler-javac/1.9/plexus-compiler-javac-1.9.jar
Downloaded: http://repo.maven.apache.org/maven2/org/codehaus/plexus/plexus-compiler-api/1.9/plexus-compiler-api-1.9.jar
(21 KB at 2072.2 KB/sec)
Downloaded: http://repo.maven.apache.org/maven2/org/codehaus/plexus/plexus-compiler-manager/1.9/plexus-compiler-manager-1.9.jar
(5 KB at 232.9 KB/sec)
Downloaded: http://repo.maven.apache.org/maven2/org/codehaus/plexus/plexus-compiler-javac/1.9/plexus-compiler-javac-1.9.jar
(14 KB at 691.4 KB/sec)
[INFO] Compiling 13 source files to <https://builds.apache.org/job/DeltaSpike_GF4/ws/deltaspike/test-utils/target/classes>
[INFO] ------------------------------------------------------------------------
[INFO] Reactor Summary:
[INFO] 
[INFO] Apache DeltaSpike Sources ......................... SUCCESS [6.663s]
[INFO] Apache DeltaSpike CheckStyle-rules ................ SUCCESS [2.850s]
[INFO] Apache DeltaSpike Parent .......................... SUCCESS [26.038s]
[INFO] Apache DeltaSpike Test-Utils ...................... FAILURE [4.373s]
[INFO] Apache DeltaSpike Code Parent ..................... SKIPPED
[INFO] Apache DeltaSpike Core ............................ SKIPPED
[INFO] Apache DeltaSpike Core-API ........................ SKIPPED
[INFO] Apache DeltaSpike Core-Implementation ............. SKIPPED
[INFO] Apache DeltaSpike ContainerControl parent ......... SKIPPED
[INFO] Apache DeltaSpike CDI ContainerControl API ........ SKIPPED
[INFO] Apache DeltaSpike CDI Weld-ContainerControl ....... SKIPPED
[INFO] Apache DeltaSpike Modules ......................... SKIPPED
[INFO] Apache DeltaSpike Proxy-Module .................... SKIPPED
[INFO] Apache DeltaSpike Proxy-Module API ................ SKIPPED
[INFO] Apache DeltaSpike Proxy-Module Impl ASM5 .......... SKIPPED
[INFO] Apache DeltaSpike Security-Module ................. SKIPPED
[INFO] Apache DeltaSpike Security-Module API ............. SKIPPED
[INFO] Apache DeltaSpike Security-Module Impl ............ SKIPPED
[INFO] Apache DeltaSpike JPA-Module ...................... SKIPPED
[INFO] Apache DeltaSpike JPA-Module API .................. SKIPPED
[INFO] Apache DeltaSpike JPA-Module Impl ................. SKIPPED
[INFO] Apache DeltaSpike Servlet-Module .................. SKIPPED
[INFO] Apache DeltaSpike Servlet-Module API .............. SKIPPED
[INFO] Apache DeltaSpike Servlet-Module Impl ............. SKIPPED
[INFO] Apache DeltaSpike JSF-Module ...................... SKIPPED
[INFO] Apache DeltaSpike JSF-Module API .................. SKIPPED
[INFO] Apache DeltaSpike JSF-Module Impl ................. SKIPPED
[INFO] Apache DeltaSpike JSF-Module Impl (EE6 only) ...... SKIPPED
[INFO] Apache DeltaSpike Partial-Bean-Module ............. SKIPPED
[INFO] Apache DeltaSpike Partial-Bean-Module API ......... SKIPPED
[INFO] Apache DeltaSpike Partial-Bean-Module Impl ........ SKIPPED
[INFO] Apache DeltaSpike BeanValidation-Module ........... SKIPPED
[INFO] Apache DeltaSpike BeanValidation-Module API ....... SKIPPED
[INFO] Apache DeltaSpike BeanValidation-Module Impl ...... SKIPPED
[INFO] Apache DeltaSpike Data-Module ..................... SKIPPED
[INFO] Apache DeltaSpike Data-Module API ................. SKIPPED
[INFO] Apache DeltaSpike Data-Module Impl ................ SKIPPED
[INFO] Apache DeltaSpike Scheduler-Module ................ SKIPPED
[INFO] Apache DeltaSpike Scheduler-Module API ............ SKIPPED
[INFO] Apache DeltaSpike Scheduler-Module Impl ........... SKIPPED
[INFO] Apache DeltaSpike Test-Control-Module ............. SKIPPED
[INFO] Apache DeltaSpike Test-Control-Module API ......... SKIPPED
[INFO] Apache DeltaSpike Test-Control-Module Impl ........ SKIPPED
[INFO] Apache DeltaSpike Examples ........................ SKIPPED
[INFO] Apache DeltaSpike Java-SE Examples ................ SKIPPED
[INFO] Apache DeltaSpike JSF Examples .................... SKIPPED
[INFO] Apache DeltaSpike JSF Playground .................. SKIPPED
[INFO] Apache DeltaSpike Security Example CDI ............ SKIPPED
[INFO] Apache DeltaSpike Security Example PicketLink ..... SKIPPED
[INFO] Apache DeltaSpike Java-SE Scheduler Examples ...... SKIPPED
[INFO] ------------------------------------------------------------------------
[INFO] BUILD FAILURE
[INFO] ------------------------------------------------------------------------
[INFO] Total time: 47.179s
[INFO] Finished at: Tue May 10 08:06:08 UTC 2016
[INFO] Final Memory: 46M/710M
[INFO] ------------------------------------------------------------------------
Waiting for Jenkins to finish collecting data
[ERROR] Failed to execute goal org.apache.maven.plugins:maven-compiler-plugin:2.5:compile
(default-compile) on project test-utils: Fatal error compiling: tools.jar not found: /usr/lib/jvm/java-7-openjdk-amd64/jre/../lib/tools.jar
-> [Help 1]
[ERROR] 
[ERROR] To see the full stack trace of the errors, re-run Maven with the -e switch.
[ERROR] Re-run Maven using the -X switch to enable full debug logging.
[ERROR] 
[ERROR] For more information about the errors and possible solutions, please read the following
articles:
[ERROR] [Help 1] http://cwiki.apache.org/confluence/display/MAVEN/MojoExecutionException
[ERROR] 
[ERROR] After correcting the problems, you can resume the build with the command
[ERROR]   mvn <goals> -rf :test-utils
[JENKINS] Archiving <https://builds.apache.org/job/DeltaSpike_GF4/ws/deltaspike/examples/jse-examples/pom.xml>
to org.apache.deltaspike.examples/deltaspike-jse-example/1.6.2-SNAPSHOT/deltaspike-jse-example-1.6.2-SNAPSHOT.pom
[JENKINS] Archiving <https://builds.apache.org/job/DeltaSpike_GF4/ws/deltaspike/examples/security-requested-page-after-login-cdi/pom.xml>
to org.apache.deltaspike.examples/deltaspike-security-requested-page-after-login-cdi/1.6.2-SNAPSHOT/deltaspike-security-requested-page-after-login-cdi-1.6.2-SNAPSHOT.pom
[JENKINS] Archiving <https://builds.apache.org/job/DeltaSpike_GF4/ws/deltaspike/test-utils/pom.xml>
to org.apache.deltaspike.test/test-utils/1.6.2-SNAPSHOT/test-utils-1.6.2-SNAPSHOT.pom
[JENKINS] Archiving <https://builds.apache.org/job/DeltaSpike_GF4/ws/deltaspike/modules/data/impl/pom.xml>
to org.apache.deltaspike.modules/deltaspike-data-module-impl/1.6.2-SNAPSHOT/deltaspike-data-module-impl-1.6.2-SNAPSHOT.pom
[JENKINS] Archiving <https://builds.apache.org/job/DeltaSpike_GF4/ws/deltaspike/modules/data/api/pom.xml>
to org.apache.deltaspike.modules/deltaspike-data-module-api/1.6.2-SNAPSHOT/deltaspike-data-module-api-1.6.2-SNAPSHOT.pom
[JENKINS] Archiving <https://builds.apache.org/job/DeltaSpike_GF4/ws/deltaspike/core/impl/pom.xml>
to org.apache.deltaspike.core/deltaspike-core-impl/1.6.2-SNAPSHOT/deltaspike-core-impl-1.6.2-SNAPSHOT.pom
[JENKINS] Archiving <https://builds.apache.org/job/DeltaSpike_GF4/ws/deltaspike/modules/pom.xml>
to org.apache.deltaspike.modules/modules-project/1.6.2-SNAPSHOT/modules-project-1.6.2-SNAPSHOT.pom
[JENKINS] Archiving <https://builds.apache.org/job/DeltaSpike_GF4/ws/deltaspike/modules/test-control/pom.xml>
to org.apache.deltaspike.modules/test-control-module-project/1.6.2-SNAPSHOT/test-control-module-project-1.6.2-SNAPSHOT.pom
[JENKINS] Archiving <https://builds.apache.org/job/DeltaSpike_GF4/ws/deltaspike/examples/jsf-examples/pom.xml>
to org.apache.deltaspike.examples/deltaspike-jsf-example/1.6.2-SNAPSHOT/deltaspike-jsf-example-1.6.2-SNAPSHOT.pom
[JENKINS] Archiving <https://builds.apache.org/job/DeltaSpike_GF4/ws/deltaspike/cdictrl/api/pom.xml>
to org.apache.deltaspike.cdictrl/deltaspike-cdictrl-api/1.6.2-SNAPSHOT/deltaspike-cdictrl-api-1.6.2-SNAPSHOT.pom
[JENKINS] Archiving <https://builds.apache.org/job/DeltaSpike_GF4/ws/deltaspike/examples/scheduler-playground/pom.xml>
to org.apache.deltaspike.examples/deltaspike-scheduler-example/1.6.2-SNAPSHOT/deltaspike-scheduler-example-1.6.2-SNAPSHOT.pom
[JENKINS] Archiving <https://builds.apache.org/job/DeltaSpike_GF4/ws/deltaspike/checkstyle-rules/pom.xml>
to org.apache.deltaspike/checkstyle-rules/1.6.2-SNAPSHOT/checkstyle-rules-1.6.2-SNAPSHOT.pom
[JENKINS] Archiving <https://builds.apache.org/job/DeltaSpike_GF4/ws/deltaspike/checkstyle-rules/target/checkstyle-rules-1.6.2-SNAPSHOT.jar>
to org.apache.deltaspike/checkstyle-rules/1.6.2-SNAPSHOT/checkstyle-rules-1.6.2-SNAPSHOT.jar
[JENKINS] Archiving <https://builds.apache.org/job/DeltaSpike_GF4/ws/deltaspike/parent/code/pom.xml>
to org.apache.deltaspike/parent-code/1.6.2-SNAPSHOT/parent-code-1.6.2-SNAPSHOT.pom
Compressed 80.72 KB of artifacts by 39.6% relative to #359
[JENKINS] Archiving <https://builds.apache.org/job/DeltaSpike_GF4/ws/deltaspike/modules/jsf/impl/pom.xml>
to org.apache.deltaspike.modules/deltaspike-jsf-module-impl/1.6.2-SNAPSHOT/deltaspike-jsf-module-impl-1.6.2-SNAPSHOT.pom
[JENKINS] Archiving <https://builds.apache.org/job/DeltaSpike_GF4/ws/deltaspike/modules/partial-bean/pom.xml>
to org.apache.deltaspike.modules/partial-bean-module-project/1.6.2-SNAPSHOT/partial-bean-module-project-1.6.2-SNAPSHOT.pom
[JENKINS] Archiving <https://builds.apache.org/job/DeltaSpike_GF4/ws/deltaspike/examples/pom.xml>
to org.apache.deltaspike.examples/examples-project/1.6.2-SNAPSHOT/examples-project-1.6.2-SNAPSHOT.pom
[JENKINS] Archiving <https://builds.apache.org/job/DeltaSpike_GF4/ws/deltaspike/modules/jsf/pom.xml>
to org.apache.deltaspike.modules/jsf-module-project/1.6.2-SNAPSHOT/jsf-module-project-1.6.2-SNAPSHOT.pom
[JENKINS] Archiving <https://builds.apache.org/job/DeltaSpike_GF4/ws/deltaspike/modules/jsf/api/pom.xml>
to org.apache.deltaspike.modules/deltaspike-jsf-module-api/1.6.2-SNAPSHOT/deltaspike-jsf-module-api-1.6.2-SNAPSHOT.pom
[JENKINS] Archiving <https://builds.apache.org/job/DeltaSpike_GF4/ws/deltaspike/modules/security/pom.xml>
to org.apache.deltaspike.modules/security-module-project/1.6.2-SNAPSHOT/security-module-project-1.6.2-SNAPSHOT.pom
[JENKINS] Archiving <https://builds.apache.org/job/DeltaSpike_GF4/ws/deltaspike/modules/bean-validation/pom.xml>
to org.apache.deltaspike.modules/bean-validation-module-project/1.6.2-SNAPSHOT/bean-validation-module-project-1.6.2-SNAPSHOT.pom
[JENKINS] Archiving <https://builds.apache.org/job/DeltaSpike_GF4/ws/deltaspike/modules/partial-bean/impl/pom.xml>
to org.apache.deltaspike.modules/deltaspike-partial-bean-module-impl/1.6.2-SNAPSHOT/deltaspike-partial-bean-module-impl-1.6.2-SNAPSHOT.pom
[JENKINS] Archiving <https://builds.apache.org/job/DeltaSpike_GF4/ws/deltaspike/modules/proxy/api/pom.xml>
to org.apache.deltaspike.modules/deltaspike-proxy-module-api/1.6.2-SNAPSHOT/deltaspike-proxy-module-api-1.6.2-SNAPSHOT.pom
[JENKINS] Archiving <https://builds.apache.org/job/DeltaSpike_GF4/ws/deltaspike/cdictrl/impl-weld/pom.xml>
to org.apache.deltaspike.cdictrl/deltaspike-cdictrl-weld/1.6.2-SNAPSHOT/deltaspike-cdictrl-weld-1.6.2-SNAPSHOT.pom
[JENKINS] Archiving <https://builds.apache.org/job/DeltaSpike_GF4/ws/deltaspike/modules/jpa/api/pom.xml>
to org.apache.deltaspike.modules/deltaspike-jpa-module-api/1.6.2-SNAPSHOT/deltaspike-jpa-module-api-1.6.2-SNAPSHOT.pom
[JENKINS] Archiving <https://builds.apache.org/job/DeltaSpike_GF4/ws/deltaspike/modules/servlet/api/pom.xml>
to org.apache.deltaspike.modules/deltaspike-servlet-module-api/1.6.2-SNAPSHOT/deltaspike-servlet-module-api-1.6.2-SNAPSHOT.pom
[JENKINS] Archiving <https://builds.apache.org/job/DeltaSpike_GF4/ws/deltaspike/modules/jpa/pom.xml>
to org.apache.deltaspike.modules/jpa-module-project/1.6.2-SNAPSHOT/jpa-module-project-1.6.2-SNAPSHOT.pom
[JENKINS] Archiving <https://builds.apache.org/job/DeltaSpike_GF4/ws/deltaspike/cdictrl/pom.xml>
to org.apache.deltaspike.cdictrl/cdictrl-project/1.6.2-SNAPSHOT/cdictrl-project-1.6.2-SNAPSHOT.pom
[JENKINS] Archiving <https://builds.apache.org/job/DeltaSpike_GF4/ws/deltaspike/modules/scheduler/api/pom.xml>
to org.apache.deltaspike.modules/deltaspike-scheduler-module-api/1.6.2-SNAPSHOT/deltaspike-scheduler-module-api-1.6.2-SNAPSHOT.pom
[JENKINS] Archiving <https://builds.apache.org/job/DeltaSpike_GF4/ws/deltaspike/modules/test-control/impl/pom.xml>
to org.apache.deltaspike.modules/deltaspike-test-control-module-impl/1.6.2-SNAPSHOT/deltaspike-test-control-module-impl-1.6.2-SNAPSHOT.pom
[JENKINS] Archiving <https://builds.apache.org/job/DeltaSpike_GF4/ws/deltaspike/modules/servlet/pom.xml>
to org.apache.deltaspike.modules/servlet-module-project/1.6.2-SNAPSHOT/servlet-module-project-1.6.2-SNAPSHOT.pom
[JENKINS] Archiving <https://builds.apache.org/job/DeltaSpike_GF4/ws/deltaspike/modules/test-control/api/pom.xml>
to org.apache.deltaspike.modules/deltaspike-test-control-module-api/1.6.2-SNAPSHOT/deltaspike-test-control-module-api-1.6.2-SNAPSHOT.pom
[JENKINS] Archiving <https://builds.apache.org/job/DeltaSpike_GF4/ws/deltaspike/modules/jsf/impl-ee6/pom.xml>
to org.apache.deltaspike.modules/deltaspike-jsf-module-impl-ee6/1.6.2-SNAPSHOT/deltaspike-jsf-module-impl-ee6-1.6.2-SNAPSHOT.pom
[JENKINS] Archiving <https://builds.apache.org/job/DeltaSpike_GF4/ws/deltaspike/modules/proxy/pom.xml>
to org.apache.deltaspike.modules/proxy-module-project/1.6.2-SNAPSHOT/proxy-module-project-1.6.2-SNAPSHOT.pom
[JENKINS] Archiving <https://builds.apache.org/job/DeltaSpike_GF4/ws/deltaspike/modules/partial-bean/api/pom.xml>
to org.apache.deltaspike.modules/deltaspike-partial-bean-module-api/1.6.2-SNAPSHOT/deltaspike-partial-bean-module-api-1.6.2-SNAPSHOT.pom
[JENKINS] Archiving <https://builds.apache.org/job/DeltaSpike_GF4/ws/deltaspike/modules/scheduler/impl/pom.xml>
to org.apache.deltaspike.modules/deltaspike-scheduler-module-impl/1.6.2-SNAPSHOT/deltaspike-scheduler-module-impl-1.6.2-SNAPSHOT.pom
[JENKINS] Archiving <https://builds.apache.org/job/DeltaSpike_GF4/ws/deltaspike/parent/pom.xml>
to org.apache.deltaspike/parent/1.6.2-SNAPSHOT/parent-1.6.2-SNAPSHOT.pom
Compressed 40.15 KB of artifacts by 79.7% relative to #359
[JENKINS] Archiving <https://builds.apache.org/job/DeltaSpike_GF4/ws/deltaspike/core/pom.xml>
to org.apache.deltaspike.core/core-project/1.6.2-SNAPSHOT/core-project-1.6.2-SNAPSHOT.pom
[JENKINS] Archiving <https://builds.apache.org/job/DeltaSpike_GF4/ws/deltaspike/modules/bean-validation/api/pom.xml>
to org.apache.deltaspike.modules/deltaspike-bean-validation-module-api/1.6.2-SNAPSHOT/deltaspike-bean-validation-module-api-1.6.2-SNAPSHOT.pom
[JENKINS] Archiving <https://builds.apache.org/job/DeltaSpike_GF4/ws/deltaspike/core/api/pom.xml>
to org.apache.deltaspike.core/deltaspike-core-api/1.6.2-SNAPSHOT/deltaspike-core-api-1.6.2-SNAPSHOT.pom
[JENKINS] Archiving <https://builds.apache.org/job/DeltaSpike_GF4/ws/deltaspike/modules/security/impl/pom.xml>
to org.apache.deltaspike.modules/deltaspike-security-module-impl/1.6.2-SNAPSHOT/deltaspike-security-module-impl-1.6.2-SNAPSHOT.pom
[JENKINS] Archiving <https://builds.apache.org/job/DeltaSpike_GF4/ws/deltaspike/modules/scheduler/pom.xml>
to org.apache.deltaspike.modules/scheduler-module-project/1.6.2-SNAPSHOT/scheduler-module-project-1.6.2-SNAPSHOT.pom
[JENKINS] Archiving <https://builds.apache.org/job/DeltaSpike_GF4/ws/deltaspike/modules/proxy/impl-asm5/pom.xml>
to org.apache.deltaspike.modules/deltaspike-proxy-module-impl-asm5/1.6.2-SNAPSHOT/deltaspike-proxy-module-impl-asm5-1.6.2-SNAPSHOT.pom
[JENKINS] Archiving <https://builds.apache.org/job/DeltaSpike_GF4/ws/deltaspike/examples/jsf-playground/pom.xml>
to org.apache.deltaspike.examples/deltaspike-jsf-playground/1.6.2-SNAPSHOT/deltaspike-jsf-playground-1.6.2-SNAPSHOT.pom
[JENKINS] Archiving <https://builds.apache.org/job/DeltaSpike_GF4/ws/deltaspike/modules/servlet/impl/pom.xml>
to org.apache.deltaspike.modules/deltaspike-servlet-module-impl/1.6.2-SNAPSHOT/deltaspike-servlet-module-impl-1.6.2-SNAPSHOT.pom
[JENKINS] Archiving <https://builds.apache.org/job/DeltaSpike_GF4/ws/deltaspike/modules/bean-validation/impl/pom.xml>
to org.apache.deltaspike.modules/deltaspike-bean-validation-module-impl/1.6.2-SNAPSHOT/deltaspike-bean-validation-module-impl-1.6.2-SNAPSHOT.pom
[JENKINS] Archiving <https://builds.apache.org/job/DeltaSpike_GF4/ws/deltaspike/modules/jpa/impl/pom.xml>
to org.apache.deltaspike.modules/deltaspike-jpa-module-impl/1.6.2-SNAPSHOT/deltaspike-jpa-module-impl-1.6.2-SNAPSHOT.pom
[JENKINS] Archiving <https://builds.apache.org/job/DeltaSpike_GF4/ws/deltaspike/modules/data/pom.xml>
to org.apache.deltaspike.modules/data-module-project/1.6.2-SNAPSHOT/data-module-project-1.6.2-SNAPSHOT.pom
[JENKINS] Archiving <https://builds.apache.org/job/DeltaSpike_GF4/ws/deltaspike/examples/security-requested-page-after-login-picketlink/pom.xml>
to org.apache.deltaspike.examples/deltaspike-security-requested-page-after-login-picketlink/1.6.2-SNAPSHOT/deltaspike-security-requested-page-after-login-picketlink-1.6.2-SNAPSHOT.pom
[JENKINS] Archiving <https://builds.apache.org/job/DeltaSpike_GF4/ws/deltaspike/pom.xml>
to org.apache.deltaspike/deltaspike-project/1.6.2-SNAPSHOT/deltaspike-project-1.6.2-SNAPSHOT.pom
[JENKINS] Archiving <https://builds.apache.org/job/DeltaSpike_GF4/ws/deltaspike/modules/security/api/pom.xml>
to org.apache.deltaspike.modules/deltaspike-security-module-api/1.6.2-SNAPSHOT/deltaspike-security-module-api-1.6.2-SNAPSHOT.pom
Sending e-mails to: commits@deltaspike.apache.org
channel stopped

Mime
View raw message