deltaspike-commits mailing list archives

Site index · List index
Message view « Date » · « Thread »
Top « Date » · « Thread »
From Apache Jenkins Server <jenk...@builds.apache.org>
Subject Build failed in Jenkins: DeltaSpike OWB 1.6.0 #240
Date Tue, 17 May 2016 12:18:25 GMT
See <https://builds.apache.org/job/DeltaSpike%20OWB%201.6.0/240/changes>

Changes:

[tandraschko] DELTASPIKE-1144 added some debug logging

------------------------------------------
[...truncated 311 lines...]
Downloading: http://repo.maven.apache.org/maven2/org/apache/geronimo/genesis/genesis-java6-flava/2.2/genesis-java6-flava-2.2.pom
Downloaded: http://repo.maven.apache.org/maven2/org/apache/geronimo/genesis/genesis-java6-flava/2.2/genesis-java6-flava-2.2.pom
(6 KB at 595.1 KB/sec)
Downloading: https://repository.apache.org/content/repositories/releases/org/apache/geronimo/genesis/genesis-default-flava/2.2/genesis-default-flava-2.2.pom
Downloading: https://repository.apache.org/content/repositories/snapshots/org/apache/geronimo/genesis/genesis-default-flava/2.2/genesis-default-flava-2.2.pom
Downloading: http://repo.maven.apache.org/maven2/org/apache/geronimo/genesis/genesis-default-flava/2.2/genesis-default-flava-2.2.pom
Downloaded: http://repo.maven.apache.org/maven2/org/apache/geronimo/genesis/genesis-default-flava/2.2/genesis-default-flava-2.2.pom
(15 KB at 1627.4 KB/sec)
Downloading: https://repository.apache.org/content/repositories/releases/org/apache/geronimo/genesis/genesis/2.2/genesis-2.2.pom
Downloading: https://repository.apache.org/content/repositories/snapshots/org/apache/geronimo/genesis/genesis/2.2/genesis-2.2.pom
[INFO] I/O exception (java.net.SocketException) caught when processing request: Connection
reset
[INFO] Retrying request
[INFO] I/O exception (java.net.SocketException) caught when processing request: Connection
reset
[INFO] Retrying request
Downloading: http://repo.maven.apache.org/maven2/org/apache/geronimo/genesis/genesis/2.2/genesis-2.2.pom
Downloaded: http://repo.maven.apache.org/maven2/org/apache/geronimo/genesis/genesis/2.2/genesis-2.2.pom
(17 KB at 1603.9 KB/sec)
Downloading: https://repository.apache.org/content/repositories/releases/org/apache/geronimo/specs/geronimo-interceptor_1.2_spec/1.0-alpha-1/geronimo-interceptor_1.2_spec-1.0-alpha-1.pom
Downloading: https://repository.apache.org/content/repositories/snapshots/org/apache/geronimo/specs/geronimo-interceptor_1.2_spec/1.0-alpha-1/geronimo-interceptor_1.2_spec-1.0-alpha-1.pom
Downloading: http://repo.maven.apache.org/maven2/org/apache/geronimo/specs/geronimo-interceptor_1.2_spec/1.0-alpha-1/geronimo-interceptor_1.2_spec-1.0-alpha-1.pom
Downloaded: http://repo.maven.apache.org/maven2/org/apache/geronimo/specs/geronimo-interceptor_1.2_spec/1.0-alpha-1/geronimo-interceptor_1.2_spec-1.0-alpha-1.pom
(3 KB at 71.4 KB/sec)
Downloading: https://repository.apache.org/content/repositories/releases/org/apache/geronimo/genesis/genesis-java5-flava/2.2/genesis-java5-flava-2.2.pom
Downloading: https://repository.apache.org/content/repositories/snapshots/org/apache/geronimo/genesis/genesis-java5-flava/2.2/genesis-java5-flava-2.2.pom
Downloading: http://repo.maven.apache.org/maven2/org/apache/geronimo/genesis/genesis-java5-flava/2.2/genesis-java5-flava-2.2.pom
Downloaded: http://repo.maven.apache.org/maven2/org/apache/geronimo/genesis/genesis-java5-flava/2.2/genesis-java5-flava-2.2.pom
(6 KB at 535.5 KB/sec)
Downloading: https://repository.apache.org/content/repositories/snapshots/org/apache/geronimo/specs/geronimo-annotation_1.2_spec/1.0.MR2-SNAPSHOT/maven-metadata.xml
Downloading: https://repository.apache.org/content/repositories/releases/org/apache/geronimo/specs/geronimo-annotation_1.2_spec/1.0.MR2-SNAPSHOT/maven-metadata.xml
Downloading: http://repository.apache.org/snapshots/org/apache/geronimo/specs/geronimo-annotation_1.2_spec/1.0.MR2-SNAPSHOT/maven-metadata.xml
[WARNING] Could not transfer metadata org.apache.geronimo.specs:geronimo-annotation_1.2_spec:1.0.MR2-SNAPSHOT/maven-metadata.xml
from/to Apache Repository (https://repository.apache.org/content/repositories/releases): Failed
to transfer file: https://repository.apache.org/content/repositories/releases/org/apache/geronimo/specs/geronimo-annotation_1.2_spec/1.0.MR2-SNAPSHOT/maven-metadata.xml.
Return code is: 503, ReasonPhrase:Service Unavailable.
[WARNING] Could not transfer metadata org.apache.geronimo.specs:geronimo-annotation_1.2_spec:1.0.MR2-SNAPSHOT/maven-metadata.xml
from/to Apache Snapshot Repository (https://repository.apache.org/content/repositories/snapshots):
Failed to transfer file: https://repository.apache.org/content/repositories/snapshots/org/apache/geronimo/specs/geronimo-annotation_1.2_spec/1.0.MR2-SNAPSHOT/maven-metadata.xml.
Return code is: 503, ReasonPhrase:Service Unavailable.
[WARNING] Could not transfer metadata org.apache.geronimo.specs:geronimo-annotation_1.2_spec:1.0.MR2-SNAPSHOT/maven-metadata.xml
from/to Nexus (http://repository.apache.org/snapshots): Failed to transfer file: http://repository.apache.org/snapshots/org/apache/geronimo/specs/geronimo-annotation_1.2_spec/1.0.MR2-SNAPSHOT/maven-metadata.xml.
Return code is: 503, ReasonPhrase:Service Unavailable.
[WARNING] Failure to transfer org.apache.geronimo.specs:geronimo-annotation_1.2_spec:1.0.MR2-SNAPSHOT/maven-metadata.xml
from https://repository.apache.org/content/repositories/releases was cached in the local repository,
resolution will not be reattempted until the update interval of Apache Repository has elapsed
or updates are forced. Original error: Could not transfer metadata org.apache.geronimo.specs:geronimo-annotation_1.2_spec:1.0.MR2-SNAPSHOT/maven-metadata.xml
from/to Apache Repository (https://repository.apache.org/content/repositories/releases): Failed
to transfer file: https://repository.apache.org/content/repositories/releases/org/apache/geronimo/specs/geronimo-annotation_1.2_spec/1.0.MR2-SNAPSHOT/maven-metadata.xml.
Return code is: 503, ReasonPhrase:Service Unavailable.
[WARNING] Failure to transfer org.apache.geronimo.specs:geronimo-annotation_1.2_spec:1.0.MR2-SNAPSHOT/maven-metadata.xml
from https://repository.apache.org/content/repositories/snapshots was cached in the local
repository, resolution will not be reattempted until the update interval of Apache Snapshot
Repository has elapsed or updates are forced. Original error: Could not transfer metadata
org.apache.geronimo.specs:geronimo-annotation_1.2_spec:1.0.MR2-SNAPSHOT/maven-metadata.xml
from/to Apache Snapshot Repository (https://repository.apache.org/content/repositories/snapshots):
Failed to transfer file: https://repository.apache.org/content/repositories/snapshots/org/apache/geronimo/specs/geronimo-annotation_1.2_spec/1.0.MR2-SNAPSHOT/maven-metadata.xml.
Return code is: 503, ReasonPhrase:Service Unavailable.
[WARNING] Failure to transfer org.apache.geronimo.specs:geronimo-annotation_1.2_spec:1.0.MR2-SNAPSHOT/maven-metadata.xml
from http://repository.apache.org/snapshots was cached in the local repository, resolution
will not be reattempted until the update interval of Nexus has elapsed or updates are forced.
Original error: Could not transfer metadata org.apache.geronimo.specs:geronimo-annotation_1.2_spec:1.0.MR2-SNAPSHOT/maven-metadata.xml
from/to Nexus (http://repository.apache.org/snapshots): Failed to transfer file: http://repository.apache.org/snapshots/org/apache/geronimo/specs/geronimo-annotation_1.2_spec/1.0.MR2-SNAPSHOT/maven-metadata.xml.
Return code is: 503, ReasonPhrase:Service Unavailable.
Downloading: https://repository.apache.org/content/repositories/releases/org/apache/geronimo/specs/geronimo-annotation_1.2_spec/1.0.MR2-SNAPSHOT/geronimo-annotation_1.2_spec-1.0.MR2-SNAPSHOT.pom
Downloading: https://repository.apache.org/content/repositories/snapshots/org/apache/geronimo/specs/geronimo-annotation_1.2_spec/1.0.MR2-SNAPSHOT/geronimo-annotation_1.2_spec-1.0.MR2-SNAPSHOT.pom
Downloading: http://repository.apache.org/snapshots/org/apache/geronimo/specs/geronimo-annotation_1.2_spec/1.0.MR2-SNAPSHOT/geronimo-annotation_1.2_spec-1.0.MR2-SNAPSHOT.pom
Downloading: https://repository.apache.org/content/repositories/releases/org/apache/geronimo/specs/geronimo-el_2.2_spec/1.0.2/geronimo-el_2.2_spec-1.0.2.pom
Downloading: https://repository.apache.org/content/repositories/snapshots/org/apache/geronimo/specs/geronimo-el_2.2_spec/1.0.2/geronimo-el_2.2_spec-1.0.2.pom
Downloading: http://repo.maven.apache.org/maven2/org/apache/geronimo/specs/geronimo-el_2.2_spec/1.0.2/geronimo-el_2.2_spec-1.0.2.pom
Downloaded: http://repo.maven.apache.org/maven2/org/apache/geronimo/specs/geronimo-el_2.2_spec/1.0.2/geronimo-el_2.2_spec-1.0.2.pom
(4 KB at 368.4 KB/sec)
Downloading: https://repository.apache.org/content/repositories/releases/org/apache/openwebbeans/openwebbeans-impl/1.6.0/openwebbeans-impl-1.6.0.pom
Downloading: https://repository.apache.org/content/repositories/snapshots/org/apache/openwebbeans/openwebbeans-impl/1.6.0/openwebbeans-impl-1.6.0.pom
Downloading: http://repo.maven.apache.org/maven2/org/apache/openwebbeans/openwebbeans-impl/1.6.0/openwebbeans-impl-1.6.0.pom
Downloaded: http://repo.maven.apache.org/maven2/org/apache/openwebbeans/openwebbeans-impl/1.6.0/openwebbeans-impl-1.6.0.pom
(7 KB at 47.4 KB/sec)
Downloading: https://repository.apache.org/content/repositories/releases/org/apache/openwebbeans/openwebbeans/1.6.0/openwebbeans-1.6.0.pom
Downloading: https://repository.apache.org/content/repositories/snapshots/org/apache/openwebbeans/openwebbeans/1.6.0/openwebbeans-1.6.0.pom
Downloading: http://repo.maven.apache.org/maven2/org/apache/openwebbeans/openwebbeans/1.6.0/openwebbeans-1.6.0.pom
Downloaded: http://repo.maven.apache.org/maven2/org/apache/openwebbeans/openwebbeans/1.6.0/openwebbeans-1.6.0.pom
(32 KB at 157.3 KB/sec)
Downloading: https://repository.apache.org/content/repositories/releases/org/apache/xbean/xbean-finder-shaded/4.3/xbean-finder-shaded-4.3.pom
Downloading: https://repository.apache.org/content/repositories/snapshots/org/apache/xbean/xbean-finder-shaded/4.3/xbean-finder-shaded-4.3.pom
Downloading: http://repo.maven.apache.org/maven2/org/apache/xbean/xbean-finder-shaded/4.3/xbean-finder-shaded-4.3.pom
Downloaded: http://repo.maven.apache.org/maven2/org/apache/xbean/xbean-finder-shaded/4.3/xbean-finder-shaded-4.3.pom
(5 KB at 451.6 KB/sec)
Downloading: https://repository.apache.org/content/repositories/releases/org/apache/xbean/xbean/4.3/xbean-4.3.pom
Downloading: https://repository.apache.org/content/repositories/snapshots/org/apache/xbean/xbean/4.3/xbean-4.3.pom
Downloading: http://repo.maven.apache.org/maven2/org/apache/xbean/xbean/4.3/xbean-4.3.pom
Downloaded: http://repo.maven.apache.org/maven2/org/apache/xbean/xbean/4.3/xbean-4.3.pom (18
KB at 1727.4 KB/sec)
Downloading: https://repository.apache.org/content/repositories/releases/org/apache/geronimo/genesis/genesis-java5-flava/2.1/genesis-java5-flava-2.1.pom
Downloading: https://repository.apache.org/content/repositories/snapshots/org/apache/geronimo/genesis/genesis-java5-flava/2.1/genesis-java5-flava-2.1.pom
Downloading: http://repo.maven.apache.org/maven2/org/apache/geronimo/genesis/genesis-java5-flava/2.1/genesis-java5-flava-2.1.pom
Downloaded: http://repo.maven.apache.org/maven2/org/apache/geronimo/genesis/genesis-java5-flava/2.1/genesis-java5-flava-2.1.pom
(6 KB at 669.4 KB/sec)
Downloading: https://repository.apache.org/content/repositories/releases/org/apache/geronimo/genesis/genesis-default-flava/2.1/genesis-default-flava-2.1.pom
Downloading: https://repository.apache.org/content/repositories/snapshots/org/apache/geronimo/genesis/genesis-default-flava/2.1/genesis-default-flava-2.1.pom
Downloading: http://repo.maven.apache.org/maven2/org/apache/geronimo/genesis/genesis-default-flava/2.1/genesis-default-flava-2.1.pom
Downloaded: http://repo.maven.apache.org/maven2/org/apache/geronimo/genesis/genesis-default-flava/2.1/genesis-default-flava-2.1.pom
(16 KB at 1742.9 KB/sec)
Downloading: https://repository.apache.org/content/repositories/releases/org/apache/geronimo/genesis/genesis/2.1/genesis-2.1.pom
Downloading: https://repository.apache.org/content/repositories/snapshots/org/apache/geronimo/genesis/genesis/2.1/genesis-2.1.pom
Downloading: http://repo.maven.apache.org/maven2/org/apache/geronimo/genesis/genesis/2.1/genesis-2.1.pom
Downloaded: http://repo.maven.apache.org/maven2/org/apache/geronimo/genesis/genesis/2.1/genesis-2.1.pom
(14 KB at 1547.1 KB/sec)
Downloading: https://repository.apache.org/content/repositories/releases/org/apache/xbean/xbean-asm5-shaded/4.3/xbean-asm5-shaded-4.3.pom
Downloading: https://repository.apache.org/content/repositories/snapshots/org/apache/xbean/xbean-asm5-shaded/4.3/xbean-asm5-shaded-4.3.pom
Downloading: http://repo.maven.apache.org/maven2/org/apache/xbean/xbean-asm5-shaded/4.3/xbean-asm5-shaded-4.3.pom
Downloaded: http://repo.maven.apache.org/maven2/org/apache/xbean/xbean-asm5-shaded/4.3/xbean-asm5-shaded-4.3.pom
(4 KB at 363.4 KB/sec)
Downloading: https://repository.apache.org/content/repositories/releases/org/apache/openwebbeans/openwebbeans-spi/1.6.0/openwebbeans-spi-1.6.0.pom
Downloading: https://repository.apache.org/content/repositories/snapshots/org/apache/openwebbeans/openwebbeans-spi/1.6.0/openwebbeans-spi-1.6.0.pom
Downloading: http://repo.maven.apache.org/maven2/org/apache/openwebbeans/openwebbeans-spi/1.6.0/openwebbeans-spi-1.6.0.pom
Downloaded: http://repo.maven.apache.org/maven2/org/apache/openwebbeans/openwebbeans-spi/1.6.0/openwebbeans-spi-1.6.0.pom
(3 KB at 61.5 KB/sec)
Downloading: https://repository.apache.org/content/repositories/releases/org/apache/openwebbeans/openwebbeans-resource/1.6.0/openwebbeans-resource-1.6.0.pom
Downloading: https://repository.apache.org/content/repositories/snapshots/org/apache/openwebbeans/openwebbeans-resource/1.6.0/openwebbeans-resource-1.6.0.pom
Downloading: http://repo.maven.apache.org/maven2/org/apache/openwebbeans/openwebbeans-resource/1.6.0/openwebbeans-resource-1.6.0.pom
Downloaded: http://repo.maven.apache.org/maven2/org/apache/openwebbeans/openwebbeans-resource/1.6.0/openwebbeans-resource-1.6.0.pom
(3 KB at 42.0 KB/sec)
Downloading: https://repository.apache.org/content/repositories/releases/org/apache/openwebbeans/arquillian/owb-arquillian-standalone/1.6.0/owb-arquillian-standalone-1.6.0.pom
Downloading: https://repository.apache.org/content/repositories/snapshots/org/apache/openwebbeans/arquillian/owb-arquillian-standalone/1.6.0/owb-arquillian-standalone-1.6.0.pom
Downloading: http://repo.maven.apache.org/maven2/org/apache/openwebbeans/arquillian/owb-arquillian-standalone/1.6.0/owb-arquillian-standalone-1.6.0.pom
Downloaded: http://repo.maven.apache.org/maven2/org/apache/openwebbeans/arquillian/owb-arquillian-standalone/1.6.0/owb-arquillian-standalone-1.6.0.pom
(4 KB at 7.1 KB/sec)
Downloading: https://repository.apache.org/content/repositories/releases/org/apache/openwebbeans/arquillian/owb-arquillian-parent/1.6.0/owb-arquillian-parent-1.6.0.pom
Downloading: https://repository.apache.org/content/repositories/snapshots/org/apache/openwebbeans/arquillian/owb-arquillian-parent/1.6.0/owb-arquillian-parent-1.6.0.pom
Downloading: http://repo.maven.apache.org/maven2/org/apache/openwebbeans/arquillian/owb-arquillian-parent/1.6.0/owb-arquillian-parent-1.6.0.pom
Downloaded: http://repo.maven.apache.org/maven2/org/apache/openwebbeans/arquillian/owb-arquillian-parent/1.6.0/owb-arquillian-parent-1.6.0.pom
(4 KB at 18.4 KB/sec)
Downloading: https://repository.apache.org/content/repositories/releases/org/jboss/arquillian/arquillian-bom/1.1.2.Final/arquillian-bom-1.1.2.Final.pom
Downloading: https://repository.apache.org/content/repositories/snapshots/org/jboss/arquillian/arquillian-bom/1.1.2.Final/arquillian-bom-1.1.2.Final.pom
Downloading: http://repo.maven.apache.org/maven2/org/jboss/arquillian/arquillian-bom/1.1.2.Final/arquillian-bom-1.1.2.Final.pom
Downloaded: http://repo.maven.apache.org/maven2/org/jboss/arquillian/arquillian-bom/1.1.2.Final/arquillian-bom-1.1.2.Final.pom
(11 KB at 1151.2 KB/sec)
Downloading: https://repository.apache.org/content/repositories/releases/org/jboss/shrinkwrap/shrinkwrap-bom/1.1.2/shrinkwrap-bom-1.1.2.pom
Downloading: https://repository.apache.org/content/repositories/snapshots/org/jboss/shrinkwrap/shrinkwrap-bom/1.1.2/shrinkwrap-bom-1.1.2.pom
Downloading: http://repo.maven.apache.org/maven2/org/jboss/shrinkwrap/shrinkwrap-bom/1.1.2/shrinkwrap-bom-1.1.2.pom
Downloaded: http://repo.maven.apache.org/maven2/org/jboss/shrinkwrap/shrinkwrap-bom/1.1.2/shrinkwrap-bom-1.1.2.pom
(4 KB at 431.4 KB/sec)
Downloading: https://repository.apache.org/content/repositories/releases/org/jboss/shrinkwrap/descriptors/shrinkwrap-descriptors-bom/2.0.0-alpha-3/shrinkwrap-descriptors-bom-2.0.0-alpha-3.pom
Downloading: https://repository.apache.org/content/repositories/snapshots/org/jboss/shrinkwrap/descriptors/shrinkwrap-descriptors-bom/2.0.0-alpha-3/shrinkwrap-descriptors-bom-2.0.0-alpha-3.pom
Downloading: http://repo.maven.apache.org/maven2/org/jboss/shrinkwrap/descriptors/shrinkwrap-descriptors-bom/2.0.0-alpha-3/shrinkwrap-descriptors-bom-2.0.0-alpha-3.pom
Downloaded: http://repo.maven.apache.org/maven2/org/jboss/shrinkwrap/descriptors/shrinkwrap-descriptors-bom/2.0.0-alpha-3/shrinkwrap-descriptors-bom-2.0.0-alpha-3.pom
(5 KB at 472.4 KB/sec)
Downloading: https://repository.apache.org/content/repositories/releases/org/apache/bval/bval-jsr303/0.5/bval-jsr303-0.5.pom
Downloading: https://repository.apache.org/content/repositories/snapshots/org/apache/bval/bval-jsr303/0.5/bval-jsr303-0.5.pom
Downloading: http://repo.maven.apache.org/maven2/org/apache/bval/bval-jsr303/0.5/bval-jsr303-0.5.pom
Downloaded: http://repo.maven.apache.org/maven2/org/apache/bval/bval-jsr303/0.5/bval-jsr303-0.5.pom
(9 KB at 905.1 KB/sec)
Downloading: https://repository.apache.org/content/repositories/releases/org/apache/bval/bval-parent/0.5/bval-parent-0.5.pom
Downloading: https://repository.apache.org/content/repositories/snapshots/org/apache/bval/bval-parent/0.5/bval-parent-0.5.pom
Downloading: http://repo.maven.apache.org/maven2/org/apache/bval/bval-parent/0.5/bval-parent-0.5.pom
Downloaded: http://repo.maven.apache.org/maven2/org/apache/bval/bval-parent/0.5/bval-parent-0.5.pom
(25 KB at 2688.4 KB/sec)
Downloading: https://repository.apache.org/content/repositories/releases/org/apache/bval/bval-core/0.5/bval-core-0.5.pom
Downloading: https://repository.apache.org/content/repositories/snapshots/org/apache/bval/bval-core/0.5/bval-core-0.5.pom
Downloading: http://repo.maven.apache.org/maven2/org/apache/bval/bval-core/0.5/bval-core-0.5.pom
Downloaded: http://repo.maven.apache.org/maven2/org/apache/bval/bval-core/0.5/bval-core-0.5.pom
(6 KB at 739.7 KB/sec)
[INFO] ------------------------------------------------------------------------
[INFO] Reactor Summary:
[INFO] 
[INFO] Apache DeltaSpike ................................. SUCCESS [5.191s]
[INFO] Apache DeltaSpike Sources ......................... SUCCESS [2.878s]
[INFO] Apache DeltaSpike CheckStyle-rules ................ SUCCESS [2.831s]
[INFO] Apache DeltaSpike Parent .......................... SUCCESS [4.597s]
[INFO] Apache DeltaSpike Test-Utils ...................... SUCCESS [5.297s]
[INFO] Apache DeltaSpike Code Parent ..................... FAILURE [21:09.088s]
[INFO] Apache DeltaSpike Core ............................ SKIPPED
[INFO] Apache DeltaSpike Core-API ........................ SKIPPED
[INFO] Apache DeltaSpike Core-Implementation ............. SKIPPED
[INFO] Apache DeltaSpike ContainerControl parent ......... SKIPPED
[INFO] Apache DeltaSpike CDI ContainerControl API ........ SKIPPED
[INFO] Apache DeltaSpike CDI ContainerControl TCK ........ SKIPPED
[INFO] Apache DeltaSpike CDI OWB-ContainerControl ........ SKIPPED
[INFO] Apache DeltaSpike CDI Servlet-ContainerControl .... SKIPPED
[INFO] Apache DeltaSpike Modules ......................... SKIPPED
[INFO] Apache DeltaSpike Proxy-Module .................... SKIPPED
[INFO] Apache DeltaSpike Proxy-Module API ................ SKIPPED
[INFO] Apache DeltaSpike Proxy-Module Impl ASM5 .......... SKIPPED
[INFO] Apache DeltaSpike Security-Module ................. SKIPPED
[INFO] Apache DeltaSpike Security-Module API ............. SKIPPED
[INFO] Apache DeltaSpike Security-Module Impl ............ SKIPPED
[INFO] Apache DeltaSpike JPA-Module ...................... SKIPPED
[INFO] Apache DeltaSpike JPA-Module API .................. SKIPPED
[INFO] Apache DeltaSpike JPA-Module Impl ................. SKIPPED
[INFO] Apache DeltaSpike Servlet-Module .................. SKIPPED
[INFO] Apache DeltaSpike Servlet-Module API .............. SKIPPED
[INFO] Apache DeltaSpike Servlet-Module Impl ............. SKIPPED
[INFO] Apache DeltaSpike JSF-Module ...................... SKIPPED
[INFO] Apache DeltaSpike JSF-Module API .................. SKIPPED
[INFO] Apache DeltaSpike JSF-Module Impl ................. SKIPPED
[INFO] Apache DeltaSpike JSF-Module Impl (EE6 only) ...... SKIPPED
[INFO] Apache DeltaSpike Partial-Bean-Module ............. SKIPPED
[INFO] Apache DeltaSpike Partial-Bean-Module API ......... SKIPPED
[INFO] Apache DeltaSpike Partial-Bean-Module Impl ........ SKIPPED
[INFO] Apache DeltaSpike BeanValidation-Module ........... SKIPPED
[INFO] Apache DeltaSpike BeanValidation-Module API ....... SKIPPED
[INFO] Apache DeltaSpike BeanValidation-Module Impl ...... SKIPPED
[INFO] Apache DeltaSpike Data-Module ..................... SKIPPED
[INFO] Apache DeltaSpike Data-Module API ................. SKIPPED
[INFO] Apache DeltaSpike Data-Module Impl ................ SKIPPED
[INFO] Apache DeltaSpike Scheduler-Module ................ SKIPPED
[INFO] Apache DeltaSpike Scheduler-Module API ............ SKIPPED
[INFO] Apache DeltaSpike Scheduler-Module Impl ........... SKIPPED
[INFO] Apache DeltaSpike Test-Control-Module ............. SKIPPED
[INFO] Apache DeltaSpike Test-Control-Module API ......... SKIPPED
[INFO] Apache DeltaSpike Test-Control-Module Impl ........ SKIPPED
[INFO] Apache DeltaSpike Examples ........................ SKIPPED
[INFO] Apache DeltaSpike Java-SE Examples ................ SKIPPED
[INFO] Apache DeltaSpike JSF Examples .................... SKIPPED
[INFO] Apache DeltaSpike JSF Playground .................. SKIPPED
[INFO] Apache DeltaSpike Security Example CDI ............ SKIPPED
[INFO] Apache DeltaSpike Security Example PicketLink ..... SKIPPED
[INFO] Apache DeltaSpike Java-SE Scheduler Examples ...... SKIPPED
[INFO] Apache DeltaSpike Documentation ................... SKIPPED
[INFO] Apache DeltaSpike Site ............................ SKIPPED
[INFO] ------------------------------------------------------------------------
[INFO] BUILD FAILURE
[INFO] ------------------------------------------------------------------------
[INFO] Total time: 21:39.889s
[INFO] Finished at: Tue May 17 12:17:32 UTC 2016
[INFO] Final Memory: 51M/714M
[INFO] ------------------------------------------------------------------------
[WARNING] The requested profile "OpenEJB-TomEE" could not be activated because it does not
exist.
Waiting for Jenkins to finish collecting data[ERROR] Failed to execute goal on project parent-code:
Could not resolve dependencies for project org.apache.deltaspike:parent-code:pom:1.6.2-SNAPSHOT:
Failed to collect dependencies for [org.apache.deltaspike.test:test-utils:jar:1.6.2-SNAPSHOT
(test), org.apache.geronimo.specs:geronimo-atinject_1.0_spec:jar:1.0 (provided), org.apache.geronimo.specs:geronimo-jcdi_1.1_spec:jar:1.0-alpha-1
(provided), org.apache.geronimo.specs:geronimo-interceptor_1.2_spec:jar:1.0-alpha-1 (provided),
org.apache.geronimo.specs:geronimo-annotation_1.2_spec:jar:1.0.MR2-SNAPSHOT (provided), org.apache.geronimo.specs:geronimo-el_2.2_spec:jar:1.0.2
(provided), org.apache.openwebbeans:openwebbeans-impl:jar:1.6.0 (test), org.apache.openwebbeans:openwebbeans-spi:jar:1.6.0
(test), org.apache.openwebbeans:openwebbeans-resource:jar:1.6.0 (test), org.apache.openwebbeans.arquillian:owb-arquillian-standalone:jar:1.6.0
(test), org.apache.bval:bval-jsr303:jar:0.5 (test), junit:junit:jar:4.10 (test), org.jboss.arquillian.junit:arquillian-junit-container:jar:1.1.8.Final
(test)]: Failed to read artifact descriptor for org.apache.geronimo.specs:geronimo-annotation_1.2_spec:jar:1.0.MR2-SNAPSHOT:
Could not transfer artifact org.apache.geronimo.specs:geronimo-annotation_1.2_spec:pom:1.0.MR2-SNAPSHOT
from/to Apache Repository (https://repository.apache.org/content/repositories/releases): Failed
to transfer file: https://repository.apache.org/content/repositories/releases/org/apache/geronimo/specs/geronimo-annotation_1.2_spec/1.0.MR2-SNAPSHOT/geronimo-annotation_1.2_spec-1.0.MR2-SNAPSHOT.pom.
Return code is: 503, ReasonPhrase:Service Unavailable. -> [Help 1]
[ERROR] 
[ERROR] To see the full stack trace of the errors, re-run Maven with the -e switch.
[ERROR] Re-run Maven using the -X switch to enable full debug logging.
[ERROR] 
[ERROR] For more information about the errors and possible solutions, please read the following
articles:
[ERROR] [Help 1] http://cwiki.apache.org/confluence/display/MAVEN/DependencyResolutionException
[ERROR] 
[ERROR] After correcting the problems, you can resume the build with the command
[ERROR]   mvn <goals> -rf :parent-code

[JENKINS] Archiving <https://builds.apache.org/job/DeltaSpike%20OWB%201.6.0/ws/deltaspike/examples/jse-examples/pom.xml>
to org.apache.deltaspike.examples/deltaspike-jse-example/1.6.2-SNAPSHOT/deltaspike-jse-example-1.6.2-SNAPSHOT.pom
[JENKINS] Archiving <https://builds.apache.org/job/DeltaSpike%20OWB%201.6.0/ws/deltaspike/examples/security-requested-page-after-login-cdi/pom.xml>
to org.apache.deltaspike.examples/deltaspike-security-requested-page-after-login-cdi/1.6.2-SNAPSHOT/deltaspike-security-requested-page-after-login-cdi-1.6.2-SNAPSHOT.pom
[JENKINS] Archiving <https://builds.apache.org/job/DeltaSpike%20OWB%201.6.0/ws/deltaspike/test-utils/pom.xml>
to org.apache.deltaspike.test/test-utils/1.6.2-SNAPSHOT/test-utils-1.6.2-SNAPSHOT.pom
[JENKINS] Archiving <https://builds.apache.org/job/DeltaSpike%20OWB%201.6.0/ws/deltaspike/test-utils/target/test-utils-1.6.2-SNAPSHOT.jar>
to org.apache.deltaspike.test/test-utils/1.6.2-SNAPSHOT/test-utils-1.6.2-SNAPSHOT.jar
[JENKINS] Archiving <https://builds.apache.org/job/DeltaSpike%20OWB%201.6.0/ws/deltaspike/test-utils/target/test-utils-1.6.2-SNAPSHOT-sources.jar>
to org.apache.deltaspike.test/test-utils/1.6.2-SNAPSHOT/test-utils-1.6.2-SNAPSHOT-sources.jar
[JENKINS] Archiving <https://builds.apache.org/job/DeltaSpike%20OWB%201.6.0/ws/documentation/pom.xml>
to org.apache.deltaspike/deltaspike-documentation/1.6.2-SNAPSHOT/deltaspike-documentation-1.6.2-SNAPSHOT.pom
[JENKINS] Archiving <https://builds.apache.org/job/DeltaSpike%20OWB%201.6.0/ws/deltaspike/modules/data/impl/pom.xml>
to org.apache.deltaspike.modules/deltaspike-data-module-impl/1.6.2-SNAPSHOT/deltaspike-data-module-impl-1.6.2-SNAPSHOT.pom
[JENKINS] Archiving <https://builds.apache.org/job/DeltaSpike%20OWB%201.6.0/ws/deltaspike/modules/data/api/pom.xml>
to org.apache.deltaspike.modules/deltaspike-data-module-api/1.6.2-SNAPSHOT/deltaspike-data-module-api-1.6.2-SNAPSHOT.pom
[JENKINS] Archiving <https://builds.apache.org/job/DeltaSpike%20OWB%201.6.0/ws/deltaspike/core/impl/pom.xml>
to org.apache.deltaspike.core/deltaspike-core-impl/1.6.2-SNAPSHOT/deltaspike-core-impl-1.6.2-SNAPSHOT.pom
[JENKINS] Archiving <https://builds.apache.org/job/DeltaSpike%20OWB%201.6.0/ws/deltaspike/modules/pom.xml>
to org.apache.deltaspike.modules/modules-project/1.6.2-SNAPSHOT/modules-project-1.6.2-SNAPSHOT.pom
[JENKINS] Archiving <https://builds.apache.org/job/DeltaSpike%20OWB%201.6.0/ws/deltaspike/modules/test-control/pom.xml>
to org.apache.deltaspike.modules/test-control-module-project/1.6.2-SNAPSHOT/test-control-module-project-1.6.2-SNAPSHOT.pom
[JENKINS] Archiving <https://builds.apache.org/job/DeltaSpike%20OWB%201.6.0/ws/deltaspike/examples/jsf-examples/pom.xml>
to org.apache.deltaspike.examples/deltaspike-jsf-example/1.6.2-SNAPSHOT/deltaspike-jsf-example-1.6.2-SNAPSHOT.pom
[JENKINS] Archiving <https://builds.apache.org/job/DeltaSpike%20OWB%201.6.0/ws/deltaspike/cdictrl/servlet/pom.xml>
to org.apache.deltaspike.cdictrl/deltaspike-cdictrl-servlet/1.6.2-SNAPSHOT/deltaspike-cdictrl-servlet-1.6.2-SNAPSHOT.pom
[JENKINS] Archiving <https://builds.apache.org/job/DeltaSpike%20OWB%201.6.0/ws/deltaspike/cdictrl/api/pom.xml>
to org.apache.deltaspike.cdictrl/deltaspike-cdictrl-api/1.6.2-SNAPSHOT/deltaspike-cdictrl-api-1.6.2-SNAPSHOT.pom
[JENKINS] Archiving <https://builds.apache.org/job/DeltaSpike%20OWB%201.6.0/ws/deltaspike/examples/scheduler-playground/pom.xml>
to org.apache.deltaspike.examples/deltaspike-scheduler-example/1.6.2-SNAPSHOT/deltaspike-scheduler-example-1.6.2-SNAPSHOT.pom
[JENKINS] Archiving <https://builds.apache.org/job/DeltaSpike%20OWB%201.6.0/ws/deltaspike/checkstyle-rules/pom.xml>
to org.apache.deltaspike/checkstyle-rules/1.6.2-SNAPSHOT/checkstyle-rules-1.6.2-SNAPSHOT.pom
[JENKINS] Archiving <https://builds.apache.org/job/DeltaSpike%20OWB%201.6.0/ws/deltaspike/checkstyle-rules/target/checkstyle-rules-1.6.2-SNAPSHOT.jar>
to org.apache.deltaspike/checkstyle-rules/1.6.2-SNAPSHOT/checkstyle-rules-1.6.2-SNAPSHOT.jar
[JENKINS] Archiving <https://builds.apache.org/job/DeltaSpike%20OWB%201.6.0/ws/deltaspike/parent/code/pom.xml>
to org.apache.deltaspike/parent-code/1.6.2-SNAPSHOT/parent-code-1.6.2-SNAPSHOT.pom
Compressed 80.72 KB of artifacts by 39.6% relative to #239
[JENKINS] Archiving <https://builds.apache.org/job/DeltaSpike%20OWB%201.6.0/ws/deltaspike/modules/jsf/impl/pom.xml>
to org.apache.deltaspike.modules/deltaspike-jsf-module-impl/1.6.2-SNAPSHOT/deltaspike-jsf-module-impl-1.6.2-SNAPSHOT.pom
[JENKINS] Archiving <https://builds.apache.org/job/DeltaSpike%20OWB%201.6.0/ws/deltaspike/modules/partial-bean/pom.xml>
to org.apache.deltaspike.modules/partial-bean-module-project/1.6.2-SNAPSHOT/partial-bean-module-project-1.6.2-SNAPSHOT.pom
[JENKINS] Archiving <https://builds.apache.org/job/DeltaSpike%20OWB%201.6.0/ws/deltaspike/examples/pom.xml>
to org.apache.deltaspike.examples/examples-project/1.6.2-SNAPSHOT/examples-project-1.6.2-SNAPSHOT.pom
[JENKINS] Archiving <https://builds.apache.org/job/DeltaSpike%20OWB%201.6.0/ws/deltaspike/modules/jsf/pom.xml>
to org.apache.deltaspike.modules/jsf-module-project/1.6.2-SNAPSHOT/jsf-module-project-1.6.2-SNAPSHOT.pom
[JENKINS] Archiving <https://builds.apache.org/job/DeltaSpike%20OWB%201.6.0/ws/deltaspike/cdictrl/tck/pom.xml>
to org.apache.deltaspike.test/deltaspike-cdictrl-tck/1.6.2-SNAPSHOT/deltaspike-cdictrl-tck-1.6.2-SNAPSHOT.pom
[JENKINS] Archiving <https://builds.apache.org/job/DeltaSpike%20OWB%201.6.0/ws/deltaspike/modules/jsf/api/pom.xml>
to org.apache.deltaspike.modules/deltaspike-jsf-module-api/1.6.2-SNAPSHOT/deltaspike-jsf-module-api-1.6.2-SNAPSHOT.pom
[JENKINS] Archiving <https://builds.apache.org/job/DeltaSpike%20OWB%201.6.0/ws/deltaspike/modules/security/pom.xml>
to org.apache.deltaspike.modules/security-module-project/1.6.2-SNAPSHOT/security-module-project-1.6.2-SNAPSHOT.pom
[JENKINS] Archiving <https://builds.apache.org/job/DeltaSpike%20OWB%201.6.0/ws/deltaspike/modules/bean-validation/pom.xml>
to org.apache.deltaspike.modules/bean-validation-module-project/1.6.2-SNAPSHOT/bean-validation-module-project-1.6.2-SNAPSHOT.pom
[JENKINS] Archiving <https://builds.apache.org/job/DeltaSpike%20OWB%201.6.0/ws/deltaspike/modules/partial-bean/impl/pom.xml>
to org.apache.deltaspike.modules/deltaspike-partial-bean-module-impl/1.6.2-SNAPSHOT/deltaspike-partial-bean-module-impl-1.6.2-SNAPSHOT.pom
[JENKINS] Archiving <https://builds.apache.org/job/DeltaSpike%20OWB%201.6.0/ws/deltaspike/modules/proxy/api/pom.xml>
to org.apache.deltaspike.modules/deltaspike-proxy-module-api/1.6.2-SNAPSHOT/deltaspike-proxy-module-api-1.6.2-SNAPSHOT.pom
[JENKINS] Archiving <https://builds.apache.org/job/DeltaSpike%20OWB%201.6.0/ws/deltaspike/modules/jpa/api/pom.xml>
to org.apache.deltaspike.modules/deltaspike-jpa-module-api/1.6.2-SNAPSHOT/deltaspike-jpa-module-api-1.6.2-SNAPSHOT.pom
[JENKINS] Archiving <https://builds.apache.org/job/DeltaSpike%20OWB%201.6.0/ws/deltaspike/modules/servlet/api/pom.xml>
to org.apache.deltaspike.modules/deltaspike-servlet-module-api/1.6.2-SNAPSHOT/deltaspike-servlet-module-api-1.6.2-SNAPSHOT.pom
[JENKINS] Archiving <https://builds.apache.org/job/DeltaSpike%20OWB%201.6.0/ws/deltaspike/modules/jpa/pom.xml>
to org.apache.deltaspike.modules/jpa-module-project/1.6.2-SNAPSHOT/jpa-module-project-1.6.2-SNAPSHOT.pom
[JENKINS] Archiving <https://builds.apache.org/job/DeltaSpike%20OWB%201.6.0/ws/deltaspike/cdictrl/pom.xml>
to org.apache.deltaspike.cdictrl/cdictrl-project/1.6.2-SNAPSHOT/cdictrl-project-1.6.2-SNAPSHOT.pom
[JENKINS] Archiving <https://builds.apache.org/job/DeltaSpike%20OWB%201.6.0/ws/deltaspike/modules/scheduler/api/pom.xml>
to org.apache.deltaspike.modules/deltaspike-scheduler-module-api/1.6.2-SNAPSHOT/deltaspike-scheduler-module-api-1.6.2-SNAPSHOT.pom
[JENKINS] Archiving <https://builds.apache.org/job/DeltaSpike%20OWB%201.6.0/ws/deltaspike/modules/test-control/impl/pom.xml>
to org.apache.deltaspike.modules/deltaspike-test-control-module-impl/1.6.2-SNAPSHOT/deltaspike-test-control-module-impl-1.6.2-SNAPSHOT.pom
[JENKINS] Archiving <https://builds.apache.org/job/DeltaSpike%20OWB%201.6.0/ws/deltaspike/modules/servlet/pom.xml>
to org.apache.deltaspike.modules/servlet-module-project/1.6.2-SNAPSHOT/servlet-module-project-1.6.2-SNAPSHOT.pom
[JENKINS] Archiving <https://builds.apache.org/job/DeltaSpike%20OWB%201.6.0/ws/deltaspike/modules/test-control/api/pom.xml>
to org.apache.deltaspike.modules/deltaspike-test-control-module-api/1.6.2-SNAPSHOT/deltaspike-test-control-module-api-1.6.2-SNAPSHOT.pom
[JENKINS] Archiving <https://builds.apache.org/job/DeltaSpike%20OWB%201.6.0/ws/deltaspike/modules/jsf/impl-ee6/pom.xml>
to org.apache.deltaspike.modules/deltaspike-jsf-module-impl-ee6/1.6.2-SNAPSHOT/deltaspike-jsf-module-impl-ee6-1.6.2-SNAPSHOT.pom
[JENKINS] Archiving <https://builds.apache.org/job/DeltaSpike%20OWB%201.6.0/ws/deltaspike/modules/proxy/pom.xml>
to org.apache.deltaspike.modules/proxy-module-project/1.6.2-SNAPSHOT/proxy-module-project-1.6.2-SNAPSHOT.pom
[JENKINS] Archiving <https://builds.apache.org/job/DeltaSpike%20OWB%201.6.0/ws/deltaspike/modules/partial-bean/api/pom.xml>
to org.apache.deltaspike.modules/deltaspike-partial-bean-module-api/1.6.2-SNAPSHOT/deltaspike-partial-bean-module-api-1.6.2-SNAPSHOT.pom
[JENKINS] Archiving <https://builds.apache.org/job/DeltaSpike%20OWB%201.6.0/ws/deltaspike/modules/scheduler/impl/pom.xml>
to org.apache.deltaspike.modules/deltaspike-scheduler-module-impl/1.6.2-SNAPSHOT/deltaspike-scheduler-module-impl-1.6.2-SNAPSHOT.pom
[JENKINS] Archiving <https://builds.apache.org/job/DeltaSpike%20OWB%201.6.0/ws/deltaspike/parent/pom.xml>
to org.apache.deltaspike/parent/1.6.2-SNAPSHOT/parent-1.6.2-SNAPSHOT.pom
Compressed 40.15 KB of artifacts by 79.7% relative to #239
[JENKINS] Archiving <https://builds.apache.org/job/DeltaSpike%20OWB%201.6.0/ws/deltaspike/core/pom.xml>
to org.apache.deltaspike.core/core-project/1.6.2-SNAPSHOT/core-project-1.6.2-SNAPSHOT.pom
[JENKINS] Archiving <https://builds.apache.org/job/DeltaSpike%20OWB%201.6.0/ws/deltaspike/modules/bean-validation/api/pom.xml>
to org.apache.deltaspike.modules/deltaspike-bean-validation-module-api/1.6.2-SNAPSHOT/deltaspike-bean-validation-module-api-1.6.2-SNAPSHOT.pom
[JENKINS] Archiving <https://builds.apache.org/job/DeltaSpike%20OWB%201.6.0/ws/deltaspike/core/api/pom.xml>
to org.apache.deltaspike.core/deltaspike-core-api/1.6.2-SNAPSHOT/deltaspike-core-api-1.6.2-SNAPSHOT.pom
[JENKINS] Archiving <https://builds.apache.org/job/DeltaSpike%20OWB%201.6.0/ws/deltaspike/modules/security/impl/pom.xml>
to org.apache.deltaspike.modules/deltaspike-security-module-impl/1.6.2-SNAPSHOT/deltaspike-security-module-impl-1.6.2-SNAPSHOT.pom
[JENKINS] Archiving <https://builds.apache.org/job/DeltaSpike%20OWB%201.6.0/ws/deltaspike/modules/scheduler/pom.xml>
to org.apache.deltaspike.modules/scheduler-module-project/1.6.2-SNAPSHOT/scheduler-module-project-1.6.2-SNAPSHOT.pom
[JENKINS] Archiving <https://builds.apache.org/job/DeltaSpike%20OWB%201.6.0/ws/site/pom.xml>
to org.apache.deltaspike/deltaspike-site/1.6.2-SNAPSHOT/deltaspike-site-1.6.2-SNAPSHOT.pom
[JENKINS] Archiving <https://builds.apache.org/job/DeltaSpike%20OWB%201.6.0/ws/deltaspike/modules/proxy/impl-asm5/pom.xml>
to org.apache.deltaspike.modules/deltaspike-proxy-module-impl-asm5/1.6.2-SNAPSHOT/deltaspike-proxy-module-impl-asm5-1.6.2-SNAPSHOT.pom
[JENKINS] Archiving <https://builds.apache.org/job/DeltaSpike%20OWB%201.6.0/ws/deltaspike/examples/jsf-playground/pom.xml>
to org.apache.deltaspike.examples/deltaspike-jsf-playground/1.6.2-SNAPSHOT/deltaspike-jsf-playground-1.6.2-SNAPSHOT.pom
[JENKINS] Archiving <https://builds.apache.org/job/DeltaSpike%20OWB%201.6.0/ws/deltaspike/modules/servlet/impl/pom.xml>
to org.apache.deltaspike.modules/deltaspike-servlet-module-impl/1.6.2-SNAPSHOT/deltaspike-servlet-module-impl-1.6.2-SNAPSHOT.pom
[JENKINS] Archiving <https://builds.apache.org/job/DeltaSpike%20OWB%201.6.0/ws/deltaspike/modules/bean-validation/impl/pom.xml>
to org.apache.deltaspike.modules/deltaspike-bean-validation-module-impl/1.6.2-SNAPSHOT/deltaspike-bean-validation-module-impl-1.6.2-SNAPSHOT.pom
[JENKINS] Archiving <https://builds.apache.org/job/DeltaSpike%20OWB%201.6.0/ws/deltaspike/cdictrl/impl-owb/pom.xml>
to org.apache.deltaspike.cdictrl/deltaspike-cdictrl-owb/1.6.2-SNAPSHOT/deltaspike-cdictrl-owb-1.6.2-SNAPSHOT.pom
[JENKINS] Archiving <https://builds.apache.org/job/DeltaSpike%20OWB%201.6.0/ws/pom.xml>
to org.apache.deltaspike/deltaspike/1.6.2-SNAPSHOT/deltaspike-1.6.2-SNAPSHOT.pom
[JENKINS] Archiving <https://builds.apache.org/job/DeltaSpike%20OWB%201.6.0/ws/deltaspike/modules/jpa/impl/pom.xml>
to org.apache.deltaspike.modules/deltaspike-jpa-module-impl/1.6.2-SNAPSHOT/deltaspike-jpa-module-impl-1.6.2-SNAPSHOT.pom
[JENKINS] Archiving <https://builds.apache.org/job/DeltaSpike%20OWB%201.6.0/ws/deltaspike/modules/data/pom.xml>
to org.apache.deltaspike.modules/data-module-project/1.6.2-SNAPSHOT/data-module-project-1.6.2-SNAPSHOT.pom
[JENKINS] Archiving <https://builds.apache.org/job/DeltaSpike%20OWB%201.6.0/ws/deltaspike/examples/security-requested-page-after-login-picketlink/pom.xml>
to org.apache.deltaspike.examples/deltaspike-security-requested-page-after-login-picketlink/1.6.2-SNAPSHOT/deltaspike-security-requested-page-after-login-picketlink-1.6.2-SNAPSHOT.pom
[JENKINS] Archiving <https://builds.apache.org/job/DeltaSpike%20OWB%201.6.0/ws/deltaspike/pom.xml>
to org.apache.deltaspike/deltaspike-project/1.6.2-SNAPSHOT/deltaspike-project-1.6.2-SNAPSHOT.pom
[JENKINS] Archiving <https://builds.apache.org/job/DeltaSpike%20OWB%201.6.0/ws/deltaspike/modules/security/api/pom.xml>
to org.apache.deltaspike.modules/deltaspike-security-module-api/1.6.2-SNAPSHOT/deltaspike-security-module-api-1.6.2-SNAPSHOT.pom
Sending e-mails to: commits@deltaspike.apache.org
channel stopped

Mime
View raw message