deltaspike-commits mailing list archives

Site index · List index
Message view « Date » · « Thread »
Top « Date » · « Thread »
From Apache Jenkins Server <jenk...@builds.apache.org>
Subject Build failed in Jenkins: DeltaSpike Weld 1.1.13 » Apache DeltaSpike Data-Module Impl #805
Date Fri, 06 May 2016 08:05:39 GMT
See <https://builds.apache.org/job/DeltaSpike%20Weld%201.1.13/org.apache.deltaspike.modules$deltaspike-data-module-impl/805/>

------------------------------------------
[...truncated 268 lines...]
[INFO] javac option: <https://builds.apache.org/job/DeltaSpike%20Weld%201.1.13/org.apache.deltaspike.modules$deltaspike-data-module-impl/ws/target/test-classes>
[INFO] javac option: -s
[INFO] javac option: <https://builds.apache.org/job/DeltaSpike%20Weld%201.1.13/org.apache.deltaspike.modules$deltaspike-data-module-impl/ws/target/generated-sources/apt-test>
[ERROR] JVM is not suitable for processing annotation! ToolProvider.getSystemJavaCompiler()
is null.
[INFO] 
[INFO] --- maven-resources-plugin:2.7:testResources (default-testResources) @ deltaspike-data-module-impl
---
[INFO] Using 'UTF-8' encoding to copy filtered resources.
[INFO] Copying 6 resources
[INFO] Copying 3 resources
[INFO] 
[INFO] --- maven-compiler-plugin:2.5:testCompile (default-testCompile) @ deltaspike-data-module-impl
---
[INFO] Compiling 93 source files to <https://builds.apache.org/job/DeltaSpike%20Weld%201.1.13/org.apache.deltaspike.modules$deltaspike-data-module-impl/ws/target/test-classes>
[INFO] -------------------------------------------------------------
[ERROR] COMPILATION ERROR : 
[INFO] -------------------------------------------------------------
[ERROR] <https://builds.apache.org/job/DeltaSpike%20Weld%201.1.13/org.apache.deltaspike.modules$deltaspike-data-module-impl/ws/src/test/java/org/apache/deltaspike/data/test/service/FullRepositoryAbstract.java>:[24,45]
cannot find symbol
symbol  : class Simple_
location: package org.apache.deltaspike.data.test.domain
[ERROR] <https://builds.apache.org/job/DeltaSpike%20Weld%201.1.13/org.apache.deltaspike.modules$deltaspike-data-module-impl/ws/src/test/java/org/apache/deltaspike/data/test/service/SimpleCriteriaRepository.java>:[28,45]
cannot find symbol
symbol  : class Simple_
location: package org.apache.deltaspike.data.test.domain
[ERROR] <https://builds.apache.org/job/DeltaSpike%20Weld%201.1.13/org.apache.deltaspike.modules$deltaspike-data-module-impl/ws/src/test/java/org/apache/deltaspike/data/test/service/SimpleCriteriaRepository.java>:[29,45]
cannot find symbol
symbol  : class SuperSimple_
location: package org.apache.deltaspike.data.test.domain
[ERROR] <https://builds.apache.org/job/DeltaSpike%20Weld%201.1.13/org.apache.deltaspike.modules$deltaspike-data-module-impl/ws/src/test/java/org/apache/deltaspike/data/test/service/ParentRepository.java>:[29,45]
cannot find symbol
symbol  : class OneToMany_
location: package org.apache.deltaspike.data.test.domain
[ERROR] <https://builds.apache.org/job/DeltaSpike%20Weld%201.1.13/org.apache.deltaspike.modules$deltaspike-data-module-impl/ws/src/test/java/org/apache/deltaspike/data/test/service/ParentRepository.java>:[31,45]
cannot find symbol
symbol  : class OneToOne_
location: package org.apache.deltaspike.data.test.domain
[ERROR] <https://builds.apache.org/job/DeltaSpike%20Weld%201.1.13/org.apache.deltaspike.modules$deltaspike-data-module-impl/ws/src/test/java/org/apache/deltaspike/data/test/service/ParentRepository.java>:[33,45]
cannot find symbol
symbol  : class Parent_
location: package org.apache.deltaspike.data.test.domain
[ERROR] <https://builds.apache.org/job/DeltaSpike%20Weld%201.1.13/org.apache.deltaspike.modules$deltaspike-data-module-impl/ws/src/test/java/org/apache/deltaspike/data/impl/mapping/MappedRepositoryTest.java>:[35,45]
cannot find symbol
symbol  : class Simple_
location: package org.apache.deltaspike.data.test.domain
[ERROR] <https://builds.apache.org/job/DeltaSpike%20Weld%201.1.13/org.apache.deltaspike.modules$deltaspike-data-module-impl/ws/src/test/java/org/apache/deltaspike/data/impl/handler/EntityRepositoryHandlerTest.java>:[25,45]
cannot find symbol
symbol  : class Simple_
location: package org.apache.deltaspike.data.test.domain
[ERROR] <https://builds.apache.org/job/DeltaSpike%20Weld%201.1.13/org.apache.deltaspike.modules$deltaspike-data-module-impl/ws/src/test/java/org/apache/deltaspike/data/test/service/FullRepositoryAbstract.java>:[42,29]
cannot find symbol
symbol  : variable Simple_
location: class org.apache.deltaspike.data.test.service.FullRepositoryAbstract
[ERROR] <https://builds.apache.org/job/DeltaSpike%20Weld%201.1.13/org.apache.deltaspike.modules$deltaspike-data-module-impl/ws/src/test/java/org/apache/deltaspike/data/impl/QueryResultTest.java>:[82,26]
cannot find symbol
symbol  : variable Simple_
location: class org.apache.deltaspike.data.impl.QueryResultTest
[ERROR] <https://builds.apache.org/job/DeltaSpike%20Weld%201.1.13/org.apache.deltaspike.modules$deltaspike-data-module-impl/ws/src/test/java/org/apache/deltaspike/data/impl/QueryResultTest.java>:[81,27]
cannot find symbol
symbol  : variable Simple_
location: class org.apache.deltaspike.data.impl.QueryResultTest
[ERROR] <https://builds.apache.org/job/DeltaSpike%20Weld%201.1.13/org.apache.deltaspike.modules$deltaspike-data-module-impl/ws/src/test/java/org/apache/deltaspike/data/impl/QueryResultTest.java>:[119,29]
cannot find symbol
symbol  : variable Simple_
location: class org.apache.deltaspike.data.impl.QueryResultTest
[ERROR] <https://builds.apache.org/job/DeltaSpike%20Weld%201.1.13/org.apache.deltaspike.modules$deltaspike-data-module-impl/ws/src/test/java/org/apache/deltaspike/data/impl/QueryResultTest.java>:[122,29]
cannot find symbol
symbol  : variable Simple_
location: class org.apache.deltaspike.data.impl.QueryResultTest
[ERROR] <https://builds.apache.org/job/DeltaSpike%20Weld%201.1.13/org.apache.deltaspike.modules$deltaspike-data-module-impl/ws/src/test/java/org/apache/deltaspike/data/impl/QueryResultTest.java>:[142,29]
cannot find symbol
symbol  : variable Simple_
location: class org.apache.deltaspike.data.impl.QueryResultTest
[ERROR] <https://builds.apache.org/job/DeltaSpike%20Weld%201.1.13/org.apache.deltaspike.modules$deltaspike-data-module-impl/ws/src/test/java/org/apache/deltaspike/data/impl/QueryResultTest.java>:[179,27]
cannot find symbol
symbol  : variable Simple_
location: class org.apache.deltaspike.data.impl.QueryResultTest
[ERROR] <https://builds.apache.org/job/DeltaSpike%20Weld%201.1.13/org.apache.deltaspike.modules$deltaspike-data-module-impl/ws/src/test/java/org/apache/deltaspike/data/impl/QueryResultTest.java>:[240,27]
cannot find symbol
symbol  : variable Simple_
location: class org.apache.deltaspike.data.impl.QueryResultTest
[ERROR] <https://builds.apache.org/job/DeltaSpike%20Weld%201.1.13/org.apache.deltaspike.modules$deltaspike-data-module-impl/ws/src/test/java/org/apache/deltaspike/data/impl/QueryResultTest.java>:[396,26]
cannot find symbol
symbol  : variable Simple_
location: class org.apache.deltaspike.data.impl.QueryResultTest
[ERROR] <https://builds.apache.org/job/DeltaSpike%20Weld%201.1.13/org.apache.deltaspike.modules$deltaspike-data-module-impl/ws/src/test/java/org/apache/deltaspike/data/impl/QueryResultTest.java>:[395,27]
cannot find symbol
symbol  : variable Simple_
location: class org.apache.deltaspike.data.impl.QueryResultTest
[ERROR] <https://builds.apache.org/job/DeltaSpike%20Weld%201.1.13/org.apache.deltaspike.modules$deltaspike-data-module-impl/ws/src/test/java/org/apache/deltaspike/data/test/service/SimpleCriteriaRepository.java>:[44,25]
cannot find symbol
symbol  : variable Simple_
location: class org.apache.deltaspike.data.test.service.SimpleCriteriaRepository
[ERROR] <https://builds.apache.org/job/DeltaSpike%20Weld%201.1.13/org.apache.deltaspike.modules$deltaspike-data-module-impl/ws/src/test/java/org/apache/deltaspike/data/test/service/SimpleCriteriaRepository.java>:[43,20]
cannot find symbol
symbol  : variable Simple_
location: class org.apache.deltaspike.data.test.service.SimpleCriteriaRepository
[ERROR] <https://builds.apache.org/job/DeltaSpike%20Weld%201.1.13/org.apache.deltaspike.modules$deltaspike-data-module-impl/ws/src/test/java/org/apache/deltaspike/data/test/service/SimpleCriteriaRepository.java>:[42,20]
cannot find symbol
symbol  : variable Simple_
location: class org.apache.deltaspike.data.test.service.SimpleCriteriaRepository
[ERROR] <https://builds.apache.org/job/DeltaSpike%20Weld%201.1.13/org.apache.deltaspike.modules$deltaspike-data-module-impl/ws/src/test/java/org/apache/deltaspike/data/test/service/SimpleCriteriaRepository.java>:[54,49]
cannot find symbol
symbol  : variable Simple_
location: class org.apache.deltaspike.data.test.service.SimpleCriteriaRepository
[ERROR] <https://builds.apache.org/job/DeltaSpike%20Weld%201.1.13/org.apache.deltaspike.modules$deltaspike-data-module-impl/ws/src/test/java/org/apache/deltaspike/data/test/service/SimpleCriteriaRepository.java>:[53,46]
cannot find symbol
symbol  : variable Simple_
location: class org.apache.deltaspike.data.test.service.SimpleCriteriaRepository
[ERROR] <https://builds.apache.org/job/DeltaSpike%20Weld%201.1.13/org.apache.deltaspike.modules$deltaspike-data-module-impl/ws/src/test/java/org/apache/deltaspike/data/test/service/SimpleCriteriaRepository.java>:[57,51]
cannot find symbol
symbol  : variable Simple_
location: class org.apache.deltaspike.data.test.service.SimpleCriteriaRepository
[ERROR] <https://builds.apache.org/job/DeltaSpike%20Weld%201.1.13/org.apache.deltaspike.modules$deltaspike-data-module-impl/ws/src/test/java/org/apache/deltaspike/data/test/service/SimpleCriteriaRepository.java>:[56,48]
cannot find symbol
symbol  : variable Simple_
location: class org.apache.deltaspike.data.test.service.SimpleCriteriaRepository
[ERROR] <https://builds.apache.org/job/DeltaSpike%20Weld%201.1.13/org.apache.deltaspike.modules$deltaspike-data-module-impl/ws/src/test/java/org/apache/deltaspike/data/test/service/SimpleCriteriaRepository.java>:[65,20]
cannot find symbol
symbol  : variable Simple_
location: class org.apache.deltaspike.data.test.service.SimpleCriteriaRepository
[ERROR] <https://builds.apache.org/job/DeltaSpike%20Weld%201.1.13/org.apache.deltaspike.modules$deltaspike-data-module-impl/ws/src/test/java/org/apache/deltaspike/data/test/service/SimpleCriteriaRepository.java>:[72,20]
cannot find symbol
symbol  : variable Simple_
location: class org.apache.deltaspike.data.test.service.SimpleCriteriaRepository
[ERROR] <https://builds.apache.org/job/DeltaSpike%20Weld%201.1.13/org.apache.deltaspike.modules$deltaspike-data-module-impl/ws/src/test/java/org/apache/deltaspike/data/test/service/SimpleCriteriaRepository.java>:[80,20]
cannot find symbol
symbol  : variable Simple_
location: class org.apache.deltaspike.data.test.service.SimpleCriteriaRepository
[ERROR] <https://builds.apache.org/job/DeltaSpike%20Weld%201.1.13/org.apache.deltaspike.modules$deltaspike-data-module-impl/ws/src/test/java/org/apache/deltaspike/data/test/service/SimpleCriteriaRepository.java>:[79,20]
cannot find symbol
symbol  : variable Simple_
location: class org.apache.deltaspike.data.test.service.SimpleCriteriaRepository
[ERROR] <https://builds.apache.org/job/DeltaSpike%20Weld%201.1.13/org.apache.deltaspike.modules$deltaspike-data-module-impl/ws/src/test/java/org/apache/deltaspike/data/test/service/SimpleCriteriaRepository.java>:[87,20]
cannot find symbol
symbol  : variable SuperSimple_
location: class org.apache.deltaspike.data.test.service.SimpleCriteriaRepository
[ERROR] <https://builds.apache.org/job/DeltaSpike%20Weld%201.1.13/org.apache.deltaspike.modules$deltaspike-data-module-impl/ws/src/test/java/org/apache/deltaspike/data/test/service/SimpleCriteriaRepository.java>:[95,20]
cannot find symbol
symbol  : variable Simple_
location: class org.apache.deltaspike.data.test.service.SimpleCriteriaRepository
[ERROR] <https://builds.apache.org/job/DeltaSpike%20Weld%201.1.13/org.apache.deltaspike.modules$deltaspike-data-module-impl/ws/src/test/java/org/apache/deltaspike/data/test/service/SimpleCriteriaRepository.java>:[94,50]
cannot find symbol
symbol  : variable Simple_
location: class org.apache.deltaspike.data.test.service.SimpleCriteriaRepository
[ERROR] <https://builds.apache.org/job/DeltaSpike%20Weld%201.1.13/org.apache.deltaspike.modules$deltaspike-data-module-impl/ws/src/test/java/org/apache/deltaspike/data/test/service/SimpleCriteriaRepository.java>:[103,20]
cannot find symbol
symbol  : variable Simple_
location: class org.apache.deltaspike.data.test.service.SimpleCriteriaRepository
[ERROR] <https://builds.apache.org/job/DeltaSpike%20Weld%201.1.13/org.apache.deltaspike.modules$deltaspike-data-module-impl/ws/src/test/java/org/apache/deltaspike/data/test/service/SimpleCriteriaRepository.java>:[102,46]
cannot find symbol
symbol  : variable Simple_
location: class org.apache.deltaspike.data.test.service.SimpleCriteriaRepository
[ERROR] <https://builds.apache.org/job/DeltaSpike%20Weld%201.1.13/org.apache.deltaspike.modules$deltaspike-data-module-impl/ws/src/test/java/org/apache/deltaspike/data/test/service/SimpleCriteriaRepository.java>:[102,70]
cannot find symbol
symbol  : variable Simple_
location: class org.apache.deltaspike.data.test.service.SimpleCriteriaRepository
[ERROR] <https://builds.apache.org/job/DeltaSpike%20Weld%201.1.13/org.apache.deltaspike.modules$deltaspike-data-module-impl/ws/src/test/java/org/apache/deltaspike/data/test/service/SimpleCriteriaRepository.java>:[112,20]
cannot find symbol
symbol  : variable Simple_
location: class org.apache.deltaspike.data.test.service.SimpleCriteriaRepository
[ERROR] <https://builds.apache.org/job/DeltaSpike%20Weld%201.1.13/org.apache.deltaspike.modules$deltaspike-data-module-impl/ws/src/test/java/org/apache/deltaspike/data/test/service/SimpleCriteriaRepository.java>:[110,28]
cannot find symbol
symbol  : variable Simple_
location: class org.apache.deltaspike.data.test.service.SimpleCriteriaRepository
[ERROR] <https://builds.apache.org/job/DeltaSpike%20Weld%201.1.13/org.apache.deltaspike.modules$deltaspike-data-module-impl/ws/src/test/java/org/apache/deltaspike/data/test/service/SimpleCriteriaRepository.java>:[110,50]
cannot find symbol
symbol  : variable Simple_
location: class org.apache.deltaspike.data.test.service.SimpleCriteriaRepository
[ERROR] <https://builds.apache.org/job/DeltaSpike%20Weld%201.1.13/org.apache.deltaspike.modules$deltaspike-data-module-impl/ws/src/test/java/org/apache/deltaspike/data/test/service/SimpleCriteriaRepository.java>:[123,20]
cannot find symbol
symbol  : variable Simple_
location: class org.apache.deltaspike.data.test.service.SimpleCriteriaRepository
[ERROR] <https://builds.apache.org/job/DeltaSpike%20Weld%201.1.13/org.apache.deltaspike.modules$deltaspike-data-module-impl/ws/src/test/java/org/apache/deltaspike/data/test/service/SimpleCriteriaRepository.java>:[120,34]
cannot find symbol
symbol  : variable Simple_
location: class org.apache.deltaspike.data.test.service.SimpleCriteriaRepository
[ERROR] <https://builds.apache.org/job/DeltaSpike%20Weld%201.1.13/org.apache.deltaspike.modules$deltaspike-data-module-impl/ws/src/test/java/org/apache/deltaspike/data/test/service/SimpleCriteriaRepository.java>:[121,30]
cannot find symbol
symbol  : variable Simple_
location: class org.apache.deltaspike.data.test.service.SimpleCriteriaRepository
[ERROR] <https://builds.apache.org/job/DeltaSpike%20Weld%201.1.13/org.apache.deltaspike.modules$deltaspike-data-module-impl/ws/src/test/java/org/apache/deltaspike/data/test/service/SimpleCriteriaRepository.java>:[121,51]
cannot find symbol
symbol  : variable Simple_
location: class org.apache.deltaspike.data.test.service.SimpleCriteriaRepository
[ERROR] <https://builds.apache.org/job/DeltaSpike%20Weld%201.1.13/org.apache.deltaspike.modules$deltaspike-data-module-impl/ws/src/test/java/org/apache/deltaspike/data/test/service/SimpleCriteriaRepository.java>:[122,34]
cannot find symbol
symbol  : variable Simple_
location: class org.apache.deltaspike.data.test.service.SimpleCriteriaRepository
[ERROR] <https://builds.apache.org/job/DeltaSpike%20Weld%201.1.13/org.apache.deltaspike.modules$deltaspike-data-module-impl/ws/src/test/java/org/apache/deltaspike/data/test/service/SimpleCriteriaRepository.java>:[122,62]
cannot find symbol
symbol  : variable Simple_
location: class org.apache.deltaspike.data.test.service.SimpleCriteriaRepository
[ERROR] <https://builds.apache.org/job/DeltaSpike%20Weld%201.1.13/org.apache.deltaspike.modules$deltaspike-data-module-impl/ws/src/test/java/org/apache/deltaspike/data/test/service/SimpleCriteriaRepository.java>:[132,26]
cannot find symbol
symbol  : variable Simple_
location: class org.apache.deltaspike.data.test.service.SimpleCriteriaRepository
[ERROR] <https://builds.apache.org/job/DeltaSpike%20Weld%201.1.13/org.apache.deltaspike.modules$deltaspike-data-module-impl/ws/src/test/java/org/apache/deltaspike/data/test/service/SimpleCriteriaRepository.java>:[131,27]
cannot find symbol
symbol  : variable Simple_
location: class org.apache.deltaspike.data.test.service.SimpleCriteriaRepository
[ERROR] <https://builds.apache.org/job/DeltaSpike%20Weld%201.1.13/org.apache.deltaspike.modules$deltaspike-data-module-impl/ws/src/test/java/org/apache/deltaspike/data/test/service/SimpleCriteriaRepository.java>:[141,20]
cannot find symbol
symbol  : variable Simple_
location: class org.apache.deltaspike.data.test.service.SimpleCriteriaRepository
[ERROR] <https://builds.apache.org/job/DeltaSpike%20Weld%201.1.13/org.apache.deltaspike.modules$deltaspike-data-module-impl/ws/src/test/java/org/apache/deltaspike/data/test/service/SimpleCriteriaRepository.java>:[139,34]
cannot find symbol
symbol  : variable Simple_
location: class org.apache.deltaspike.data.test.service.SimpleCriteriaRepository
[ERROR] <https://builds.apache.org/job/DeltaSpike%20Weld%201.1.13/org.apache.deltaspike.modules$deltaspike-data-module-impl/ws/src/test/java/org/apache/deltaspike/data/test/service/SimpleCriteriaRepository.java>:[139,54]
cannot find symbol
symbol  : variable Simple_
location: class org.apache.deltaspike.data.test.service.SimpleCriteriaRepository
[ERROR] <https://builds.apache.org/job/DeltaSpike%20Weld%201.1.13/org.apache.deltaspike.modules$deltaspike-data-module-impl/ws/src/test/java/org/apache/deltaspike/data/test/service/SimpleCriteriaRepository.java>:[140,63]
cannot find symbol
symbol  : variable Simple_
location: class org.apache.deltaspike.data.test.service.SimpleCriteriaRepository
[ERROR] <https://builds.apache.org/job/DeltaSpike%20Weld%201.1.13/org.apache.deltaspike.modules$deltaspike-data-module-impl/ws/src/test/java/org/apache/deltaspike/data/test/service/ParentRepository.java>:[48,22]
cannot find symbol
symbol  : variable Parent_
location: class org.apache.deltaspike.data.test.service.ParentRepository
[ERROR] <https://builds.apache.org/job/DeltaSpike%20Weld%201.1.13/org.apache.deltaspike.modules$deltaspike-data-module-impl/ws/src/test/java/org/apache/deltaspike/data/test/service/ParentRepository.java>:[50,36]
cannot find symbol
symbol  : variable OneToMany_
location: class org.apache.deltaspike.data.test.service.ParentRepository
[ERROR] <https://builds.apache.org/job/DeltaSpike%20Weld%201.1.13/org.apache.deltaspike.modules$deltaspike-data-module-impl/ws/src/test/java/org/apache/deltaspike/data/test/service/ParentRepository.java>:[44,22]
cannot find symbol
symbol  : variable Parent_
location: class org.apache.deltaspike.data.test.service.ParentRepository
[ERROR] <https://builds.apache.org/job/DeltaSpike%20Weld%201.1.13/org.apache.deltaspike.modules$deltaspike-data-module-impl/ws/src/test/java/org/apache/deltaspike/data/test/service/ParentRepository.java>:[46,36]
cannot find symbol
symbol  : variable OneToOne_
location: class org.apache.deltaspike.data.test.service.ParentRepository
[ERROR] <https://builds.apache.org/job/DeltaSpike%20Weld%201.1.13/org.apache.deltaspike.modules$deltaspike-data-module-impl/ws/src/test/java/org/apache/deltaspike/data/test/service/ParentRepository.java>:[43,20]
cannot find symbol
symbol  : variable Parent_
location: class org.apache.deltaspike.data.test.service.ParentRepository
[ERROR] <https://builds.apache.org/job/DeltaSpike%20Weld%201.1.13/org.apache.deltaspike.modules$deltaspike-data-module-impl/ws/src/test/java/org/apache/deltaspike/data/test/service/ParentRepository.java>:[61,20]
cannot find symbol
symbol  : variable Parent_
location: class org.apache.deltaspike.data.test.service.ParentRepository
[ERROR] <https://builds.apache.org/job/DeltaSpike%20Weld%201.1.13/org.apache.deltaspike.modules$deltaspike-data-module-impl/ws/src/test/java/org/apache/deltaspike/data/test/service/ParentRepository.java>:[60,20]
cannot find symbol
symbol  : variable Parent_
location: class org.apache.deltaspike.data.test.service.ParentRepository
[ERROR] <https://builds.apache.org/job/DeltaSpike%20Weld%201.1.13/org.apache.deltaspike.modules$deltaspike-data-module-impl/ws/src/test/java/org/apache/deltaspike/data/test/service/ParentRepository.java>:[59,20]
cannot find symbol
symbol  : variable Parent_
location: class org.apache.deltaspike.data.test.service.ParentRepository
[ERROR] <https://builds.apache.org/job/DeltaSpike%20Weld%201.1.13/org.apache.deltaspike.modules$deltaspike-data-module-impl/ws/src/test/java/org/apache/deltaspike/data/test/service/ParentRepository.java>:[70,23]
cannot find symbol
symbol  : variable Parent_
location: class org.apache.deltaspike.data.test.service.ParentRepository
[ERROR] <https://builds.apache.org/job/DeltaSpike%20Weld%201.1.13/org.apache.deltaspike.modules$deltaspike-data-module-impl/ws/src/test/java/org/apache/deltaspike/data/test/service/ParentRepository.java>:[69,20]
cannot find symbol
symbol  : variable Parent_
location: class org.apache.deltaspike.data.test.service.ParentRepository
[ERROR] <https://builds.apache.org/job/DeltaSpike%20Weld%201.1.13/org.apache.deltaspike.modules$deltaspike-data-module-impl/ws/src/test/java/org/apache/deltaspike/data/test/service/ParentRepository.java>:[79,20]
cannot find symbol
symbol  : variable Parent_
location: class org.apache.deltaspike.data.test.service.ParentRepository
[ERROR] <https://builds.apache.org/job/DeltaSpike%20Weld%201.1.13/org.apache.deltaspike.modules$deltaspike-data-module-impl/ws/src/test/java/org/apache/deltaspike/data/test/service/ParentRepository.java>:[91,41]
cannot find symbol
symbol  : variable Parent_
location: class org.apache.deltaspike.data.test.service.ParentRepository
[ERROR] <https://builds.apache.org/job/DeltaSpike%20Weld%201.1.13/org.apache.deltaspike.modules$deltaspike-data-module-impl/ws/src/test/java/org/apache/deltaspike/data/test/service/ParentRepository.java>:[90,36]
cannot find symbol
symbol  : variable Parent_
location: class org.apache.deltaspike.data.test.service.ParentRepository
[ERROR] <https://builds.apache.org/job/DeltaSpike%20Weld%201.1.13/org.apache.deltaspike.modules$deltaspike-data-module-impl/ws/src/test/java/org/apache/deltaspike/data/test/service/ParentRepository.java>:[94,41]
cannot find symbol
symbol  : variable Parent_
location: class org.apache.deltaspike.data.test.service.ParentRepository
[ERROR] <https://builds.apache.org/job/DeltaSpike%20Weld%201.1.13/org.apache.deltaspike.modules$deltaspike-data-module-impl/ws/src/test/java/org/apache/deltaspike/data/test/service/ParentRepository.java>:[93,36]
cannot find symbol
symbol  : variable Parent_
location: class org.apache.deltaspike.data.test.service.ParentRepository
[ERROR] <https://builds.apache.org/job/DeltaSpike%20Weld%201.1.13/org.apache.deltaspike.modules$deltaspike-data-module-impl/ws/src/test/java/org/apache/deltaspike/data/test/service/ParentRepository.java>:[96,36]
cannot find symbol
symbol  : variable Parent_
location: class org.apache.deltaspike.data.test.service.ParentRepository
[ERROR] <https://builds.apache.org/job/DeltaSpike%20Weld%201.1.13/org.apache.deltaspike.modules$deltaspike-data-module-impl/ws/src/test/java/org/apache/deltaspike/data/test/service/ParentRepository.java>:[105,26]
cannot find symbol
symbol  : variable Parent_
location: class org.apache.deltaspike.data.test.service.ParentRepository
[ERROR] <https://builds.apache.org/job/DeltaSpike%20Weld%201.1.13/org.apache.deltaspike.modules$deltaspike-data-module-impl/ws/src/test/java/org/apache/deltaspike/data/impl/mapping/MappedRepositoryTest.java>:[154,36]
package Simple_ does not exist
[ERROR] <https://builds.apache.org/job/DeltaSpike%20Weld%201.1.13/org.apache.deltaspike.modules$deltaspike-data-module-impl/ws/src/test/java/org/apache/deltaspike/data/impl/handler/EntityRepositoryHandlerTest.java>:[179,48]
cannot find symbol
symbol  : variable Simple_
location: class org.apache.deltaspike.data.impl.handler.EntityRepositoryHandlerTest
[ERROR] <https://builds.apache.org/job/DeltaSpike%20Weld%201.1.13/org.apache.deltaspike.modules$deltaspike-data-module-impl/ws/src/test/java/org/apache/deltaspike/data/impl/handler/EntityRepositoryHandlerTest.java>:[196,54]
cannot find symbol
symbol  : variable Simple_
location: class org.apache.deltaspike.data.impl.handler.EntityRepositoryHandlerTest
[ERROR] <https://builds.apache.org/job/DeltaSpike%20Weld%201.1.13/org.apache.deltaspike.modules$deltaspike-data-module-impl/ws/src/test/java/org/apache/deltaspike/data/impl/handler/EntityRepositoryHandlerTest.java>:[196,68]
cannot find symbol
symbol  : variable Simple_
location: class org.apache.deltaspike.data.impl.handler.EntityRepositoryHandlerTest
[ERROR] <https://builds.apache.org/job/DeltaSpike%20Weld%201.1.13/org.apache.deltaspike.modules$deltaspike-data-module-impl/ws/src/test/java/org/apache/deltaspike/data/impl/handler/EntityRepositoryHandlerTest.java>:[260,53]
cannot find symbol
symbol  : variable Simple_
location: class org.apache.deltaspike.data.impl.handler.EntityRepositoryHandlerTest
[ERROR] <https://builds.apache.org/job/DeltaSpike%20Weld%201.1.13/org.apache.deltaspike.modules$deltaspike-data-module-impl/ws/src/test/java/org/apache/deltaspike/data/impl/handler/EntityRepositoryHandlerTest.java>:[276,60]
cannot find symbol
symbol  : variable Simple_
location: class org.apache.deltaspike.data.impl.handler.EntityRepositoryHandlerTest
[ERROR] <https://builds.apache.org/job/DeltaSpike%20Weld%201.1.13/org.apache.deltaspike.modules$deltaspike-data-module-impl/ws/src/test/java/org/apache/deltaspike/data/impl/handler/EntityRepositoryHandlerTest.java>:[293,53]
cannot find symbol
symbol  : variable Simple_
location: class org.apache.deltaspike.data.impl.handler.EntityRepositoryHandlerTest
[ERROR] <https://builds.apache.org/job/DeltaSpike%20Weld%201.1.13/org.apache.deltaspike.modules$deltaspike-data-module-impl/ws/src/test/java/org/apache/deltaspike/data/impl/handler/EntityRepositoryHandlerTest.java>:[293,67]
cannot find symbol
symbol  : variable Simple_
location: class org.apache.deltaspike.data.impl.handler.EntityRepositoryHandlerTest
[ERROR] <https://builds.apache.org/job/DeltaSpike%20Weld%201.1.13/org.apache.deltaspike.modules$deltaspike-data-module-impl/ws/src/test/java/org/apache/deltaspike/data/impl/handler/EntityRepositoryHandlerTest.java>:[321,41]
cannot find symbol
symbol  : variable Simple_
location: class org.apache.deltaspike.data.impl.handler.EntityRepositoryHandlerTest
[ERROR] <https://builds.apache.org/job/DeltaSpike%20Weld%201.1.13/org.apache.deltaspike.modules$deltaspike-data-module-impl/ws/src/test/java/org/apache/deltaspike/data/impl/handler/EntityRepositoryHandlerTest.java>:[321,55]
cannot find symbol
symbol  : variable Simple_
location: class org.apache.deltaspike.data.impl.handler.EntityRepositoryHandlerTest
[ERROR] <https://builds.apache.org/job/DeltaSpike%20Weld%201.1.13/org.apache.deltaspike.modules$deltaspike-data-module-impl/ws/src/test/java/org/apache/deltaspike/data/impl/handler/EntityRepositoryHandlerTest.java>:[353,45]
cannot find symbol
symbol  : variable Simple_
location: class org.apache.deltaspike.data.impl.handler.EntityRepositoryHandlerTest
[INFO] 78 errors 
[INFO] -------------------------------------------------------------

Mime
View raw message