deltaspike-commits mailing list archives

Site index · List index
Message view « Date » · « Thread »
Top « Date » · « Thread »
From Apache Jenkins Server <jenk...@builds.apache.org>
Subject Build failed in Jenkins: DeltaSpike_GF3 #363
Date Wed, 06 Apr 2016 07:21:17 GMT
See <https://builds.apache.org/job/DeltaSpike_GF3/363/changes>

Changes:

[gpetracek] DELTASPIKE-1082 documentation for configurable cron-expressions

[gpetracek] DELTASPIKE-1106 release notes for v1.6.0

[johndament] News announcement

[johndament] DELTASPIKE-1105 Added param to control appending entity name.  Updated

[johndament] DELTASPIKE-1108 Ignore EE7 tests as they fail until DELTASPIKE-1060 is

[gpetracek] DELTASPIKE-1106 release notes for v1.6.0

[gpetracek] [maven-release-plugin] prepare release deltaspike-1.6.0

[gpetracek] [maven-release-plugin] prepare for next development iteration

[johndament] DELTASPIKE-1105 Data Module doc fixes.

[johndament] Added documentation to add DeltaSpike to a gradle project.

[johndament] Updated docs to show how to use Gradle when setting up.

[johndament] Updated docs to show how to use Gradle when using modules.

[johndament] Updated docs to show how to use Gradle when using modules.

[johndament] Ignore the target folder of all builds when doing rat check, as well as

[gpetracek] DELTASPIKE-1114 information about v1.6.0

------------------------------------------
[...truncated 889 lines...]
[INFO] 
[INFO] --- maven-resources-plugin:2.7:testResources (default-testResources) @ deltaspike-cdictrl-api
---
[INFO] Using 'UTF-8' encoding to copy filtered resources.
[INFO] skip non existing resourceDirectory <https://builds.apache.org/job/DeltaSpike_GF3/ws/deltaspike/cdictrl/api/src/test/resources>
[INFO] Copying 3 resources
[INFO] 
[INFO] --- maven-compiler-plugin:2.5:testCompile (default-testCompile) @ deltaspike-cdictrl-api
---
[INFO] No sources to compile
[INFO] 
[INFO] --- maven-surefire-plugin:2.11:test (default-test) @ deltaspike-cdictrl-api ---
[INFO] Surefire report directory: <https://builds.apache.org/job/DeltaSpike_GF3/ws/deltaspike/cdictrl/api/target/surefire-reports>
[INFO] Using configured provider org.apache.maven.surefire.junitcore.JUnitCoreProvider

-------------------------------------------------------
 T E S T S
-------------------------------------------------------
Concurrency config is parallel='none', perCoreThreadCount=true, threadCount=2, useUnlimitedThreads=false

Results :

Tests run: 0, Failures: 0, Errors: 0, Skipped: 0

[JENKINS] Recording test results
[INFO] 
[INFO] --- maven-jar-plugin:2.4:jar (default-jar) @ deltaspike-cdictrl-api ---
[INFO] Building jar: <https://builds.apache.org/job/DeltaSpike_GF3/ws/deltaspike/cdictrl/api/target/deltaspike-cdictrl-api-1.6.1-SNAPSHOT.jar>
[INFO] 
[INFO] --- maven-site-plugin:3.4:attach-descriptor (attach-descriptor) @ deltaspike-cdictrl-api
---
[INFO] 
[INFO] --- maven-bundle-plugin:2.3.7:cleanVersions (versions) @ deltaspike-cdictrl-api ---
[INFO] 
[INFO] --- maven-antrun-plugin:1.7:run (javadoc.resources) @ deltaspike-cdictrl-api ---
[WARNING] Parameter tasks is deprecated, use target instead
[INFO] Executing tasks

main:
[INFO] Executed tasks
[WARNING] Failed to getClass for org.apache.maven.plugin.source.SourceJarMojo
[INFO] 
[INFO] --- maven-source-plugin:2.4:jar (attach-sources) @ deltaspike-cdictrl-api ---
[INFO] Building jar: <https://builds.apache.org/job/DeltaSpike_GF3/ws/deltaspike/cdictrl/api/target/deltaspike-cdictrl-api-1.6.1-SNAPSHOT-sources.jar>
[INFO] 
[INFO] --- maven-checkstyle-plugin:2.9.1:check (verify-style) @ deltaspike-cdictrl-api ---
[INFO] Starting audit...
Audit done.

[INFO] 
[INFO] --- maven-install-plugin:2.5.2:install (default-install) @ deltaspike-cdictrl-api ---
[INFO] Installing <https://builds.apache.org/job/DeltaSpike_GF3/ws/deltaspike/cdictrl/api/target/deltaspike-cdictrl-api-1.6.1-SNAPSHOT.jar>
to /home/jenkins/jenkins-slave/maven-repositories/0/org/apache/deltaspike/cdictrl/deltaspike-cdictrl-api/1.6.1-SNAPSHOT/deltaspike-cdictrl-api-1.6.1-SNAPSHOT.jar
[INFO] Installing <https://builds.apache.org/job/DeltaSpike_GF3/ws/deltaspike/cdictrl/api/pom.xml>
to /home/jenkins/jenkins-slave/maven-repositories/0/org/apache/deltaspike/cdictrl/deltaspike-cdictrl-api/1.6.1-SNAPSHOT/deltaspike-cdictrl-api-1.6.1-SNAPSHOT.pom
[INFO] Installing <https://builds.apache.org/job/DeltaSpike_GF3/ws/deltaspike/cdictrl/api/target/deltaspike-cdictrl-api-1.6.1-SNAPSHOT-sources.jar>
to /home/jenkins/jenkins-slave/maven-repositories/0/org/apache/deltaspike/cdictrl/deltaspike-cdictrl-api/1.6.1-SNAPSHOT/deltaspike-cdictrl-api-1.6.1-SNAPSHOT-sources.jar
[INFO]                                                                         
[INFO] ------------------------------------------------------------------------
[INFO] Building Apache DeltaSpike CDI Weld-ContainerControl 1.6.1-SNAPSHOT
[INFO] ------------------------------------------------------------------------
[INFO] 
[INFO] --- maven-clean-plugin:2.5:clean (default-clean) @ deltaspike-cdictrl-weld ---
[INFO] 
[INFO] --- maven-bundle-plugin:2.3.7:cleanVersions (versions) @ deltaspike-cdictrl-weld ---
[INFO] 
[INFO] --- maven-antrun-plugin:1.7:run (javadoc.resources) @ deltaspike-cdictrl-weld ---
[WARNING] Parameter tasks is deprecated, use target instead
[INFO] Executing tasks

main:
[INFO] Executed tasks
[INFO] 
[INFO] --- maven-remote-resources-plugin:1.5:process (default) @ deltaspike-cdictrl-weld ---
[INFO] 
[INFO] --- maven-resources-plugin:2.7:resources (default-resources) @ deltaspike-cdictrl-weld
---
[INFO] Using 'UTF-8' encoding to copy filtered resources.
[INFO] Copying 2 resources
[INFO] Copying 3 resources
[INFO] 
[INFO] --- maven-compiler-plugin:2.5:compile (default-compile) @ deltaspike-cdictrl-weld ---
[INFO] Compiling 2 source files to <https://builds.apache.org/job/DeltaSpike_GF3/ws/deltaspike/cdictrl/impl-weld/target/classes>
[INFO] 
[INFO] --- maven-resources-plugin:2.7:testResources (default-testResources) @ deltaspike-cdictrl-weld
---
[INFO] Using 'UTF-8' encoding to copy filtered resources.
[INFO] skip non existing resourceDirectory <https://builds.apache.org/job/DeltaSpike_GF3/ws/deltaspike/cdictrl/impl-weld/src/test/resources>
[INFO] Copying 3 resources
[INFO] 
[INFO] --- maven-compiler-plugin:2.5:testCompile (default-testCompile) @ deltaspike-cdictrl-weld
---
[INFO] No sources to compile
[INFO] 
[INFO] --- maven-dependency-plugin:2.4:unpack (unpack) @ deltaspike-cdictrl-weld ---
[INFO] Configured Artifact: org.apache.deltaspike.test:deltaspike-cdictrl-tck:1.6.1-SNAPSHOT:jar
Downloading: https://repository.apache.org/content/repositories/snapshots/org/apache/deltaspike/test/deltaspike-cdictrl-tck/1.6.1-SNAPSHOT/maven-metadata.xml
Downloading: http://repository.apache.org/snapshots/org/apache/deltaspike/test/deltaspike-cdictrl-tck/1.6.1-SNAPSHOT/maven-metadata.xml
Downloading: https://repository.apache.org/content/repositories/releases/org/apache/deltaspike/test/deltaspike-cdictrl-tck/1.6.1-SNAPSHOT/maven-metadata.xml
Downloading: https://repository.apache.org/content/repositories/releases/org/apache/deltaspike/test/deltaspike-cdictrl-tck/1.6.1-SNAPSHOT/deltaspike-cdictrl-tck-1.6.1-SNAPSHOT.jar
Downloading: https://repository.apache.org/content/repositories/snapshots/org/apache/deltaspike/test/deltaspike-cdictrl-tck/1.6.1-SNAPSHOT/deltaspike-cdictrl-tck-1.6.1-SNAPSHOT.jar
Downloading: http://repository.apache.org/snapshots/org/apache/deltaspike/test/deltaspike-cdictrl-tck/1.6.1-SNAPSHOT/deltaspike-cdictrl-tck-1.6.1-SNAPSHOT.jar
[INFO] ------------------------------------------------------------------------
[INFO] Reactor Summary:
[INFO] 
[INFO] Apache DeltaSpike Sources ......................... SUCCESS [3.383s]
[INFO] Apache DeltaSpike CheckStyle-rules ................ SUCCESS [1.656s]
[INFO] Apache DeltaSpike Parent .......................... SUCCESS [4.299s]
[INFO] Apache DeltaSpike Test-Utils ...................... SUCCESS [3.871s]
[INFO] Apache DeltaSpike Code Parent ..................... SUCCESS [6.788s]
[INFO] Apache DeltaSpike Core ............................ SUCCESS [2.963s]
[INFO] Apache DeltaSpike Core-API ........................ SUCCESS [19.978s]
[INFO] Apache DeltaSpike Core-Implementation ............. SUCCESS [4:03.200s]
[INFO] Apache DeltaSpike ContainerControl parent ......... SUCCESS [1.166s]
[INFO] Apache DeltaSpike CDI ContainerControl API ........ SUCCESS [3.118s]
[INFO] Apache DeltaSpike CDI Weld-ContainerControl ....... FAILURE [2.772s]
[INFO] Apache DeltaSpike Modules ......................... SKIPPED
[INFO] Apache DeltaSpike Proxy-Module .................... SKIPPED
[INFO] Apache DeltaSpike Proxy-Module API ................ SKIPPED
[INFO] Apache DeltaSpike Proxy-Module Impl ASM5 .......... SKIPPED
[INFO] Apache DeltaSpike Security-Module ................. SKIPPED
[INFO] Apache DeltaSpike Security-Module API ............. SKIPPED
[INFO] Apache DeltaSpike Security-Module Impl ............ SKIPPED
[INFO] Apache DeltaSpike JPA-Module ...................... SKIPPED
[INFO] Apache DeltaSpike JPA-Module API .................. SKIPPED
[INFO] Apache DeltaSpike JPA-Module Impl ................. SKIPPED
[INFO] Apache DeltaSpike Servlet-Module .................. SKIPPED
[INFO] Apache DeltaSpike Servlet-Module API .............. SKIPPED
[INFO] Apache DeltaSpike Servlet-Module Impl ............. SKIPPED
[INFO] Apache DeltaSpike JSF-Module ...................... SKIPPED
[INFO] Apache DeltaSpike JSF-Module API .................. SKIPPED
[INFO] Apache DeltaSpike JSF-Module Impl ................. SKIPPED
[INFO] Apache DeltaSpike JSF-Module Impl (EE6 only) ...... SKIPPED
[INFO] Apache DeltaSpike Partial-Bean-Module ............. SKIPPED
[INFO] Apache DeltaSpike Partial-Bean-Module API ......... SKIPPED
[INFO] Apache DeltaSpike Partial-Bean-Module Impl ........ SKIPPED
[INFO] Apache DeltaSpike BeanValidation-Module ........... SKIPPED
[INFO] Apache DeltaSpike BeanValidation-Module API ....... SKIPPED
[INFO] Apache DeltaSpike BeanValidation-Module Impl ...... SKIPPED
[INFO] Apache DeltaSpike Data-Module ..................... SKIPPED
[INFO] Apache DeltaSpike Data-Module API ................. SKIPPED
[INFO] Apache DeltaSpike Data-Module Impl ................ SKIPPED
[INFO] Apache DeltaSpike Scheduler-Module ................ SKIPPED
[INFO] Apache DeltaSpike Scheduler-Module API ............ SKIPPED
[INFO] Apache DeltaSpike Scheduler-Module Impl ........... SKIPPED
[INFO] Apache DeltaSpike Test-Control-Module ............. SKIPPED
[INFO] Apache DeltaSpike Test-Control-Module API ......... SKIPPED
[INFO] Apache DeltaSpike Test-Control-Module Impl ........ SKIPPED
[INFO] Apache DeltaSpike Examples ........................ SKIPPED
[INFO] Apache DeltaSpike Java-SE Examples ................ SKIPPED
[INFO] Apache DeltaSpike JSF Examples .................... SKIPPED
[INFO] Apache DeltaSpike JSF Playground .................. SKIPPED
[INFO] Apache DeltaSpike Security Example CDI ............ SKIPPED
[INFO] Apache DeltaSpike Security Example PicketLink ..... SKIPPED
[INFO] Apache DeltaSpike Java-SE Scheduler Examples ...... SKIPPED
[INFO] ------------------------------------------------------------------------
[INFO] BUILD FAILURE
[INFO] ------------------------------------------------------------------------
[INFO] Total time: 5:04.254s
[INFO] Finished at: Wed Apr 06 07:19:52 UTC 2016
[INFO] Final Memory: 61M/885M
[INFO] ------------------------------------------------------------------------
Waiting for Jenkins to finish collecting data
[ERROR] Failed to execute goal org.apache.maven.plugins:maven-dependency-plugin:2.4:unpack
(unpack) on project deltaspike-cdictrl-weld: Unable to find artifact. Could not find artifact
org.apache.deltaspike.test:deltaspike-cdictrl-tck:jar:1.6.1-SNAPSHOT in Apache Repository
(https://repository.apache.org/content/repositories/releases)
[ERROR] 
[ERROR] Try downloading the file manually from the project website.
[ERROR] 
[ERROR] Then, install it using the command:
[ERROR] mvn install:install-file -DgroupId=org.apache.deltaspike.test -DartifactId=deltaspike-cdictrl-tck
-Dversion=1.6.1-SNAPSHOT -Dpackaging=jar -Dfile=/path/to/file
[ERROR] 
[ERROR] Alternatively, if you host your own repository you can deploy the file there:
[ERROR] mvn deploy:deploy-file -DgroupId=org.apache.deltaspike.test -DartifactId=deltaspike-cdictrl-tck
-Dversion=1.6.1-SNAPSHOT -Dpackaging=jar -Dfile=/path/to/file -Durl=[url] -DrepositoryId=[id]
[ERROR] 
[ERROR] 
[ERROR] org.apache.deltaspike.test:deltaspike-cdictrl-tck:jar:1.6.1-SNAPSHOT
[ERROR] 
[ERROR] from the specified remote repositories:
[ERROR] Apache Repository (https://repository.apache.org/content/repositories/releases, releases=true,
snapshots=true),
[ERROR] Apache Snapshot Repository (https://repository.apache.org/content/repositories/snapshots,
releases=true, snapshots=true),
[ERROR] Nexus (http://repository.apache.org/snapshots, releases=false, snapshots=true),
[ERROR] central (http://repo.maven.apache.org/maven2, releases=true, snapshots=false)
[ERROR] -> [Help 1]
[ERROR] 
[ERROR] To see the full stack trace of the errors, re-run Maven with the -e switch.
[ERROR] Re-run Maven using the -X switch to enable full debug logging.
[ERROR] 
[ERROR] For more information about the errors and possible solutions, please read the following
articles:
[ERROR] [Help 1] http://cwiki.apache.org/confluence/display/MAVEN/MojoExecutionException
[ERROR] 
[ERROR] After correcting the problems, you can resume the build with the command
[ERROR]   mvn <goals> -rf :deltaspike-cdictrl-weld
[JENKINS] Archiving <https://builds.apache.org/job/DeltaSpike_GF3/ws/deltaspike/examples/jse-examples/pom.xml>
to org.apache.deltaspike.examples/deltaspike-jse-example/1.6.1-SNAPSHOT/deltaspike-jse-example-1.6.1-SNAPSHOT.pom
[JENKINS] Archiving <https://builds.apache.org/job/DeltaSpike_GF3/ws/deltaspike/examples/security-requested-page-after-login-cdi/pom.xml>
to org.apache.deltaspike.examples/deltaspike-security-requested-page-after-login-cdi/1.6.1-SNAPSHOT/deltaspike-security-requested-page-after-login-cdi-1.6.1-SNAPSHOT.pom
[JENKINS] Archiving <https://builds.apache.org/job/DeltaSpike_GF3/ws/deltaspike/test-utils/pom.xml>
to org.apache.deltaspike.test/test-utils/1.6.1-SNAPSHOT/test-utils-1.6.1-SNAPSHOT.pom
[JENKINS] Archiving <https://builds.apache.org/job/DeltaSpike_GF3/ws/deltaspike/test-utils/target/test-utils-1.6.1-SNAPSHOT.jar>
to org.apache.deltaspike.test/test-utils/1.6.1-SNAPSHOT/test-utils-1.6.1-SNAPSHOT.jar
[JENKINS] Archiving <https://builds.apache.org/job/DeltaSpike_GF3/ws/deltaspike/test-utils/target/test-utils-1.6.1-SNAPSHOT-sources.jar>
to org.apache.deltaspike.test/test-utils/1.6.1-SNAPSHOT/test-utils-1.6.1-SNAPSHOT-sources.jar
[JENKINS] Archiving <https://builds.apache.org/job/DeltaSpike_GF3/ws/deltaspike/modules/data/impl/pom.xml>
to org.apache.deltaspike.modules/deltaspike-data-module-impl/1.6.1-SNAPSHOT/deltaspike-data-module-impl-1.6.1-SNAPSHOT.pom
[JENKINS] Archiving <https://builds.apache.org/job/DeltaSpike_GF3/ws/deltaspike/modules/data/api/pom.xml>
to org.apache.deltaspike.modules/deltaspike-data-module-api/1.6.1-SNAPSHOT/deltaspike-data-module-api-1.6.1-SNAPSHOT.pom
[JENKINS] Archiving <https://builds.apache.org/job/DeltaSpike_GF3/ws/deltaspike/core/impl/pom.xml>
to org.apache.deltaspike.core/deltaspike-core-impl/1.6.1-SNAPSHOT/deltaspike-core-impl-1.6.1-SNAPSHOT.pom
[JENKINS] Archiving <https://builds.apache.org/job/DeltaSpike_GF3/ws/deltaspike/core/impl/target/deltaspike-core-impl-1.6.1-SNAPSHOT.jar>
to org.apache.deltaspike.core/deltaspike-core-impl/1.6.1-SNAPSHOT/deltaspike-core-impl-1.6.1-SNAPSHOT.jar
[JENKINS] Archiving <https://builds.apache.org/job/DeltaSpike_GF3/ws/deltaspike/core/impl/target/deltaspike-core-impl-1.6.1-SNAPSHOT-tests.jar>
to org.apache.deltaspike.core/deltaspike-core-impl/1.6.1-SNAPSHOT/deltaspike-core-impl-1.6.1-SNAPSHOT-tests.jar
[JENKINS] Archiving <https://builds.apache.org/job/DeltaSpike_GF3/ws/deltaspike/core/impl/target/deltaspike-core-impl-1.6.1-SNAPSHOT-sources.jar>
to org.apache.deltaspike.core/deltaspike-core-impl/1.6.1-SNAPSHOT/deltaspike-core-impl-1.6.1-SNAPSHOT-sources.jar
[JENKINS] Archiving <https://builds.apache.org/job/DeltaSpike_GF3/ws/deltaspike/modules/pom.xml>
to org.apache.deltaspike.modules/modules-project/1.6.1-SNAPSHOT/modules-project-1.6.1-SNAPSHOT.pom
[JENKINS] Archiving <https://builds.apache.org/job/DeltaSpike_GF3/ws/deltaspike/modules/test-control/pom.xml>
to org.apache.deltaspike.modules/test-control-module-project/1.6.1-SNAPSHOT/test-control-module-project-1.6.1-SNAPSHOT.pom
[JENKINS] Archiving <https://builds.apache.org/job/DeltaSpike_GF3/ws/deltaspike/examples/jsf-examples/pom.xml>
to org.apache.deltaspike.examples/deltaspike-jsf-example/1.6.1-SNAPSHOT/deltaspike-jsf-example-1.6.1-SNAPSHOT.pom
[JENKINS] Archiving <https://builds.apache.org/job/DeltaSpike_GF3/ws/deltaspike/cdictrl/api/pom.xml>
to org.apache.deltaspike.cdictrl/deltaspike-cdictrl-api/1.6.1-SNAPSHOT/deltaspike-cdictrl-api-1.6.1-SNAPSHOT.pom
[JENKINS] Archiving <https://builds.apache.org/job/DeltaSpike_GF3/ws/deltaspike/cdictrl/api/target/deltaspike-cdictrl-api-1.6.1-SNAPSHOT.jar>
to org.apache.deltaspike.cdictrl/deltaspike-cdictrl-api/1.6.1-SNAPSHOT/deltaspike-cdictrl-api-1.6.1-SNAPSHOT.jar
[JENKINS] Archiving <https://builds.apache.org/job/DeltaSpike_GF3/ws/deltaspike/cdictrl/api/target/deltaspike-cdictrl-api-1.6.1-SNAPSHOT-sources.jar>
to org.apache.deltaspike.cdictrl/deltaspike-cdictrl-api/1.6.1-SNAPSHOT/deltaspike-cdictrl-api-1.6.1-SNAPSHOT-sources.jar
[JENKINS] Archiving <https://builds.apache.org/job/DeltaSpike_GF3/ws/deltaspike/examples/scheduler-playground/pom.xml>
to org.apache.deltaspike.examples/deltaspike-scheduler-example/1.6.1-SNAPSHOT/deltaspike-scheduler-example-1.6.1-SNAPSHOT.pom
[JENKINS] Archiving <https://builds.apache.org/job/DeltaSpike_GF3/ws/deltaspike/checkstyle-rules/pom.xml>
to org.apache.deltaspike/checkstyle-rules/1.6.1-SNAPSHOT/checkstyle-rules-1.6.1-SNAPSHOT.pom
[JENKINS] Archiving <https://builds.apache.org/job/DeltaSpike_GF3/ws/deltaspike/checkstyle-rules/target/checkstyle-rules-1.6.1-SNAPSHOT.jar>
to org.apache.deltaspike/checkstyle-rules/1.6.1-SNAPSHOT/checkstyle-rules-1.6.1-SNAPSHOT.jar
[JENKINS] Archiving <https://builds.apache.org/job/DeltaSpike_GF3/ws/deltaspike/parent/code/pom.xml>
to org.apache.deltaspike/parent-code/1.6.1-SNAPSHOT/parent-code-1.6.1-SNAPSHOT.pom
[JENKINS] Archiving <https://builds.apache.org/job/DeltaSpike_GF3/ws/deltaspike/parent/code/target/parent-code-1.6.1-SNAPSHOT-tests.jar>
to org.apache.deltaspike/parent-code/1.6.1-SNAPSHOT/parent-code-1.6.1-SNAPSHOT-tests.jar
Compressed 79.64 KB of artifacts by 40.2% relative to #362
[JENKINS] Archiving <https://builds.apache.org/job/DeltaSpike_GF3/ws/deltaspike/modules/jsf/impl/pom.xml>
to org.apache.deltaspike.modules/deltaspike-jsf-module-impl/1.6.1-SNAPSHOT/deltaspike-jsf-module-impl-1.6.1-SNAPSHOT.pom
[JENKINS] Archiving <https://builds.apache.org/job/DeltaSpike_GF3/ws/deltaspike/modules/partial-bean/pom.xml>
to org.apache.deltaspike.modules/partial-bean-module-project/1.6.1-SNAPSHOT/partial-bean-module-project-1.6.1-SNAPSHOT.pom
[JENKINS] Archiving <https://builds.apache.org/job/DeltaSpike_GF3/ws/deltaspike/examples/pom.xml>
to org.apache.deltaspike.examples/examples-project/1.6.1-SNAPSHOT/examples-project-1.6.1-SNAPSHOT.pom
[JENKINS] Archiving <https://builds.apache.org/job/DeltaSpike_GF3/ws/deltaspike/modules/jsf/pom.xml>
to org.apache.deltaspike.modules/jsf-module-project/1.6.1-SNAPSHOT/jsf-module-project-1.6.1-SNAPSHOT.pom
[JENKINS] Archiving <https://builds.apache.org/job/DeltaSpike_GF3/ws/deltaspike/modules/jsf/api/pom.xml>
to org.apache.deltaspike.modules/deltaspike-jsf-module-api/1.6.1-SNAPSHOT/deltaspike-jsf-module-api-1.6.1-SNAPSHOT.pom
[JENKINS] Archiving <https://builds.apache.org/job/DeltaSpike_GF3/ws/deltaspike/modules/security/pom.xml>
to org.apache.deltaspike.modules/security-module-project/1.6.1-SNAPSHOT/security-module-project-1.6.1-SNAPSHOT.pom
[JENKINS] Archiving <https://builds.apache.org/job/DeltaSpike_GF3/ws/deltaspike/modules/bean-validation/pom.xml>
to org.apache.deltaspike.modules/bean-validation-module-project/1.6.1-SNAPSHOT/bean-validation-module-project-1.6.1-SNAPSHOT.pom
[JENKINS] Archiving <https://builds.apache.org/job/DeltaSpike_GF3/ws/deltaspike/modules/partial-bean/impl/pom.xml>
to org.apache.deltaspike.modules/deltaspike-partial-bean-module-impl/1.6.1-SNAPSHOT/deltaspike-partial-bean-module-impl-1.6.1-SNAPSHOT.pom
[JENKINS] Archiving <https://builds.apache.org/job/DeltaSpike_GF3/ws/deltaspike/modules/proxy/api/pom.xml>
to org.apache.deltaspike.modules/deltaspike-proxy-module-api/1.6.1-SNAPSHOT/deltaspike-proxy-module-api-1.6.1-SNAPSHOT.pom
[JENKINS] Archiving <https://builds.apache.org/job/DeltaSpike_GF3/ws/deltaspike/cdictrl/impl-weld/pom.xml>
to org.apache.deltaspike.cdictrl/deltaspike-cdictrl-weld/1.6.1-SNAPSHOT/deltaspike-cdictrl-weld-1.6.1-SNAPSHOT.pom
[JENKINS] Archiving <https://builds.apache.org/job/DeltaSpike_GF3/ws/deltaspike/modules/jpa/api/pom.xml>
to org.apache.deltaspike.modules/deltaspike-jpa-module-api/1.6.1-SNAPSHOT/deltaspike-jpa-module-api-1.6.1-SNAPSHOT.pom
[JENKINS] Archiving <https://builds.apache.org/job/DeltaSpike_GF3/ws/deltaspike/modules/servlet/api/pom.xml>
to org.apache.deltaspike.modules/deltaspike-servlet-module-api/1.6.1-SNAPSHOT/deltaspike-servlet-module-api-1.6.1-SNAPSHOT.pom
[JENKINS] Archiving <https://builds.apache.org/job/DeltaSpike_GF3/ws/deltaspike/modules/jpa/pom.xml>
to org.apache.deltaspike.modules/jpa-module-project/1.6.1-SNAPSHOT/jpa-module-project-1.6.1-SNAPSHOT.pom
[JENKINS] Archiving <https://builds.apache.org/job/DeltaSpike_GF3/ws/deltaspike/cdictrl/pom.xml>
to org.apache.deltaspike.cdictrl/cdictrl-project/1.6.1-SNAPSHOT/cdictrl-project-1.6.1-SNAPSHOT.pom
[JENKINS] Archiving <https://builds.apache.org/job/DeltaSpike_GF3/ws/deltaspike/modules/scheduler/api/pom.xml>
to org.apache.deltaspike.modules/deltaspike-scheduler-module-api/1.6.1-SNAPSHOT/deltaspike-scheduler-module-api-1.6.1-SNAPSHOT.pom
[JENKINS] Archiving <https://builds.apache.org/job/DeltaSpike_GF3/ws/deltaspike/modules/test-control/impl/pom.xml>
to org.apache.deltaspike.modules/deltaspike-test-control-module-impl/1.6.1-SNAPSHOT/deltaspike-test-control-module-impl-1.6.1-SNAPSHOT.pom
[JENKINS] Archiving <https://builds.apache.org/job/DeltaSpike_GF3/ws/deltaspike/modules/servlet/pom.xml>
to org.apache.deltaspike.modules/servlet-module-project/1.6.1-SNAPSHOT/servlet-module-project-1.6.1-SNAPSHOT.pom
[JENKINS] Archiving <https://builds.apache.org/job/DeltaSpike_GF3/ws/deltaspike/modules/test-control/api/pom.xml>
to org.apache.deltaspike.modules/deltaspike-test-control-module-api/1.6.1-SNAPSHOT/deltaspike-test-control-module-api-1.6.1-SNAPSHOT.pom
[JENKINS] Archiving <https://builds.apache.org/job/DeltaSpike_GF3/ws/deltaspike/modules/jsf/impl-ee6/pom.xml>
to org.apache.deltaspike.modules/deltaspike-jsf-module-impl-ee6/1.6.1-SNAPSHOT/deltaspike-jsf-module-impl-ee6-1.6.1-SNAPSHOT.pom
[JENKINS] Archiving <https://builds.apache.org/job/DeltaSpike_GF3/ws/deltaspike/modules/proxy/pom.xml>
to org.apache.deltaspike.modules/proxy-module-project/1.6.1-SNAPSHOT/proxy-module-project-1.6.1-SNAPSHOT.pom
[JENKINS] Archiving <https://builds.apache.org/job/DeltaSpike_GF3/ws/deltaspike/modules/partial-bean/api/pom.xml>
to org.apache.deltaspike.modules/deltaspike-partial-bean-module-api/1.6.1-SNAPSHOT/deltaspike-partial-bean-module-api-1.6.1-SNAPSHOT.pom
[JENKINS] Archiving <https://builds.apache.org/job/DeltaSpike_GF3/ws/deltaspike/modules/scheduler/impl/pom.xml>
to org.apache.deltaspike.modules/deltaspike-scheduler-module-impl/1.6.1-SNAPSHOT/deltaspike-scheduler-module-impl-1.6.1-SNAPSHOT.pom
[JENKINS] Archiving <https://builds.apache.org/job/DeltaSpike_GF3/ws/deltaspike/parent/pom.xml>
to org.apache.deltaspike/parent/1.6.1-SNAPSHOT/parent-1.6.1-SNAPSHOT.pom
[JENKINS] Archiving <https://builds.apache.org/job/DeltaSpike_GF3/ws/deltaspike/core/pom.xml>
to org.apache.deltaspike.core/core-project/1.6.1-SNAPSHOT/core-project-1.6.1-SNAPSHOT.pom
[JENKINS] Archiving <https://builds.apache.org/job/DeltaSpike_GF3/ws/deltaspike/core/target/core-project-1.6.1-SNAPSHOT-tests.jar>
to org.apache.deltaspike.core/core-project/1.6.1-SNAPSHOT/core-project-1.6.1-SNAPSHOT-tests.jar
[JENKINS] Archiving <https://builds.apache.org/job/DeltaSpike_GF3/ws/deltaspike/modules/bean-validation/api/pom.xml>
to org.apache.deltaspike.modules/deltaspike-bean-validation-module-api/1.6.1-SNAPSHOT/deltaspike-bean-validation-module-api-1.6.1-SNAPSHOT.pom
[JENKINS] Archiving <https://builds.apache.org/job/DeltaSpike_GF3/ws/deltaspike/core/api/pom.xml>
to org.apache.deltaspike.core/deltaspike-core-api/1.6.1-SNAPSHOT/deltaspike-core-api-1.6.1-SNAPSHOT.pom
[JENKINS] Archiving <https://builds.apache.org/job/DeltaSpike_GF3/ws/deltaspike/core/api/target/deltaspike-core-api-1.6.1-SNAPSHOT.jar>
to org.apache.deltaspike.core/deltaspike-core-api/1.6.1-SNAPSHOT/deltaspike-core-api-1.6.1-SNAPSHOT.jar
[JENKINS] Archiving <https://builds.apache.org/job/DeltaSpike_GF3/ws/deltaspike/core/api/target/deltaspike-core-api-1.6.1-SNAPSHOT-tests.jar>
to org.apache.deltaspike.core/deltaspike-core-api/1.6.1-SNAPSHOT/deltaspike-core-api-1.6.1-SNAPSHOT-tests.jar
[JENKINS] Archiving <https://builds.apache.org/job/DeltaSpike_GF3/ws/deltaspike/core/api/target/deltaspike-core-api-1.6.1-SNAPSHOT-sources.jar>
to org.apache.deltaspike.core/deltaspike-core-api/1.6.1-SNAPSHOT/deltaspike-core-api-1.6.1-SNAPSHOT-sources.jar
[JENKINS] Archiving <https://builds.apache.org/job/DeltaSpike_GF3/ws/deltaspike/modules/security/impl/pom.xml>
to org.apache.deltaspike.modules/deltaspike-security-module-impl/1.6.1-SNAPSHOT/deltaspike-security-module-impl-1.6.1-SNAPSHOT.pom
[JENKINS] Archiving <https://builds.apache.org/job/DeltaSpike_GF3/ws/deltaspike/modules/scheduler/pom.xml>
to org.apache.deltaspike.modules/scheduler-module-project/1.6.1-SNAPSHOT/scheduler-module-project-1.6.1-SNAPSHOT.pom
[JENKINS] Archiving <https://builds.apache.org/job/DeltaSpike_GF3/ws/deltaspike/modules/proxy/impl-asm5/pom.xml>
to org.apache.deltaspike.modules/deltaspike-proxy-module-impl-asm5/1.6.1-SNAPSHOT/deltaspike-proxy-module-impl-asm5-1.6.1-SNAPSHOT.pom
[JENKINS] Archiving <https://builds.apache.org/job/DeltaSpike_GF3/ws/deltaspike/examples/jsf-playground/pom.xml>
to org.apache.deltaspike.examples/deltaspike-jsf-playground/1.6.1-SNAPSHOT/deltaspike-jsf-playground-1.6.1-SNAPSHOT.pom
[JENKINS] Archiving <https://builds.apache.org/job/DeltaSpike_GF3/ws/deltaspike/modules/servlet/impl/pom.xml>
to org.apache.deltaspike.modules/deltaspike-servlet-module-impl/1.6.1-SNAPSHOT/deltaspike-servlet-module-impl-1.6.1-SNAPSHOT.pom
[JENKINS] Archiving <https://builds.apache.org/job/DeltaSpike_GF3/ws/deltaspike/modules/bean-validation/impl/pom.xml>
to org.apache.deltaspike.modules/deltaspike-bean-validation-module-impl/1.6.1-SNAPSHOT/deltaspike-bean-validation-module-impl-1.6.1-SNAPSHOT.pom
[JENKINS] Archiving <https://builds.apache.org/job/DeltaSpike_GF3/ws/deltaspike/modules/jpa/impl/pom.xml>
to org.apache.deltaspike.modules/deltaspike-jpa-module-impl/1.6.1-SNAPSHOT/deltaspike-jpa-module-impl-1.6.1-SNAPSHOT.pom
[JENKINS] Archiving <https://builds.apache.org/job/DeltaSpike_GF3/ws/deltaspike/modules/data/pom.xml>
to org.apache.deltaspike.modules/data-module-project/1.6.1-SNAPSHOT/data-module-project-1.6.1-SNAPSHOT.pom
[JENKINS] Archiving <https://builds.apache.org/job/DeltaSpike_GF3/ws/deltaspike/examples/security-requested-page-after-login-picketlink/pom.xml>
to org.apache.deltaspike.examples/deltaspike-security-requested-page-after-login-picketlink/1.6.1-SNAPSHOT/deltaspike-security-requested-page-after-login-picketlink-1.6.1-SNAPSHOT.pom
[JENKINS] Archiving <https://builds.apache.org/job/DeltaSpike_GF3/ws/deltaspike/pom.xml>
to org.apache.deltaspike/deltaspike-project/1.6.1-SNAPSHOT/deltaspike-project-1.6.1-SNAPSHOT.pom
[JENKINS] Archiving <https://builds.apache.org/job/DeltaSpike_GF3/ws/deltaspike/modules/security/api/pom.xml>
to org.apache.deltaspike.modules/deltaspike-security-module-api/1.6.1-SNAPSHOT/deltaspike-security-module-api-1.6.1-SNAPSHOT.pom
Sending e-mails to: commits@deltaspike.apache.org
Sending e-mails to: commits@deltaspike.apache.org
channel stopped

Mime
View raw message