deltaspike-commits mailing list archives

Site index · List index
Message view « Date » · « Thread »
Top « Date » · « Thread »
From Apache Jenkins Server <jenk...@builds.apache.org>
Subject Build failed in Jenkins: DeltaSpike RAT-Check #2646
Date Wed, 27 Apr 2016 05:22:37 GMT
See <https://builds.apache.org/job/DeltaSpike%20RAT-Check/2646/changes>

Changes:

[gpetracek] [maven-release-plugin] prepare release deltaspike-1.6.1

[gpetracek] [maven-release-plugin] prepare for next development iteration

------------------------------------------
[...truncated 2061 lines...]
jdk1.7.0_80/bin/jstatd
jdk1.7.0_80/bin/javadoc
jdk1.7.0_80/bin/xjc
jdk1.7.0_80/bin/jarsigner
jdk1.7.0_80/bin/jstack
jdk1.7.0_80/bin/keytool
jdk1.7.0_80/bin/javafxpackager
jdk1.7.0_80/bin/wsimport
jdk1.7.0_80/bin/jvisualvm
jdk1.7.0_80/bin/policytool
jdk1.7.0_80/bin/jhat
jdk1.7.0_80/bin/javap
jdk1.7.0_80/bin/jmc.ini
jdk1.7.0_80/man/
jdk1.7.0_80/man/man1/
jdk1.7.0_80/man/man1/jinfo.1
jdk1.7.0_80/man/man1/rmid.1
jdk1.7.0_80/man/man1/native2ascii.1
jdk1.7.0_80/man/man1/jcmd.1
jdk1.7.0_80/man/man1/java.1
jdk1.7.0_80/man/man1/jarsigner.1
jdk1.7.0_80/man/man1/keytool.1
jdk1.7.0_80/man/man1/jconsole.1
jdk1.7.0_80/man/man1/extcheck.1
jdk1.7.0_80/man/man1/wsimport.1
jdk1.7.0_80/man/man1/pack200.1
jdk1.7.0_80/man/man1/schemagen.1
jdk1.7.0_80/man/man1/javadoc.1
jdk1.7.0_80/man/man1/rmic.1
jdk1.7.0_80/man/man1/serialver.1
jdk1.7.0_80/man/man1/apt.1
jdk1.7.0_80/man/man1/javah.1
jdk1.7.0_80/man/man1/wsgen.1
jdk1.7.0_80/man/man1/jvisualvm.1
jdk1.7.0_80/man/man1/appletviewer.1
jdk1.7.0_80/man/man1/jsadebugd.1
jdk1.7.0_80/man/man1/orbd.1
jdk1.7.0_80/man/man1/javaws.1
jdk1.7.0_80/man/man1/jdb.1
jdk1.7.0_80/man/man1/jstatd.1
jdk1.7.0_80/man/man1/javap.1
jdk1.7.0_80/man/man1/jhat.1
jdk1.7.0_80/man/man1/xjc.1
jdk1.7.0_80/man/man1/jar.1
jdk1.7.0_80/man/man1/policytool.1
jdk1.7.0_80/man/man1/rmiregistry.1
jdk1.7.0_80/man/man1/idlj.1
jdk1.7.0_80/man/man1/jps.1
jdk1.7.0_80/man/man1/unpack200.1
jdk1.7.0_80/man/man1/tnameserv.1
jdk1.7.0_80/man/man1/jrunscript.1
jdk1.7.0_80/man/man1/jmap.1
jdk1.7.0_80/man/man1/jstack.1
jdk1.7.0_80/man/man1/servertool.1
jdk1.7.0_80/man/man1/javafxpackager.1
jdk1.7.0_80/man/man1/jstat.1
jdk1.7.0_80/man/man1/jmc.1
jdk1.7.0_80/man/man1/javac.1
jdk1.7.0_80/man/ja
jdk1.7.0_80/man/ja_JP.UTF-8/
jdk1.7.0_80/man/ja_JP.UTF-8/man1/
jdk1.7.0_80/man/ja_JP.UTF-8/man1/jinfo.1
jdk1.7.0_80/man/ja_JP.UTF-8/man1/rmid.1
jdk1.7.0_80/man/ja_JP.UTF-8/man1/native2ascii.1
jdk1.7.0_80/man/ja_JP.UTF-8/man1/jcmd.1
jdk1.7.0_80/man/ja_JP.UTF-8/man1/java.1
jdk1.7.0_80/man/ja_JP.UTF-8/man1/jarsigner.1
jdk1.7.0_80/man/ja_JP.UTF-8/man1/keytool.1
jdk1.7.0_80/man/ja_JP.UTF-8/man1/jconsole.1
jdk1.7.0_80/man/ja_JP.UTF-8/man1/extcheck.1
jdk1.7.0_80/man/ja_JP.UTF-8/man1/wsimport.1
jdk1.7.0_80/man/ja_JP.UTF-8/man1/pack200.1
jdk1.7.0_80/man/ja_JP.UTF-8/man1/schemagen.1
jdk1.7.0_80/man/ja_JP.UTF-8/man1/javadoc.1
jdk1.7.0_80/man/ja_JP.UTF-8/man1/rmic.1
jdk1.7.0_80/man/ja_JP.UTF-8/man1/serialver.1
jdk1.7.0_80/man/ja_JP.UTF-8/man1/apt.1
jdk1.7.0_80/man/ja_JP.UTF-8/man1/javah.1
jdk1.7.0_80/man/ja_JP.UTF-8/man1/wsgen.1
jdk1.7.0_80/man/ja_JP.UTF-8/man1/jvisualvm.1
jdk1.7.0_80/man/ja_JP.UTF-8/man1/appletviewer.1
jdk1.7.0_80/man/ja_JP.UTF-8/man1/jsadebugd.1
jdk1.7.0_80/man/ja_JP.UTF-8/man1/orbd.1
jdk1.7.0_80/man/ja_JP.UTF-8/man1/javaws.1
jdk1.7.0_80/man/ja_JP.UTF-8/man1/jdb.1
jdk1.7.0_80/man/ja_JP.UTF-8/man1/jstatd.1
jdk1.7.0_80/man/ja_JP.UTF-8/man1/javap.1
jdk1.7.0_80/man/ja_JP.UTF-8/man1/jhat.1
jdk1.7.0_80/man/ja_JP.UTF-8/man1/xjc.1
jdk1.7.0_80/man/ja_JP.UTF-8/man1/jar.1
jdk1.7.0_80/man/ja_JP.UTF-8/man1/policytool.1
jdk1.7.0_80/man/ja_JP.UTF-8/man1/rmiregistry.1
jdk1.7.0_80/man/ja_JP.UTF-8/man1/idlj.1
jdk1.7.0_80/man/ja_JP.UTF-8/man1/jps.1
jdk1.7.0_80/man/ja_JP.UTF-8/man1/unpack200.1
jdk1.7.0_80/man/ja_JP.UTF-8/man1/tnameserv.1
jdk1.7.0_80/man/ja_JP.UTF-8/man1/jrunscript.1
jdk1.7.0_80/man/ja_JP.UTF-8/man1/jmap.1
jdk1.7.0_80/man/ja_JP.UTF-8/man1/jstack.1
jdk1.7.0_80/man/ja_JP.UTF-8/man1/servertool.1
jdk1.7.0_80/man/ja_JP.UTF-8/man1/javafxpackager.1
jdk1.7.0_80/man/ja_JP.UTF-8/man1/jstat.1
jdk1.7.0_80/man/ja_JP.UTF-8/man1/jmc.1
jdk1.7.0_80/man/ja_JP.UTF-8/man1/javac.1
jdk1.7.0_80/include/
jdk1.7.0_80/include/jvmti.h
jdk1.7.0_80/include/classfile_constants.h
jdk1.7.0_80/include/jdwpTransport.h
jdk1.7.0_80/include/jvmticmlr.h
jdk1.7.0_80/include/jni.h
jdk1.7.0_80/include/linux/
jdk1.7.0_80/include/linux/jni_md.h
jdk1.7.0_80/include/linux/jawt_md.h
jdk1.7.0_80/include/jawt.h
jdk1.7.0_80/src.zip
jdk1.7.0_80/THIRDPARTYLICENSEREADME-JAVAFX.txt
jdk1.7.0_80/COPYRIGHT
jdk1.7.0_80/db/
jdk1.7.0_80/db/LICENSE
jdk1.7.0_80/db/RELEASE-NOTES.html
jdk1.7.0_80/db/lib/
jdk1.7.0_80/db/lib/derbyLocale_zh_CN.jar
jdk1.7.0_80/db/lib/derbynet.jar
jdk1.7.0_80/db/lib/derbyLocale_ja_JP.jar
jdk1.7.0_80/db/lib/derbyLocale_ru.jar
jdk1.7.0_80/db/lib/derbyLocale_es.jar
jdk1.7.0_80/db/lib/derbyLocale_it.jar
jdk1.7.0_80/db/lib/derby.jar
jdk1.7.0_80/db/lib/derbytools.jar
jdk1.7.0_80/db/lib/derbyLocale_hu.jar
jdk1.7.0_80/db/lib/derby.war
jdk1.7.0_80/db/lib/derbyrun.jar
jdk1.7.0_80/db/lib/derbyLocale_zh_TW.jar
jdk1.7.0_80/db/lib/derbyLocale_fr.jar
jdk1.7.0_80/db/lib/derbyclient.jar
jdk1.7.0_80/db/lib/derbyLocale_cs.jar
jdk1.7.0_80/db/lib/derbyLocale_pl.jar
jdk1.7.0_80/db/lib/derbyLocale_de_DE.jar
jdk1.7.0_80/db/lib/derbyLocale_ko_KR.jar
jdk1.7.0_80/db/lib/derbyLocale_pt_BR.jar
jdk1.7.0_80/db/3RDPARTY
jdk1.7.0_80/db/bin/
jdk1.7.0_80/db/bin/setNetworkClientCP.bat
jdk1.7.0_80/db/bin/dblook
jdk1.7.0_80/db/bin/NetworkServerControl
jdk1.7.0_80/db/bin/setEmbeddedCP
jdk1.7.0_80/db/bin/stopNetworkServer.bat
jdk1.7.0_80/db/bin/NetworkServerControl.bat
jdk1.7.0_80/db/bin/sysinfo
jdk1.7.0_80/db/bin/ij
jdk1.7.0_80/db/bin/setNetworkServerCP
jdk1.7.0_80/db/bin/setEmbeddedCP.bat
jdk1.7.0_80/db/bin/ij.bat
jdk1.7.0_80/db/bin/dblook.bat
jdk1.7.0_80/db/bin/sysinfo.bat
jdk1.7.0_80/db/bin/setNetworkClientCP
jdk1.7.0_80/db/bin/derby_common.bat
jdk1.7.0_80/db/bin/startNetworkServer.bat
jdk1.7.0_80/db/bin/startNetworkServer
jdk1.7.0_80/db/bin/setNetworkServerCP.bat
jdk1.7.0_80/db/bin/stopNetworkServer
jdk1.7.0_80/db/README-JDK.html
jdk1.7.0_80/db/NOTICE
jdk1.7.0_80/README.html
jdk1.7.0_80/THIRDPARTYLICENSEREADME.txt
Building remotely on jenkins-test-7bb (jenkins-cloud-4GB cloud-slave Ubuntu ubuntu jenkins-cloud-8GB)
in workspace <https://builds.apache.org/job/DeltaSpike%20RAT-Check/ws/>
Unpacking https://repo.maven.apache.org/maven2/org/apache/maven/apache-maven/3.0.4/apache-maven-3.0.4-bin.zip
to /home/jenkins/tools/maven/apache-maven-3.0.4 on jenkins-test-7bb
Wiping out workspace first.
Cloning the remote Git repository
Cloning repository https://git-wip-us.apache.org/repos/asf/deltaspike.git
 > git init <https://builds.apache.org/job/DeltaSpike%20RAT-Check/ws/> # timeout=10
Fetching upstream changes from https://git-wip-us.apache.org/repos/asf/deltaspike.git
 > git --version # timeout=10
 > git -c core.askpass=true fetch --tags --progress https://git-wip-us.apache.org/repos/asf/deltaspike.git
+refs/heads/*:refs/remotes/origin/*
 > git config remote.origin.url https://git-wip-us.apache.org/repos/asf/deltaspike.git
# timeout=10
 > git config --add remote.origin.fetch +refs/heads/*:refs/remotes/origin/* # timeout=10
 > git config remote.origin.url https://git-wip-us.apache.org/repos/asf/deltaspike.git
# timeout=10
Fetching upstream changes from https://git-wip-us.apache.org/repos/asf/deltaspike.git
 > git -c core.askpass=true fetch --tags --progress https://git-wip-us.apache.org/repos/asf/deltaspike.git
+refs/heads/*:refs/remotes/origin/*
 > git rev-parse origin/master^{commit} # timeout=10
Checking out Revision 2e31a27a4184650759f20bf27ca5cafd408f2a90 (origin/master)
 > git config core.sparsecheckout # timeout=10
 > git checkout -f 2e31a27a4184650759f20bf27ca5cafd408f2a90
 > git rev-list 3e7a13f09529d57fcbe57d10adbfcf7825dd65b2 # timeout=10
Parsing POMs
ERROR: Failed to parse POMs
java.io.IOException: remote file operation failed: <https://builds.apache.org/job/DeltaSpike%20RAT-Check/ws/>
at hudson.remoting.Channel@32a95718:jenkins-test-7bb: hudson.remoting.ProxyException: hudson.maven.MavenModuleSetBuild$MavenExecutionException:
hudson.maven.MavenEmbedderException: 1 problem was encountered while building the effective
settings
[FATAL] Non-parseable settings /home/jenkins/.m2/settings.xml: unexpected character in markup
% (position: START_TAG seen ...</username>\n     <password><%... @14:18)  @
/home/jenkins/.m2/settings.xml, line 14, column 18

	at hudson.FilePath.act(FilePath.java:986)
	at hudson.FilePath.act(FilePath.java:968)
	at hudson.maven.MavenModuleSetBuild$MavenModuleSetBuildExecution.parsePoms(MavenModuleSetBuild.java:960)
	at hudson.maven.MavenModuleSetBuild$MavenModuleSetBuildExecution.doRun(MavenModuleSetBuild.java:679)
	at hudson.model.AbstractBuild$AbstractBuildExecution.run(AbstractBuild.java:534)
	at hudson.model.Run.execute(Run.java:1738)
	at hudson.maven.MavenModuleSetBuild.run(MavenModuleSetBuild.java:531)
	at hudson.model.ResourceController.execute(ResourceController.java:98)
	at hudson.model.Executor.run(Executor.java:410)
Caused by: hudson.remoting.ProxyException: hudson.maven.MavenModuleSetBuild$MavenExecutionException:
hudson.maven.MavenEmbedderException: 1 problem was encountered while building the effective
settings
[FATAL] Non-parseable settings /home/jenkins/.m2/settings.xml: unexpected character in markup
% (position: START_TAG seen ...</username>\n     <password><%... @14:18)  @
/home/jenkins/.m2/settings.xml, line 14, column 18

	at hudson.maven.MavenModuleSetBuild$PomParser.invoke(MavenModuleSetBuild.java:1362)
	at hudson.maven.MavenModuleSetBuild$PomParser.invoke(MavenModuleSetBuild.java:1098)
	at hudson.FilePath$FileCallableWrapper.call(FilePath.java:2719)
	at hudson.remoting.UserRequest.perform(UserRequest.java:120)
	at hudson.remoting.UserRequest.perform(UserRequest.java:48)
	at hudson.remoting.Request$2.run(Request.java:326)
	at hudson.remoting.InterceptingExecutorService$1.call(InterceptingExecutorService.java:68)
	at java.util.concurrent.FutureTask.run(FutureTask.java:262)
	at java.util.concurrent.ThreadPoolExecutor.runWorker(ThreadPoolExecutor.java:1145)
	at java.util.concurrent.ThreadPoolExecutor$Worker.run(ThreadPoolExecutor.java:615)
	at java.lang.Thread.run(Thread.java:745)
	at ......remote call to jenkins-test-7bb(Native Method)
	at hudson.remoting.Channel.attachCallSiteStackTrace(Channel.java:1416)
	at hudson.remoting.UserResponse.retrieve(UserRequest.java:220)
	at hudson.remoting.Channel.call(Channel.java:781)
	at hudson.FilePath.act(FilePath.java:979)
	... 8 more
Caused by: hudson.remoting.ProxyException: hudson.maven.MavenEmbedderException: 1 problem
was encountered while building the effective settings
[FATAL] Non-parseable settings /home/jenkins/.m2/settings.xml: unexpected character in markup
% (position: START_TAG seen ...</username>\n     <password><%... @14:18)  @
/home/jenkins/.m2/settings.xml, line 14, column 18

	at hudson.maven.MavenEmbedder.<init>(MavenEmbedder.java:128)
	at hudson.maven.MavenEmbedder.<init>(MavenEmbedder.java:109)
	at hudson.maven.MavenEmbedder.<init>(MavenEmbedder.java:136)
	at hudson.maven.MavenUtil.createEmbedder(MavenUtil.java:212)
	at hudson.maven.MavenModuleSetBuild$PomParser.invoke(MavenModuleSetBuild.java:1295)
	at hudson.maven.MavenModuleSetBuild$PomParser.invoke(MavenModuleSetBuild.java:1098)
	at hudson.FilePath$FileCallableWrapper.call(FilePath.java:2719)
	at hudson.remoting.UserRequest.perform(UserRequest.java:120)
	at hudson.remoting.UserRequest.perform(UserRequest.java:48)
	at hudson.remoting.Request$2.run(Request.java:326)
	at hudson.remoting.InterceptingExecutorService$1.call(InterceptingExecutorService.java:68)
	at java.util.concurrent.FutureTask.run(FutureTask.java:262)
	at java.util.concurrent.ThreadPoolExecutor.runWorker(ThreadPoolExecutor.java:1145)
	at java.util.concurrent.ThreadPoolExecutor$Worker.run(ThreadPoolExecutor.java:615)
	at java.lang.Thread.run(Thread.java:745)
Caused by: hudson.remoting.ProxyException: hudson.maven.MavenEmbedderException: 1 problem
was encountered while building the effective settings
[FATAL] Non-parseable settings /home/jenkins/.m2/settings.xml: unexpected character in markup
% (position: START_TAG seen ...</username>\n     <password><%... @14:18)  @
/home/jenkins/.m2/settings.xml, line 14, column 18

	at hudson.maven.MavenEmbedder.getSettings(MavenEmbedder.java:261)
	at hudson.maven.MavenEmbedder.buildMavenExecutionRequest(MavenEmbedder.java:157)
	at hudson.maven.MavenEmbedder.<init>(MavenEmbedder.java:120)
	... 14 more
Caused by: hudson.remoting.ProxyException: org.apache.maven.settings.building.SettingsBuildingException:
1 problem was encountered while building the effective settings
[FATAL] Non-parseable settings /home/jenkins/.m2/settings.xml: unexpected character in markup
% (position: START_TAG seen ...</username>\n     <password><%... @14:18)  @
/home/jenkins/.m2/settings.xml, line 14, column 18

	at org.apache.maven.settings.building.DefaultSettingsBuilder.build(DefaultSettingsBuilder.java:116)
	at hudson.maven.MavenEmbedder.getSettings(MavenEmbedder.java:259)
	... 16 more

Mime
View raw message