deltaspike-commits mailing list archives

Site index · List index
Message view « Date » · « Thread »
Top « Date » · « Thread »
From Apache Jenkins Server <jenk...@builds.apache.org>
Subject Build failed in Jenkins: DeltaSpike Deploy #1437
Date Mon, 25 Apr 2016 14:01:59 GMT
See <https://builds.apache.org/job/DeltaSpike%20Deploy/1437/changes>

Changes:

[johndament] DELTASPIKE-1112 Fixed up the resources directories.

------------------------------------------
[...truncated 7368 lines...]
[INFO] Exclude: **/*.iml
[INFO] 
[INFO] --- maven-bundle-plugin:2.3.7:cleanVersions (versions) @ deltaspike-bean-validation-module-impl
---
[INFO] 
[INFO] --- maven-antrun-plugin:1.7:run (javadoc.resources) @ deltaspike-bean-validation-module-impl
---
[WARNING] Parameter tasks is deprecated, use target instead
[INFO] Executing tasks

main:
[INFO] Executed tasks
[WARNING] Failed to getClass for org.apache.maven.plugin.source.SourceJarMojo
[INFO] 
[INFO] --- maven-source-plugin:2.4:jar (default-cli) @ deltaspike-bean-validation-module-impl
---
[INFO]                                                                         
[INFO] ------------------------------------------------------------------------
[INFO] Building Apache DeltaSpike Data-Module 1.6.1-SNAPSHOT
[INFO] ------------------------------------------------------------------------
[INFO] 
[INFO] --- maven-clean-plugin:2.5:clean (default-clean) @ data-module-project ---
[INFO] Deleting <https://builds.apache.org/job/DeltaSpike%20Deploy/ws/deltaspike/modules/data/target>
[INFO] 
[INFO] --- apache-rat-plugin:0.8:check (default) @ data-module-project ---
[INFO] Exclude: .idea/**/*
[INFO] Exclude: readme/**/*
[INFO] Exclude: **/*.log
[INFO] Exclude: target/**
[INFO] Exclude: **/*.iml
[INFO] ------------------------------------------------------------------------
[INFO] Reactor Summary:
[INFO] 
[INFO] Apache DeltaSpike ................................. SUCCESS [16.114s]
[INFO] Apache DeltaSpike Sources ......................... SUCCESS [16.132s]
[INFO] Apache DeltaSpike CheckStyle-rules ................ SUCCESS [10.329s]
[INFO] Apache DeltaSpike Parent .......................... SUCCESS [14.704s]
[INFO] Apache DeltaSpike Test-Utils ...................... SUCCESS [19.210s]
[INFO] Apache DeltaSpike Code Parent ..................... SUCCESS [10.929s]
[INFO] Apache DeltaSpike Core ............................ SUCCESS [19.412s]
[INFO] Apache DeltaSpike Core-API ........................ SUCCESS [54.693s]
[INFO] Apache DeltaSpike Core-Implementation ............. SUCCESS [59.342s]
[INFO] Apache DeltaSpike ContainerControl parent ......... SUCCESS [8.134s]
[INFO] Apache DeltaSpike CDI ContainerControl API ........ SUCCESS [13.412s]
[INFO] Apache DeltaSpike CDI ContainerControl TCK ........ SUCCESS [14.071s]
[INFO] Apache DeltaSpike CDI OWB-ContainerControl ........ SUCCESS [18.655s]
[INFO] Apache DeltaSpike CDI Weld-ContainerControl ....... SUCCESS [15.721s]
[INFO] Apache DeltaSpike CDI OpenEJB-ContainerControl .... SUCCESS [21.809s]
[INFO] Apache DeltaSpike CDI Servlet-ContainerControl .... SUCCESS [18.482s]
[INFO] Apache DeltaSpike Modules ......................... SUCCESS [11.557s]
[INFO] Apache DeltaSpike Proxy-Module .................... SUCCESS [9.559s]
[INFO] Apache DeltaSpike Proxy-Module API ................ SUCCESS [20.581s]
[INFO] Apache DeltaSpike Proxy-Module Impl ASM5 .......... SUCCESS [20.053s]
[INFO] Apache DeltaSpike Security-Module ................. SUCCESS [10.617s]
[INFO] Apache DeltaSpike Security-Module API ............. SUCCESS [15.990s]
[INFO] Apache DeltaSpike Security-Module Impl ............ SUCCESS [22.155s]
[INFO] Apache DeltaSpike JPA-Module ...................... SUCCESS [10.540s]
[INFO] Apache DeltaSpike JPA-Module API .................. SUCCESS [19.186s]
[INFO] Apache DeltaSpike JPA-Module Impl ................. SUCCESS [32.438s]
[INFO] Apache DeltaSpike Servlet-Module .................. SUCCESS [9.618s]
[INFO] Apache DeltaSpike Servlet-Module API .............. SUCCESS [15.367s]
[INFO] Apache DeltaSpike Servlet-Module Impl ............. SUCCESS [17.220s]
[INFO] Apache DeltaSpike JSF-Module ...................... SUCCESS [12.961s]
[INFO] Apache DeltaSpike JSF-Module API .................. SUCCESS [17.205s]
[INFO] Apache DeltaSpike JSF-Module Impl ................. SUCCESS [42.725s]
[INFO] Apache DeltaSpike JSF-Module Impl (EE6 only) ...... SUCCESS [16.533s]
[INFO] Apache DeltaSpike Partial-Bean-Module ............. SUCCESS [10.029s]
[INFO] Apache DeltaSpike Partial-Bean-Module API ......... SUCCESS [16.760s]
[INFO] Apache DeltaSpike Partial-Bean-Module Impl ........ SUCCESS [23.736s]
[INFO] Apache DeltaSpike BeanValidation-Module ........... SUCCESS [9.677s]
[INFO] Apache DeltaSpike BeanValidation-Module API ....... SUCCESS [15.746s]
[INFO] Apache DeltaSpike BeanValidation-Module Impl ...... SUCCESS [19.928s]
[INFO] Apache DeltaSpike Data-Module ..................... FAILURE [0.705s]
[INFO] Apache DeltaSpike Data-Module API ................. SKIPPED
[INFO] Apache DeltaSpike Data-Module Impl ................ SKIPPED
[INFO] Apache DeltaSpike Scheduler-Module ................ SKIPPED
[INFO] Apache DeltaSpike Scheduler-Module API ............ SKIPPED
[INFO] Apache DeltaSpike Scheduler-Module Impl ........... SKIPPED
[INFO] Apache DeltaSpike Test-Control-Module ............. SKIPPED
[INFO] Apache DeltaSpike Test-Control-Module API ......... SKIPPED
[INFO] Apache DeltaSpike Test-Control-Module Impl ........ SKIPPED
[INFO] Apache DeltaSpike Examples ........................ SKIPPED
[INFO] Apache DeltaSpike Java-SE Examples ................ SKIPPED
[INFO] Apache DeltaSpike JSF Examples .................... SKIPPED
[INFO] Apache DeltaSpike JSF Playground .................. SKIPPED
[INFO] Apache DeltaSpike Security Example CDI ............ SKIPPED
[INFO] Apache DeltaSpike Security Example PicketLink ..... SKIPPED
[INFO] Apache DeltaSpike Java-SE Scheduler Examples ...... SKIPPED
[INFO] Apache DeltaSpike Distribution .................... SKIPPED
[INFO] Apache DeltaSpike Distribution Bill of Materials .. SKIPPED
[INFO] Apache DeltaSpike Full Distribution ............... SKIPPED
[INFO] Apache DeltaSpike Documentation ................... SKIPPED
[INFO] Apache DeltaSpike Site ............................ SKIPPED
[INFO] ------------------------------------------------------------------------
[INFO] BUILD FAILURE
[INFO] ------------------------------------------------------------------------
[INFO] Total time: 13:06.628s
[INFO] Finished at: Mon Apr 25 14:00:39 UTC 2016
[INFO] Final Memory: 108M/857M
[INFO] ------------------------------------------------------------------------
Waiting for Jenkins to finish collecting data
[ERROR] Failed to execute goal org.apache.rat:apache-rat-plugin:0.8:check (default) on project
data-module-project: Too many unapproved licenses: 15 -> [Help 1]
[ERROR] 
[ERROR] To see the full stack trace of the errors, re-run Maven with the -e switch.
[ERROR] Re-run Maven using the -X switch to enable full debug logging.
[ERROR] 
[ERROR] For more information about the errors and possible solutions, please read the following
articles:
[ERROR] [Help 1] http://cwiki.apache.org/confluence/display/MAVEN/MojoFailureException
[ERROR] 
[ERROR] After correcting the problems, you can resume the build with the command
[ERROR]   mvn <goals> -rf :data-module-project
[JENKINS] Archiving <https://builds.apache.org/job/DeltaSpike%20Deploy/ws/deltaspike/examples/jse-examples/pom.xml>
to org.apache.deltaspike.examples/deltaspike-jse-example/1.6.1-SNAPSHOT/deltaspike-jse-example-1.6.1-SNAPSHOT.pom
[JENKINS] Archiving <https://builds.apache.org/job/DeltaSpike%20Deploy/ws/deltaspike/examples/security-requested-page-after-login-cdi/pom.xml>
to org.apache.deltaspike.examples/deltaspike-security-requested-page-after-login-cdi/1.6.1-SNAPSHOT/deltaspike-security-requested-page-after-login-cdi-1.6.1-SNAPSHOT.pom
[JENKINS] Archiving <https://builds.apache.org/job/DeltaSpike%20Deploy/ws/deltaspike/test-utils/pom.xml>
to org.apache.deltaspike.test/test-utils/1.6.1-SNAPSHOT/test-utils-1.6.1-SNAPSHOT.pom
[JENKINS] Archiving <https://builds.apache.org/job/DeltaSpike%20Deploy/ws/deltaspike/test-utils/target/test-utils-1.6.1-SNAPSHOT.jar>
to org.apache.deltaspike.test/test-utils/1.6.1-20160425.134849-25/test-utils-1.6.1-20160425.134849-25.jar
[JENKINS] Archiving <https://builds.apache.org/job/DeltaSpike%20Deploy/ws/deltaspike/test-utils/target/test-utils-1.6.1-SNAPSHOT-sources.jar>
to org.apache.deltaspike.test/test-utils/1.6.1-20160425.134849-25/test-utils-1.6.1-20160425.134849-25-sources.jar
[JENKINS] Archiving <https://builds.apache.org/job/DeltaSpike%20Deploy/ws/documentation/pom.xml>
to org.apache.deltaspike/deltaspike-documentation/1.6.1-SNAPSHOT/deltaspike-documentation-1.6.1-SNAPSHOT.pom
[JENKINS] Archiving <https://builds.apache.org/job/DeltaSpike%20Deploy/ws/deltaspike/modules/data/impl/pom.xml>
to org.apache.deltaspike.modules/deltaspike-data-module-impl/1.6.1-SNAPSHOT/deltaspike-data-module-impl-1.6.1-SNAPSHOT.pom
[JENKINS] Archiving <https://builds.apache.org/job/DeltaSpike%20Deploy/ws/deltaspike/modules/data/api/pom.xml>
to org.apache.deltaspike.modules/deltaspike-data-module-api/1.6.1-SNAPSHOT/deltaspike-data-module-api-1.6.1-SNAPSHOT.pom
[JENKINS] Archiving <https://builds.apache.org/job/DeltaSpike%20Deploy/ws/deltaspike/core/impl/pom.xml>
to org.apache.deltaspike.core/deltaspike-core-impl/1.6.1-SNAPSHOT/deltaspike-core-impl-1.6.1-SNAPSHOT.pom
[JENKINS] Archiving <https://builds.apache.org/job/DeltaSpike%20Deploy/ws/deltaspike/core/impl/target/deltaspike-core-impl-1.6.1-SNAPSHOT.jar>
to org.apache.deltaspike.core/deltaspike-core-impl/1.6.1-20160425.135117-25/deltaspike-core-impl-1.6.1-20160425.135117-25.jar
[JENKINS] Archiving <https://builds.apache.org/job/DeltaSpike%20Deploy/ws/deltaspike/core/impl/target/deltaspike-core-impl-1.6.1-SNAPSHOT-tests.jar>
to org.apache.deltaspike.core/deltaspike-core-impl/1.6.1-20160425.135117-25/deltaspike-core-impl-1.6.1-20160425.135117-25-tests.jar
[JENKINS] Archiving <https://builds.apache.org/job/DeltaSpike%20Deploy/ws/deltaspike/core/impl/target/deltaspike-core-impl-1.6.1-SNAPSHOT-sources.jar>
to org.apache.deltaspike.core/deltaspike-core-impl/1.6.1-20160425.135117-25/deltaspike-core-impl-1.6.1-20160425.135117-25-sources.jar
[JENKINS] Archiving <https://builds.apache.org/job/DeltaSpike%20Deploy/ws/deltaspike/modules/pom.xml>
to org.apache.deltaspike.modules/modules-project/1.6.1-SNAPSHOT/modules-project-1.6.1-SNAPSHOT.pom
[JENKINS] Archiving <https://builds.apache.org/job/DeltaSpike%20Deploy/ws/deltaspike/modules/target/modules-project-1.6.1-SNAPSHOT-tests.jar>
to org.apache.deltaspike.modules/modules-project/1.6.1-20160425.135332-25/modules-project-1.6.1-20160425.135332-25-tests.jar
[JENKINS] Archiving <https://builds.apache.org/job/DeltaSpike%20Deploy/ws/deltaspike/modules/test-control/pom.xml>
to org.apache.deltaspike.modules/test-control-module-project/1.6.1-SNAPSHOT/test-control-module-project-1.6.1-SNAPSHOT.pom
[JENKINS] Archiving <https://builds.apache.org/job/DeltaSpike%20Deploy/ws/deltaspike/examples/jsf-examples/pom.xml>
to org.apache.deltaspike.examples/deltaspike-jsf-example/1.6.1-SNAPSHOT/deltaspike-jsf-example-1.6.1-SNAPSHOT.pom
[JENKINS] Archiving <https://builds.apache.org/job/DeltaSpike%20Deploy/ws/deltaspike/cdictrl/servlet/pom.xml>
to org.apache.deltaspike.cdictrl/deltaspike-cdictrl-servlet/1.6.1-SNAPSHOT/deltaspike-cdictrl-servlet-1.6.1-SNAPSHOT.pom
[JENKINS] Archiving <https://builds.apache.org/job/DeltaSpike%20Deploy/ws/deltaspike/cdictrl/servlet/target/deltaspike-cdictrl-servlet-1.6.1-SNAPSHOT.jar>
to org.apache.deltaspike.cdictrl/deltaspike-cdictrl-servlet/1.6.1-20160425.135319-25/deltaspike-cdictrl-servlet-1.6.1-20160425.135319-25.jar
[JENKINS] Archiving <https://builds.apache.org/job/DeltaSpike%20Deploy/ws/deltaspike/cdictrl/servlet/target/deltaspike-cdictrl-servlet-1.6.1-SNAPSHOT-sources.jar>
to org.apache.deltaspike.cdictrl/deltaspike-cdictrl-servlet/1.6.1-20160425.135319-25/deltaspike-cdictrl-servlet-1.6.1-20160425.135319-25-sources.jar
[JENKINS] Archiving <https://builds.apache.org/job/DeltaSpike%20Deploy/ws/deltaspike/cdictrl/api/pom.xml>
to org.apache.deltaspike.cdictrl/deltaspike-cdictrl-api/1.6.1-SNAPSHOT/deltaspike-cdictrl-api-1.6.1-SNAPSHOT.pom
[JENKINS] Archiving <https://builds.apache.org/job/DeltaSpike%20Deploy/ws/deltaspike/cdictrl/api/target/deltaspike-cdictrl-api-1.6.1-SNAPSHOT.jar>
to org.apache.deltaspike.cdictrl/deltaspike-cdictrl-api/1.6.1-20160425.135144-25/deltaspike-cdictrl-api-1.6.1-20160425.135144-25.jar
[JENKINS] Archiving <https://builds.apache.org/job/DeltaSpike%20Deploy/ws/deltaspike/cdictrl/api/target/deltaspike-cdictrl-api-1.6.1-SNAPSHOT-sources.jar>
to org.apache.deltaspike.cdictrl/deltaspike-cdictrl-api/1.6.1-20160425.135144-25/deltaspike-cdictrl-api-1.6.1-20160425.135144-25-sources.jar
[JENKINS] Archiving <https://builds.apache.org/job/DeltaSpike%20Deploy/ws/deltaspike/examples/scheduler-playground/pom.xml>
to org.apache.deltaspike.examples/deltaspike-scheduler-example/1.6.1-SNAPSHOT/deltaspike-scheduler-example-1.6.1-SNAPSHOT.pom
[JENKINS] Archiving <https://builds.apache.org/job/DeltaSpike%20Deploy/ws/deltaspike/checkstyle-rules/pom.xml>
to org.apache.deltaspike/checkstyle-rules/1.6.1-SNAPSHOT/checkstyle-rules-1.6.1-SNAPSHOT.pom
[JENKINS] Archiving <https://builds.apache.org/job/DeltaSpike%20Deploy/ws/deltaspike/checkstyle-rules/target/checkstyle-rules-1.6.1-SNAPSHOT.jar>
to org.apache.deltaspike/checkstyle-rules/1.6.1-20160425.134817-25/checkstyle-rules-1.6.1-20160425.134817-25.jar
[JENKINS] Archiving <https://builds.apache.org/job/DeltaSpike%20Deploy/ws/deltaspike/checkstyle-rules/target/checkstyle-rules-1.6.1-SNAPSHOT-sources.jar>
to org.apache.deltaspike/checkstyle-rules/1.6.1-20160425.134817-25/checkstyle-rules-1.6.1-20160425.134817-25-sources.jar
[JENKINS] Archiving <https://builds.apache.org/job/DeltaSpike%20Deploy/ws/deltaspike/parent/code/pom.xml>
to org.apache.deltaspike/parent-code/1.6.1-SNAPSHOT/parent-code-1.6.1-SNAPSHOT.pom
[JENKINS] Archiving <https://builds.apache.org/job/DeltaSpike%20Deploy/ws/deltaspike/parent/code/target/parent-code-1.6.1-SNAPSHOT-tests.jar>
to org.apache.deltaspike/parent-code/1.6.1-20160425.134904-25/parent-code-1.6.1-20160425.134904-25-tests.jar
Compressed 79.66 KB of artifacts by 40.2% relative to #1436
[JENKINS] Archiving <https://builds.apache.org/job/DeltaSpike%20Deploy/ws/deltaspike/modules/jsf/impl/pom.xml>
to org.apache.deltaspike.modules/deltaspike-jsf-module-impl/1.6.1-SNAPSHOT/deltaspike-jsf-module-impl-1.6.1-SNAPSHOT.pom
[JENKINS] Archiving <https://builds.apache.org/job/DeltaSpike%20Deploy/ws/deltaspike/modules/jsf/impl/target/deltaspike-jsf-module-impl-1.6.1-SNAPSHOT.jar>
to org.apache.deltaspike.modules/deltaspike-jsf-module-impl/1.6.1-20160425.135823-25/deltaspike-jsf-module-impl-1.6.1-20160425.135823-25.jar
[JENKINS] Archiving <https://builds.apache.org/job/DeltaSpike%20Deploy/ws/deltaspike/modules/jsf/impl/target/deltaspike-jsf-module-impl-1.6.1-SNAPSHOT-tests.jar>
to org.apache.deltaspike.modules/deltaspike-jsf-module-impl/1.6.1-20160425.135823-25/deltaspike-jsf-module-impl-1.6.1-20160425.135823-25-tests.jar
[JENKINS] Archiving <https://builds.apache.org/job/DeltaSpike%20Deploy/ws/deltaspike/modules/jsf/impl/target/deltaspike-jsf-module-impl-1.6.1-SNAPSHOT-sources.jar>
to org.apache.deltaspike.modules/deltaspike-jsf-module-impl/1.6.1-20160425.135823-25/deltaspike-jsf-module-impl-1.6.1-20160425.135823-25-sources.jar
[JENKINS] Archiving <https://builds.apache.org/job/DeltaSpike%20Deploy/ws/deltaspike/modules/partial-bean/pom.xml>
to org.apache.deltaspike.modules/partial-bean-module-project/1.6.1-SNAPSHOT/partial-bean-module-project-1.6.1-SNAPSHOT.pom
[JENKINS] Archiving <https://builds.apache.org/job/DeltaSpike%20Deploy/ws/deltaspike/modules/partial-bean/target/partial-bean-module-project-1.6.1-SNAPSHOT-tests.jar>
to org.apache.deltaspike.modules/partial-bean-module-project/1.6.1-20160425.135857-25/partial-bean-module-project-1.6.1-20160425.135857-25-tests.jar
[JENKINS] Archiving <https://builds.apache.org/job/DeltaSpike%20Deploy/ws/deltaspike/examples/pom.xml>
to org.apache.deltaspike.examples/examples-project/1.6.1-SNAPSHOT/examples-project-1.6.1-SNAPSHOT.pom
[JENKINS] Archiving <https://builds.apache.org/job/DeltaSpike%20Deploy/ws/deltaspike/cdictrl/impl-openejb/pom.xml>
to org.apache.deltaspike.cdictrl/deltaspike-cdictrl-openejb/1.6.1-SNAPSHOT/deltaspike-cdictrl-openejb-1.6.1-SNAPSHOT.pom
[JENKINS] Archiving <https://builds.apache.org/job/DeltaSpike%20Deploy/ws/deltaspike/cdictrl/impl-openejb/target/deltaspike-cdictrl-openejb-1.6.1-SNAPSHOT.jar>
to org.apache.deltaspike.cdictrl/deltaspike-cdictrl-openejb/1.6.1-20160425.135259-23/deltaspike-cdictrl-openejb-1.6.1-20160425.135259-23.jar
[JENKINS] Archiving <https://builds.apache.org/job/DeltaSpike%20Deploy/ws/deltaspike/cdictrl/impl-openejb/target/deltaspike-cdictrl-openejb-1.6.1-SNAPSHOT-sources.jar>
to org.apache.deltaspike.cdictrl/deltaspike-cdictrl-openejb/1.6.1-20160425.135259-23/deltaspike-cdictrl-openejb-1.6.1-20160425.135259-23-sources.jar
[JENKINS] Archiving <https://builds.apache.org/job/DeltaSpike%20Deploy/ws/deltaspike/modules/jsf/pom.xml>
to org.apache.deltaspike.modules/jsf-module-project/1.6.1-SNAPSHOT/jsf-module-project-1.6.1-SNAPSHOT.pom
[JENKINS] Archiving <https://builds.apache.org/job/DeltaSpike%20Deploy/ws/deltaspike/modules/jsf/target/jsf-module-project-1.6.1-SNAPSHOT-tests.jar>
to org.apache.deltaspike.modules/jsf-module-project/1.6.1-20160425.135723-25/jsf-module-project-1.6.1-20160425.135723-25-tests.jar
[JENKINS] Archiving <https://builds.apache.org/job/DeltaSpike%20Deploy/ws/deltaspike/cdictrl/tck/pom.xml>
to org.apache.deltaspike.test/deltaspike-cdictrl-tck/1.6.1-SNAPSHOT/deltaspike-cdictrl-tck-1.6.1-SNAPSHOT.pom
[JENKINS] Archiving <https://builds.apache.org/job/DeltaSpike%20Deploy/ws/deltaspike/cdictrl/tck/target/deltaspike-cdictrl-tck-1.6.1-SNAPSHOT.jar>
to org.apache.deltaspike.test/deltaspike-cdictrl-tck/1.6.1-20160425.135200-25/deltaspike-cdictrl-tck-1.6.1-20160425.135200-25.jar
[JENKINS] Archiving <https://builds.apache.org/job/DeltaSpike%20Deploy/ws/deltaspike/cdictrl/tck/target/deltaspike-cdictrl-tck-1.6.1-SNAPSHOT-sources.jar>
to org.apache.deltaspike.test/deltaspike-cdictrl-tck/1.6.1-20160425.135200-25/deltaspike-cdictrl-tck-1.6.1-20160425.135200-25-sources.jar
[JENKINS] Archiving <https://builds.apache.org/job/DeltaSpike%20Deploy/ws/deltaspike/modules/jsf/api/pom.xml>
to org.apache.deltaspike.modules/deltaspike-jsf-module-api/1.6.1-SNAPSHOT/deltaspike-jsf-module-api-1.6.1-SNAPSHOT.pom
[JENKINS] Archiving <https://builds.apache.org/job/DeltaSpike%20Deploy/ws/deltaspike/modules/jsf/api/target/deltaspike-jsf-module-api-1.6.1-SNAPSHOT.jar>
to org.apache.deltaspike.modules/deltaspike-jsf-module-api/1.6.1-20160425.135740-25/deltaspike-jsf-module-api-1.6.1-20160425.135740-25.jar
[JENKINS] Archiving <https://builds.apache.org/job/DeltaSpike%20Deploy/ws/deltaspike/modules/jsf/api/target/deltaspike-jsf-module-api-1.6.1-SNAPSHOT-tests.jar>
to org.apache.deltaspike.modules/deltaspike-jsf-module-api/1.6.1-20160425.135740-25/deltaspike-jsf-module-api-1.6.1-20160425.135740-25-tests.jar
[JENKINS] Archiving <https://builds.apache.org/job/DeltaSpike%20Deploy/ws/deltaspike/modules/jsf/api/target/deltaspike-jsf-module-api-1.6.1-SNAPSHOT-sources.jar>
to org.apache.deltaspike.modules/deltaspike-jsf-module-api/1.6.1-20160425.135740-25/deltaspike-jsf-module-api-1.6.1-20160425.135740-25-sources.jar
[JENKINS] Archiving <https://builds.apache.org/job/DeltaSpike%20Deploy/ws/deltaspike/modules/security/pom.xml>
to org.apache.deltaspike.modules/security-module-project/1.6.1-SNAPSHOT/security-module-project-1.6.1-SNAPSHOT.pom
[JENKINS] Archiving <https://builds.apache.org/job/DeltaSpike%20Deploy/ws/deltaspike/modules/security/target/security-module-project-1.6.1-SNAPSHOT-tests.jar>
to org.apache.deltaspike.modules/security-module-project/1.6.1-20160425.135438-25/security-module-project-1.6.1-20160425.135438-25-tests.jar
[JENKINS] Archiving <https://builds.apache.org/job/DeltaSpike%20Deploy/ws/deltaspike/modules/bean-validation/pom.xml>
to org.apache.deltaspike.modules/bean-validation-module-project/1.6.1-SNAPSHOT/bean-validation-module-project-1.6.1-SNAPSHOT.pom
[JENKINS] Archiving <https://builds.apache.org/job/DeltaSpike%20Deploy/ws/deltaspike/modules/bean-validation/target/bean-validation-module-project-1.6.1-SNAPSHOT-tests.jar>
to org.apache.deltaspike.modules/bean-validation-module-project/1.6.1-20160425.135952-25/bean-validation-module-project-1.6.1-20160425.135952-25-tests.jar
[JENKINS] Archiving <https://builds.apache.org/job/DeltaSpike%20Deploy/ws/deltaspike/modules/partial-bean/impl/pom.xml>
to org.apache.deltaspike.modules/deltaspike-partial-bean-module-impl/1.6.1-SNAPSHOT/deltaspike-partial-bean-module-impl-1.6.1-SNAPSHOT.pom
[JENKINS] Archiving <https://builds.apache.org/job/DeltaSpike%20Deploy/ws/deltaspike/modules/partial-bean/impl/target/deltaspike-partial-bean-module-impl-1.6.1-SNAPSHOT.jar>
to org.apache.deltaspike.modules/deltaspike-partial-bean-module-impl/1.6.1-20160425.135937-25/deltaspike-partial-bean-module-impl-1.6.1-20160425.135937-25.jar
[JENKINS] Archiving <https://builds.apache.org/job/DeltaSpike%20Deploy/ws/deltaspike/modules/partial-bean/impl/target/deltaspike-partial-bean-module-impl-1.6.1-SNAPSHOT-tests.jar>
to org.apache.deltaspike.modules/deltaspike-partial-bean-module-impl/1.6.1-20160425.135937-25/deltaspike-partial-bean-module-impl-1.6.1-20160425.135937-25-tests.jar
[JENKINS] Archiving <https://builds.apache.org/job/DeltaSpike%20Deploy/ws/deltaspike/modules/partial-bean/impl/target/deltaspike-partial-bean-module-impl-1.6.1-SNAPSHOT-sources.jar>
to org.apache.deltaspike.modules/deltaspike-partial-bean-module-impl/1.6.1-20160425.135937-25/deltaspike-partial-bean-module-impl-1.6.1-20160425.135937-25-sources.jar
[JENKINS] Archiving <https://builds.apache.org/job/DeltaSpike%20Deploy/ws/deltaspike/modules/proxy/api/pom.xml>
to org.apache.deltaspike.modules/deltaspike-proxy-module-api/1.6.1-SNAPSHOT/deltaspike-proxy-module-api-1.6.1-SNAPSHOT.pom
[JENKINS] Archiving <https://builds.apache.org/job/DeltaSpike%20Deploy/ws/deltaspike/modules/proxy/api/target/deltaspike-proxy-module-api-1.6.1-SNAPSHOT.jar>
to org.apache.deltaspike.modules/deltaspike-proxy-module-api/1.6.1-20160425.135401-25/deltaspike-proxy-module-api-1.6.1-20160425.135401-25.jar
[JENKINS] Archiving <https://builds.apache.org/job/DeltaSpike%20Deploy/ws/deltaspike/modules/proxy/api/target/deltaspike-proxy-module-api-1.6.1-SNAPSHOT-tests.jar>
to org.apache.deltaspike.modules/deltaspike-proxy-module-api/1.6.1-20160425.135401-25/deltaspike-proxy-module-api-1.6.1-20160425.135401-25-tests.jar
[JENKINS] Archiving <https://builds.apache.org/job/DeltaSpike%20Deploy/ws/deltaspike/modules/proxy/api/target/deltaspike-proxy-module-api-1.6.1-SNAPSHOT-sources.jar>
to org.apache.deltaspike.modules/deltaspike-proxy-module-api/1.6.1-20160425.135401-25/deltaspike-proxy-module-api-1.6.1-20160425.135401-25-sources.jar
[JENKINS] Archiving <https://builds.apache.org/job/DeltaSpike%20Deploy/ws/deltaspike/cdictrl/impl-weld/pom.xml>
to org.apache.deltaspike.cdictrl/deltaspike-cdictrl-weld/1.6.1-SNAPSHOT/deltaspike-cdictrl-weld-1.6.1-SNAPSHOT.pom
[JENKINS] Archiving <https://builds.apache.org/job/DeltaSpike%20Deploy/ws/deltaspike/cdictrl/impl-weld/target/deltaspike-cdictrl-weld-1.6.1-SNAPSHOT.jar>
to org.apache.deltaspike.cdictrl/deltaspike-cdictrl-weld/1.6.1-20160425.135237-23/deltaspike-cdictrl-weld-1.6.1-20160425.135237-23.jar
[JENKINS] Archiving <https://builds.apache.org/job/DeltaSpike%20Deploy/ws/deltaspike/cdictrl/impl-weld/target/deltaspike-cdictrl-weld-1.6.1-SNAPSHOT-sources.jar>
to org.apache.deltaspike.cdictrl/deltaspike-cdictrl-weld/1.6.1-20160425.135237-23/deltaspike-cdictrl-weld-1.6.1-20160425.135237-23-sources.jar
[JENKINS] Archiving <https://builds.apache.org/job/DeltaSpike%20Deploy/ws/deltaspike/modules/jpa/api/pom.xml>
to org.apache.deltaspike.modules/deltaspike-jpa-module-api/1.6.1-SNAPSHOT/deltaspike-jpa-module-api-1.6.1-SNAPSHOT.pom
[JENKINS] Archiving <https://builds.apache.org/job/DeltaSpike%20Deploy/ws/deltaspike/modules/jpa/api/target/deltaspike-jpa-module-api-1.6.1-SNAPSHOT.jar>
to org.apache.deltaspike.modules/deltaspike-jpa-module-api/1.6.1-20160425.135548-25/deltaspike-jpa-module-api-1.6.1-20160425.135548-25.jar
[JENKINS] Archiving <https://builds.apache.org/job/DeltaSpike%20Deploy/ws/deltaspike/modules/jpa/api/target/deltaspike-jpa-module-api-1.6.1-SNAPSHOT-tests.jar>
to org.apache.deltaspike.modules/deltaspike-jpa-module-api/1.6.1-20160425.135548-25/deltaspike-jpa-module-api-1.6.1-20160425.135548-25-tests.jar
[JENKINS] Archiving <https://builds.apache.org/job/DeltaSpike%20Deploy/ws/deltaspike/modules/jpa/api/target/deltaspike-jpa-module-api-1.6.1-SNAPSHOT-sources.jar>
to org.apache.deltaspike.modules/deltaspike-jpa-module-api/1.6.1-20160425.135548-25/deltaspike-jpa-module-api-1.6.1-20160425.135548-25-sources.jar
[JENKINS] Archiving <https://builds.apache.org/job/DeltaSpike%20Deploy/ws/deltaspike/dist/full/pom.xml>
to org.apache.deltaspike.distribution/distribution-full/1.6.1-SNAPSHOT/distribution-full-1.6.1-SNAPSHOT.pom
[JENKINS] Archiving <https://builds.apache.org/job/DeltaSpike%20Deploy/ws/deltaspike/modules/servlet/api/pom.xml>
to org.apache.deltaspike.modules/deltaspike-servlet-module-api/1.6.1-SNAPSHOT/deltaspike-servlet-module-api-1.6.1-SNAPSHOT.pom
[JENKINS] Archiving <https://builds.apache.org/job/DeltaSpike%20Deploy/ws/deltaspike/modules/servlet/api/target/deltaspike-servlet-module-api-1.6.1-SNAPSHOT.jar>
to org.apache.deltaspike.modules/deltaspike-servlet-module-api/1.6.1-20160425.135649-25/deltaspike-servlet-module-api-1.6.1-20160425.135649-25.jar
[JENKINS] Archiving <https://builds.apache.org/job/DeltaSpike%20Deploy/ws/deltaspike/modules/servlet/api/target/deltaspike-servlet-module-api-1.6.1-SNAPSHOT-tests.jar>
to org.apache.deltaspike.modules/deltaspike-servlet-module-api/1.6.1-20160425.135649-25/deltaspike-servlet-module-api-1.6.1-20160425.135649-25-tests.jar
[JENKINS] Archiving <https://builds.apache.org/job/DeltaSpike%20Deploy/ws/deltaspike/modules/servlet/api/target/deltaspike-servlet-module-api-1.6.1-SNAPSHOT-sources.jar>
to org.apache.deltaspike.modules/deltaspike-servlet-module-api/1.6.1-20160425.135649-25/deltaspike-servlet-module-api-1.6.1-20160425.135649-25-sources.jar
[JENKINS] Archiving <https://builds.apache.org/job/DeltaSpike%20Deploy/ws/deltaspike/modules/jpa/pom.xml>
to org.apache.deltaspike.modules/jpa-module-project/1.6.1-SNAPSHOT/jpa-module-project-1.6.1-SNAPSHOT.pom
[JENKINS] Archiving <https://builds.apache.org/job/DeltaSpike%20Deploy/ws/deltaspike/modules/jpa/target/jpa-module-project-1.6.1-SNAPSHOT-tests.jar>
to org.apache.deltaspike.modules/jpa-module-project/1.6.1-20160425.135530-25/jpa-module-project-1.6.1-20160425.135530-25-tests.jar
[JENKINS] Archiving <https://builds.apache.org/job/DeltaSpike%20Deploy/ws/deltaspike/cdictrl/pom.xml>
to org.apache.deltaspike.cdictrl/cdictrl-project/1.6.1-SNAPSHOT/cdictrl-project-1.6.1-SNAPSHOT.pom
[JENKINS] Archiving <https://builds.apache.org/job/DeltaSpike%20Deploy/ws/deltaspike/modules/scheduler/api/pom.xml>
to org.apache.deltaspike.modules/deltaspike-scheduler-module-api/1.6.1-SNAPSHOT/deltaspike-scheduler-module-api-1.6.1-SNAPSHOT.pom
[JENKINS] Archiving <https://builds.apache.org/job/DeltaSpike%20Deploy/ws/deltaspike/modules/test-control/impl/pom.xml>
to org.apache.deltaspike.modules/deltaspike-test-control-module-impl/1.6.1-SNAPSHOT/deltaspike-test-control-module-impl-1.6.1-SNAPSHOT.pom
[JENKINS] Archiving <https://builds.apache.org/job/DeltaSpike%20Deploy/ws/deltaspike/dist/bom/pom.xml>
to org.apache.deltaspike.distribution/distributions-bom/1.6.1-SNAPSHOT/distributions-bom-1.6.1-SNAPSHOT.pom
[JENKINS] Archiving <https://builds.apache.org/job/DeltaSpike%20Deploy/ws/deltaspike/modules/servlet/pom.xml>
to org.apache.deltaspike.modules/servlet-module-project/1.6.1-SNAPSHOT/servlet-module-project-1.6.1-SNAPSHOT.pom
[JENKINS] Archiving <https://builds.apache.org/job/DeltaSpike%20Deploy/ws/deltaspike/modules/servlet/target/servlet-module-project-1.6.1-SNAPSHOT-tests.jar>
to org.apache.deltaspike.modules/servlet-module-project/1.6.1-20160425.135636-25/servlet-module-project-1.6.1-20160425.135636-25-tests.jar
[JENKINS] Archiving <https://builds.apache.org/job/DeltaSpike%20Deploy/ws/deltaspike/modules/test-control/api/pom.xml>
to org.apache.deltaspike.modules/deltaspike-test-control-module-api/1.6.1-SNAPSHOT/deltaspike-test-control-module-api-1.6.1-SNAPSHOT.pom
[JENKINS] Archiving <https://builds.apache.org/job/DeltaSpike%20Deploy/ws/deltaspike/modules/jsf/impl-ee6/pom.xml>
to org.apache.deltaspike.modules/deltaspike-jsf-module-impl-ee6/1.6.1-SNAPSHOT/deltaspike-jsf-module-impl-ee6-1.6.1-SNAPSHOT.pom
[JENKINS] Archiving <https://builds.apache.org/job/DeltaSpike%20Deploy/ws/deltaspike/modules/jsf/impl-ee6/target/deltaspike-jsf-module-impl-ee6-1.6.1-SNAPSHOT.jar>
to org.apache.deltaspike.modules/deltaspike-jsf-module-impl-ee6/1.6.1-20160425.135843-25/deltaspike-jsf-module-impl-ee6-1.6.1-20160425.135843-25.jar
[JENKINS] Archiving <https://builds.apache.org/job/DeltaSpike%20Deploy/ws/deltaspike/modules/jsf/impl-ee6/target/deltaspike-jsf-module-impl-ee6-1.6.1-SNAPSHOT-tests.jar>
to org.apache.deltaspike.modules/deltaspike-jsf-module-impl-ee6/1.6.1-20160425.135843-25/deltaspike-jsf-module-impl-ee6-1.6.1-20160425.135843-25-tests.jar
[JENKINS] Archiving <https://builds.apache.org/job/DeltaSpike%20Deploy/ws/deltaspike/modules/jsf/impl-ee6/target/deltaspike-jsf-module-impl-ee6-1.6.1-SNAPSHOT-sources.jar>
to org.apache.deltaspike.modules/deltaspike-jsf-module-impl-ee6/1.6.1-20160425.135843-25/deltaspike-jsf-module-impl-ee6-1.6.1-20160425.135843-25-sources.jar
[JENKINS] Archiving <https://builds.apache.org/job/DeltaSpike%20Deploy/ws/deltaspike/modules/proxy/pom.xml>
to org.apache.deltaspike.modules/proxy-module-project/1.6.1-SNAPSHOT/proxy-module-project-1.6.1-SNAPSHOT.pom
[JENKINS] Archiving <https://builds.apache.org/job/DeltaSpike%20Deploy/ws/deltaspike/modules/proxy/target/proxy-module-project-1.6.1-SNAPSHOT-tests.jar>
to org.apache.deltaspike.modules/proxy-module-project/1.6.1-20160425.135344-25/proxy-module-project-1.6.1-20160425.135344-25-tests.jar
[JENKINS] Archiving <https://builds.apache.org/job/DeltaSpike%20Deploy/ws/deltaspike/dist/pom.xml>
to org.apache.deltaspike.distribution/distributions-project/1.6.1-SNAPSHOT/distributions-project-1.6.1-SNAPSHOT.pom
[JENKINS] Archiving <https://builds.apache.org/job/DeltaSpike%20Deploy/ws/deltaspike/modules/partial-bean/api/pom.xml>
to org.apache.deltaspike.modules/deltaspike-partial-bean-module-api/1.6.1-SNAPSHOT/deltaspike-partial-bean-module-api-1.6.1-SNAPSHOT.pom
[JENKINS] Archiving <https://builds.apache.org/job/DeltaSpike%20Deploy/ws/deltaspike/modules/partial-bean/api/target/deltaspike-partial-bean-module-api-1.6.1-SNAPSHOT.jar>
to org.apache.deltaspike.modules/deltaspike-partial-bean-module-api/1.6.1-20160425.135912-25/deltaspike-partial-bean-module-api-1.6.1-20160425.135912-25.jar
[JENKINS] Archiving <https://builds.apache.org/job/DeltaSpike%20Deploy/ws/deltaspike/modules/partial-bean/api/target/deltaspike-partial-bean-module-api-1.6.1-SNAPSHOT-tests.jar>
to org.apache.deltaspike.modules/deltaspike-partial-bean-module-api/1.6.1-20160425.135912-25/deltaspike-partial-bean-module-api-1.6.1-20160425.135912-25-tests.jar
[JENKINS] Archiving <https://builds.apache.org/job/DeltaSpike%20Deploy/ws/deltaspike/modules/partial-bean/api/target/deltaspike-partial-bean-module-api-1.6.1-SNAPSHOT-sources.jar>
to org.apache.deltaspike.modules/deltaspike-partial-bean-module-api/1.6.1-20160425.135912-25/deltaspike-partial-bean-module-api-1.6.1-20160425.135912-25-sources.jar
[JENKINS] Archiving <https://builds.apache.org/job/DeltaSpike%20Deploy/ws/deltaspike/modules/scheduler/impl/pom.xml>
to org.apache.deltaspike.modules/deltaspike-scheduler-module-impl/1.6.1-SNAPSHOT/deltaspike-scheduler-module-impl-1.6.1-SNAPSHOT.pom
[JENKINS] Archiving <https://builds.apache.org/job/DeltaSpike%20Deploy/ws/deltaspike/parent/pom.xml>
to org.apache.deltaspike/parent/1.6.1-SNAPSHOT/parent-1.6.1-SNAPSHOT.pom
Compressed 39.92 KB of artifacts by 80.2% relative to #1436
[JENKINS] Archiving <https://builds.apache.org/job/DeltaSpike%20Deploy/ws/deltaspike/core/pom.xml>
to org.apache.deltaspike.core/core-project/1.6.1-SNAPSHOT/core-project-1.6.1-SNAPSHOT.pom
[JENKINS] Archiving <https://builds.apache.org/job/DeltaSpike%20Deploy/ws/deltaspike/core/target/core-project-1.6.1-SNAPSHOT-tests.jar>
to org.apache.deltaspike.core/core-project/1.6.1-20160425.134917-25/core-project-1.6.1-20160425.134917-25-tests.jar
[JENKINS] Archiving <https://builds.apache.org/job/DeltaSpike%20Deploy/ws/deltaspike/modules/bean-validation/api/pom.xml>
to org.apache.deltaspike.modules/deltaspike-bean-validation-module-api/1.6.1-SNAPSHOT/deltaspike-bean-validation-module-api-1.6.1-SNAPSHOT.pom
[JENKINS] Archiving <https://builds.apache.org/job/DeltaSpike%20Deploy/ws/deltaspike/modules/bean-validation/api/target/deltaspike-bean-validation-module-api-1.6.1-SNAPSHOT.jar>
to org.apache.deltaspike.modules/deltaspike-bean-validation-module-api/1.6.1-20160425.140004-25/deltaspike-bean-validation-module-api-1.6.1-20160425.140004-25.jar
[JENKINS] Archiving <https://builds.apache.org/job/DeltaSpike%20Deploy/ws/deltaspike/modules/bean-validation/api/target/deltaspike-bean-validation-module-api-1.6.1-SNAPSHOT-tests.jar>
to org.apache.deltaspike.modules/deltaspike-bean-validation-module-api/1.6.1-20160425.140004-25/deltaspike-bean-validation-module-api-1.6.1-20160425.140004-25-tests.jar
[JENKINS] Archiving <https://builds.apache.org/job/DeltaSpike%20Deploy/ws/deltaspike/modules/bean-validation/api/target/deltaspike-bean-validation-module-api-1.6.1-SNAPSHOT-sources.jar>
to org.apache.deltaspike.modules/deltaspike-bean-validation-module-api/1.6.1-20160425.140004-25/deltaspike-bean-validation-module-api-1.6.1-20160425.140004-25-sources.jar
[JENKINS] Archiving <https://builds.apache.org/job/DeltaSpike%20Deploy/ws/deltaspike/core/api/pom.xml>
to org.apache.deltaspike.core/deltaspike-core-api/1.6.1-SNAPSHOT/deltaspike-core-api-1.6.1-SNAPSHOT.pom
[JENKINS] Archiving <https://builds.apache.org/job/DeltaSpike%20Deploy/ws/deltaspike/core/api/target/deltaspike-core-api-1.6.1-SNAPSHOT.jar>
to org.apache.deltaspike.core/deltaspike-core-api/1.6.1-20160425.135014-25/deltaspike-core-api-1.6.1-20160425.135014-25.jar
[JENKINS] Archiving <https://builds.apache.org/job/DeltaSpike%20Deploy/ws/deltaspike/core/api/target/deltaspike-core-api-1.6.1-SNAPSHOT-tests.jar>
to org.apache.deltaspike.core/deltaspike-core-api/1.6.1-20160425.135014-25/deltaspike-core-api-1.6.1-20160425.135014-25-tests.jar
[JENKINS] Archiving <https://builds.apache.org/job/DeltaSpike%20Deploy/ws/deltaspike/core/api/target/deltaspike-core-api-1.6.1-SNAPSHOT-sources.jar>
to org.apache.deltaspike.core/deltaspike-core-api/1.6.1-20160425.135014-25/deltaspike-core-api-1.6.1-20160425.135014-25-sources.jar
[JENKINS] Archiving <https://builds.apache.org/job/DeltaSpike%20Deploy/ws/deltaspike/modules/security/impl/pom.xml>
to org.apache.deltaspike.modules/deltaspike-security-module-impl/1.6.1-SNAPSHOT/deltaspike-security-module-impl-1.6.1-SNAPSHOT.pom
[JENKINS] Archiving <https://builds.apache.org/job/DeltaSpike%20Deploy/ws/deltaspike/modules/security/impl/target/deltaspike-security-module-impl-1.6.1-SNAPSHOT.jar>
to org.apache.deltaspike.modules/deltaspike-security-module-impl/1.6.1-20160425.135517-25/deltaspike-security-module-impl-1.6.1-20160425.135517-25.jar
[JENKINS] Archiving <https://builds.apache.org/job/DeltaSpike%20Deploy/ws/deltaspike/modules/security/impl/target/deltaspike-security-module-impl-1.6.1-SNAPSHOT-tests.jar>
to org.apache.deltaspike.modules/deltaspike-security-module-impl/1.6.1-20160425.135517-25/deltaspike-security-module-impl-1.6.1-20160425.135517-25-tests.jar
[JENKINS] Archiving <https://builds.apache.org/job/DeltaSpike%20Deploy/ws/deltaspike/modules/security/impl/target/deltaspike-security-module-impl-1.6.1-SNAPSHOT-sources.jar>
to org.apache.deltaspike.modules/deltaspike-security-module-impl/1.6.1-20160425.135517-25/deltaspike-security-module-impl-1.6.1-20160425.135517-25-sources.jar
[JENKINS] Archiving <https://builds.apache.org/job/DeltaSpike%20Deploy/ws/deltaspike/modules/scheduler/pom.xml>
to org.apache.deltaspike.modules/scheduler-module-project/1.6.1-SNAPSHOT/scheduler-module-project-1.6.1-SNAPSHOT.pom
[JENKINS] Archiving <https://builds.apache.org/job/DeltaSpike%20Deploy/ws/site/pom.xml>
to org.apache.deltaspike/deltaspike-site/1.6.1-SNAPSHOT/deltaspike-site-1.6.1-SNAPSHOT.pom
[JENKINS] Archiving <https://builds.apache.org/job/DeltaSpike%20Deploy/ws/deltaspike/modules/proxy/impl-asm5/pom.xml>
to org.apache.deltaspike.modules/deltaspike-proxy-module-impl-asm5/1.6.1-SNAPSHOT/deltaspike-proxy-module-impl-asm5-1.6.1-SNAPSHOT.pom
[JENKINS] Archiving <https://builds.apache.org/job/DeltaSpike%20Deploy/ws/deltaspike/modules/proxy/impl-asm5/target/deltaspike-proxy-module-impl-asm5-1.6.1-SNAPSHOT.jar>
to org.apache.deltaspike.modules/deltaspike-proxy-module-impl-asm5/1.6.1-20160425.135423-25/deltaspike-proxy-module-impl-asm5-1.6.1-20160425.135423-25.jar
[JENKINS] Archiving <https://builds.apache.org/job/DeltaSpike%20Deploy/ws/deltaspike/modules/proxy/impl-asm5/target/deltaspike-proxy-module-impl-asm5-1.6.1-SNAPSHOT-tests.jar>
to org.apache.deltaspike.modules/deltaspike-proxy-module-impl-asm5/1.6.1-20160425.135423-25/deltaspike-proxy-module-impl-asm5-1.6.1-20160425.135423-25-tests.jar
[JENKINS] Archiving <https://builds.apache.org/job/DeltaSpike%20Deploy/ws/deltaspike/modules/proxy/impl-asm5/target/deltaspike-proxy-module-impl-asm5-1.6.1-SNAPSHOT-sources.jar>
to org.apache.deltaspike.modules/deltaspike-proxy-module-impl-asm5/1.6.1-20160425.135423-25/deltaspike-proxy-module-impl-asm5-1.6.1-20160425.135423-25-sources.jar
[JENKINS] Archiving <https://builds.apache.org/job/DeltaSpike%20Deploy/ws/deltaspike/examples/jsf-playground/pom.xml>
to org.apache.deltaspike.examples/deltaspike-jsf-playground/1.6.1-SNAPSHOT/deltaspike-jsf-playground-1.6.1-SNAPSHOT.pom
[JENKINS] Archiving <https://builds.apache.org/job/DeltaSpike%20Deploy/ws/deltaspike/modules/servlet/impl/pom.xml>
to org.apache.deltaspike.modules/deltaspike-servlet-module-impl/1.6.1-SNAPSHOT/deltaspike-servlet-module-impl-1.6.1-SNAPSHOT.pom
[JENKINS] Archiving <https://builds.apache.org/job/DeltaSpike%20Deploy/ws/deltaspike/modules/servlet/impl/target/deltaspike-servlet-module-impl-1.6.1-SNAPSHOT.jar>
to org.apache.deltaspike.modules/deltaspike-servlet-module-impl/1.6.1-20160425.135708-25/deltaspike-servlet-module-impl-1.6.1-20160425.135708-25.jar
[JENKINS] Archiving <https://builds.apache.org/job/DeltaSpike%20Deploy/ws/deltaspike/modules/servlet/impl/target/deltaspike-servlet-module-impl-1.6.1-SNAPSHOT-tests.jar>
to org.apache.deltaspike.modules/deltaspike-servlet-module-impl/1.6.1-20160425.135708-25/deltaspike-servlet-module-impl-1.6.1-20160425.135708-25-tests.jar
[JENKINS] Archiving <https://builds.apache.org/job/DeltaSpike%20Deploy/ws/deltaspike/modules/servlet/impl/target/deltaspike-servlet-module-impl-1.6.1-SNAPSHOT-sources.jar>
to org.apache.deltaspike.modules/deltaspike-servlet-module-impl/1.6.1-20160425.135708-25/deltaspike-servlet-module-impl-1.6.1-20160425.135708-25-sources.jar
[JENKINS] Archiving <https://builds.apache.org/job/DeltaSpike%20Deploy/ws/deltaspike/modules/bean-validation/impl/pom.xml>
to org.apache.deltaspike.modules/deltaspike-bean-validation-module-impl/1.6.1-SNAPSHOT/deltaspike-bean-validation-module-impl-1.6.1-SNAPSHOT.pom
[JENKINS] Archiving <https://builds.apache.org/job/DeltaSpike%20Deploy/ws/deltaspike/modules/bean-validation/impl/target/deltaspike-bean-validation-module-impl-1.6.1-SNAPSHOT.jar>
to org.apache.deltaspike.modules/deltaspike-bean-validation-module-impl/1.6.1-20160425.140027-25/deltaspike-bean-validation-module-impl-1.6.1-20160425.140027-25.jar
[JENKINS] Archiving <https://builds.apache.org/job/DeltaSpike%20Deploy/ws/deltaspike/modules/bean-validation/impl/target/deltaspike-bean-validation-module-impl-1.6.1-SNAPSHOT-tests.jar>
to org.apache.deltaspike.modules/deltaspike-bean-validation-module-impl/1.6.1-20160425.140027-25/deltaspike-bean-validation-module-impl-1.6.1-20160425.140027-25-tests.jar
[JENKINS] Archiving <https://builds.apache.org/job/DeltaSpike%20Deploy/ws/deltaspike/modules/bean-validation/impl/target/deltaspike-bean-validation-module-impl-1.6.1-SNAPSHOT-sources.jar>
to org.apache.deltaspike.modules/deltaspike-bean-validation-module-impl/1.6.1-20160425.140027-25/deltaspike-bean-validation-module-impl-1.6.1-20160425.140027-25-sources.jar
[JENKINS] Archiving <https://builds.apache.org/job/DeltaSpike%20Deploy/ws/deltaspike/cdictrl/impl-owb/pom.xml>
to org.apache.deltaspike.cdictrl/deltaspike-cdictrl-owb/1.6.1-SNAPSHOT/deltaspike-cdictrl-owb-1.6.1-SNAPSHOT.pom
[JENKINS] Archiving <https://builds.apache.org/job/DeltaSpike%20Deploy/ws/deltaspike/cdictrl/impl-owb/target/deltaspike-cdictrl-owb-1.6.1-SNAPSHOT.jar>
to org.apache.deltaspike.cdictrl/deltaspike-cdictrl-owb/1.6.1-20160425.135217-25/deltaspike-cdictrl-owb-1.6.1-20160425.135217-25.jar
[JENKINS] Archiving <https://builds.apache.org/job/DeltaSpike%20Deploy/ws/deltaspike/cdictrl/impl-owb/target/deltaspike-cdictrl-owb-1.6.1-SNAPSHOT-sources.jar>
to org.apache.deltaspike.cdictrl/deltaspike-cdictrl-owb/1.6.1-20160425.135217-25/deltaspike-cdictrl-owb-1.6.1-20160425.135217-25-sources.jar
[JENKINS] Archiving <https://builds.apache.org/job/DeltaSpike%20Deploy/ws/pom.xml> to
org.apache.deltaspike/deltaspike/1.6.1-SNAPSHOT/deltaspike-1.6.1-SNAPSHOT.pom
[JENKINS] Archiving <https://builds.apache.org/job/DeltaSpike%20Deploy/ws/deltaspike/modules/jpa/impl/pom.xml>
to org.apache.deltaspike.modules/deltaspike-jpa-module-impl/1.6.1-SNAPSHOT/deltaspike-jpa-module-impl-1.6.1-SNAPSHOT.pom
[JENKINS] Archiving <https://builds.apache.org/job/DeltaSpike%20Deploy/ws/deltaspike/modules/jpa/impl/target/deltaspike-jpa-module-impl-1.6.1-SNAPSHOT.jar>
to org.apache.deltaspike.modules/deltaspike-jpa-module-impl/1.6.1-20160425.135622-25/deltaspike-jpa-module-impl-1.6.1-20160425.135622-25.jar
[JENKINS] Archiving <https://builds.apache.org/job/DeltaSpike%20Deploy/ws/deltaspike/modules/jpa/impl/target/deltaspike-jpa-module-impl-1.6.1-SNAPSHOT-tests.jar>
to org.apache.deltaspike.modules/deltaspike-jpa-module-impl/1.6.1-20160425.135622-25/deltaspike-jpa-module-impl-1.6.1-20160425.135622-25-tests.jar
[JENKINS] Archiving <https://builds.apache.org/job/DeltaSpike%20Deploy/ws/deltaspike/modules/jpa/impl/target/deltaspike-jpa-module-impl-1.6.1-SNAPSHOT-sources.jar>
to org.apache.deltaspike.modules/deltaspike-jpa-module-impl/1.6.1-20160425.135622-25/deltaspike-jpa-module-impl-1.6.1-20160425.135622-25-sources.jar
[JENKINS] Archiving <https://builds.apache.org/job/DeltaSpike%20Deploy/ws/deltaspike/modules/data/pom.xml>
to org.apache.deltaspike.modules/data-module-project/1.6.1-SNAPSHOT/data-module-project-1.6.1-SNAPSHOT.pom
[JENKINS] Archiving <https://builds.apache.org/job/DeltaSpike%20Deploy/ws/deltaspike/examples/security-requested-page-after-login-picketlink/pom.xml>
to org.apache.deltaspike.examples/deltaspike-security-requested-page-after-login-picketlink/1.6.1-SNAPSHOT/deltaspike-security-requested-page-after-login-picketlink-1.6.1-SNAPSHOT.pom
[JENKINS] Archiving <https://builds.apache.org/job/DeltaSpike%20Deploy/ws/deltaspike/pom.xml>
to org.apache.deltaspike/deltaspike-project/1.6.1-SNAPSHOT/deltaspike-project-1.6.1-SNAPSHOT.pom
[JENKINS] Archiving <https://builds.apache.org/job/DeltaSpike%20Deploy/ws/deltaspike/modules/security/api/pom.xml>
to org.apache.deltaspike.modules/deltaspike-security-module-api/1.6.1-SNAPSHOT/deltaspike-security-module-api-1.6.1-SNAPSHOT.pom
[JENKINS] Archiving <https://builds.apache.org/job/DeltaSpike%20Deploy/ws/deltaspike/modules/security/api/target/deltaspike-security-module-api-1.6.1-SNAPSHOT.jar>
to org.apache.deltaspike.modules/deltaspike-security-module-api/1.6.1-20160425.135453-25/deltaspike-security-module-api-1.6.1-20160425.135453-25.jar
[JENKINS] Archiving <https://builds.apache.org/job/DeltaSpike%20Deploy/ws/deltaspike/modules/security/api/target/deltaspike-security-module-api-1.6.1-SNAPSHOT-tests.jar>
to org.apache.deltaspike.modules/deltaspike-security-module-api/1.6.1-20160425.135453-25/deltaspike-security-module-api-1.6.1-20160425.135453-25-tests.jar
[JENKINS] Archiving <https://builds.apache.org/job/DeltaSpike%20Deploy/ws/deltaspike/modules/security/api/target/deltaspike-security-module-api-1.6.1-SNAPSHOT-sources.jar>
to org.apache.deltaspike.modules/deltaspike-security-module-api/1.6.1-20160425.135453-25/deltaspike-security-module-api-1.6.1-20160425.135453-25-sources.jar
Sending e-mails to: commits@deltaspike.apache.org
channel stopped

Mime
View raw message