deltaspike-commits mailing list archives

Site index · List index
Message view « Date » · « Thread »
Top « Date » · « Thread »
From Apache Jenkins Server <jenk...@builds.apache.org>
Subject Build failed in Jenkins: DeltaSpike Deploy #1404
Date Sun, 03 Apr 2016 13:56:40 GMT
See <https://builds.apache.org/job/DeltaSpike%20Deploy/1404/changes>

Changes:

[johndament] News announcement

[johndament] DELTASPIKE-1105 Added param to control appending entity name.  Updated

[johndament] DELTASPIKE-1108 Ignore EE7 tests as they fail until DELTASPIKE-1060 is

[gpetracek] DELTASPIKE-1106 release notes for v1.6.0

[johndament] DELTASPIKE-1105 Data Module doc fixes.

[johndament] Added documentation to add DeltaSpike to a gradle project.

[johndament] Updated docs to show how to use Gradle when setting up.

[johndament] Updated docs to show how to use Gradle when using modules.

[johndament] Updated docs to show how to use Gradle when using modules.

------------------------------------------
[...truncated 7057 lines...]
[INFO] Exclude: .idea/**/*
[INFO] Exclude: readme/**/*
[INFO] Exclude: **/*.log
[INFO] 
[INFO] --- maven-bundle-plugin:2.3.7:cleanVersions (versions) @ deltaspike-bean-validation-module-impl
---
[INFO] 
[INFO] --- maven-antrun-plugin:1.7:run (javadoc.resources) @ deltaspike-bean-validation-module-impl
---
[WARNING] Parameter tasks is deprecated, use target instead
[INFO] Executing tasks

main:
[INFO] Executed tasks
[WARNING] Failed to getClass for org.apache.maven.plugin.source.SourceJarMojo
[INFO] 
[INFO] --- maven-source-plugin:2.4:jar (default-cli) @ deltaspike-bean-validation-module-impl
---
[INFO]                                                                         
[INFO] ------------------------------------------------------------------------
[INFO] Building Apache DeltaSpike Data-Module 1.6.0-SNAPSHOT
[INFO] ------------------------------------------------------------------------
[INFO] 
[INFO] --- maven-clean-plugin:2.5:clean (default-clean) @ data-module-project ---
[INFO] Deleting <https://builds.apache.org/job/DeltaSpike%20Deploy/ws/deltaspike/modules/data/target>
[INFO] 
[INFO] --- apache-rat-plugin:0.8:check (default) @ data-module-project ---
[INFO] Exclude: .idea/**/*
[INFO] Exclude: readme/**/*
[INFO] Exclude: **/*.log
[INFO] ------------------------------------------------------------------------
[INFO] Reactor Summary:
[INFO] 
[INFO] Apache DeltaSpike ................................. SUCCESS [12.489s]
[INFO] Apache DeltaSpike Sources ......................... SUCCESS [13.199s]
[INFO] Apache DeltaSpike CheckStyle-rules ................ SUCCESS [12.944s]
[INFO] Apache DeltaSpike Parent .......................... SUCCESS [17.904s]
[INFO] Apache DeltaSpike Test-Utils ...................... SUCCESS [21.883s]
[INFO] Apache DeltaSpike Code Parent ..................... SUCCESS [9.113s]
[INFO] Apache DeltaSpike Core ............................ SUCCESS [8.875s]
[INFO] Apache DeltaSpike Core-API ........................ SUCCESS [59.374s]
[INFO] Apache DeltaSpike Core-Implementation ............. SUCCESS [1:34.559s]
[INFO] Apache DeltaSpike ContainerControl parent ......... SUCCESS [7.705s]
[INFO] Apache DeltaSpike CDI ContainerControl API ........ SUCCESS [6.573s]
[INFO] Apache DeltaSpike CDI ContainerControl TCK ........ SUCCESS [9.628s]
[INFO] Apache DeltaSpike CDI OWB-ContainerControl ........ SUCCESS [13.345s]
[INFO] Apache DeltaSpike CDI Weld-ContainerControl ....... SUCCESS [16.778s]
[INFO] Apache DeltaSpike CDI OpenEJB-ContainerControl .... SUCCESS [37.604s]
[INFO] Apache DeltaSpike CDI Servlet-ContainerControl .... SUCCESS [17.988s]
[INFO] Apache DeltaSpike Modules ......................... SUCCESS [15.641s]
[INFO] Apache DeltaSpike Proxy-Module .................... SUCCESS [6.601s]
[INFO] Apache DeltaSpike Proxy-Module API ................ SUCCESS [29.793s]
[INFO] Apache DeltaSpike Proxy-Module Impl ASM5 .......... SUCCESS [30.826s]
[INFO] Apache DeltaSpike Security-Module ................. SUCCESS [4.913s]
[INFO] Apache DeltaSpike Security-Module API ............. SUCCESS [18.514s]
[INFO] Apache DeltaSpike Security-Module Impl ............ SUCCESS [34.709s]
[INFO] Apache DeltaSpike JPA-Module ...................... SUCCESS [10.503s]
[INFO] Apache DeltaSpike JPA-Module API .................. SUCCESS [17.090s]
[INFO] Apache DeltaSpike JPA-Module Impl ................. SUCCESS [59.717s]
[INFO] Apache DeltaSpike Servlet-Module .................. SUCCESS [6.614s]
[INFO] Apache DeltaSpike Servlet-Module API .............. SUCCESS [6.775s]
[INFO] Apache DeltaSpike Servlet-Module Impl ............. SUCCESS [15.231s]
[INFO] Apache DeltaSpike JSF-Module ...................... SUCCESS [6.008s]
[INFO] Apache DeltaSpike JSF-Module API .................. SUCCESS [15.480s]
[INFO] Apache DeltaSpike JSF-Module Impl ................. SUCCESS [48.393s]
[INFO] Apache DeltaSpike JSF-Module Impl (EE6 only) ...... SUCCESS [11.985s]
[INFO] Apache DeltaSpike Partial-Bean-Module ............. SUCCESS [8.083s]
[INFO] Apache DeltaSpike Partial-Bean-Module API ......... SUCCESS [19.181s]
[INFO] Apache DeltaSpike Partial-Bean-Module Impl ........ SUCCESS [32.431s]
[INFO] Apache DeltaSpike BeanValidation-Module ........... SUCCESS [5.492s]
[INFO] Apache DeltaSpike BeanValidation-Module API ....... SUCCESS [11.034s]
[INFO] Apache DeltaSpike BeanValidation-Module Impl ...... SUCCESS [25.953s]
[INFO] Apache DeltaSpike Data-Module ..................... FAILURE [0.483s]
[INFO] Apache DeltaSpike Data-Module API ................. SKIPPED
[INFO] Apache DeltaSpike Data-Module Impl ................ SKIPPED
[INFO] Apache DeltaSpike Scheduler-Module ................ SKIPPED
[INFO] Apache DeltaSpike Scheduler-Module API ............ SKIPPED
[INFO] Apache DeltaSpike Scheduler-Module Impl ........... SKIPPED
[INFO] Apache DeltaSpike Test-Control-Module ............. SKIPPED
[INFO] Apache DeltaSpike Test-Control-Module API ......... SKIPPED
[INFO] Apache DeltaSpike Test-Control-Module Impl ........ SKIPPED
[INFO] Apache DeltaSpike Examples ........................ SKIPPED
[INFO] Apache DeltaSpike Java-SE Examples ................ SKIPPED
[INFO] Apache DeltaSpike JSF Examples .................... SKIPPED
[INFO] Apache DeltaSpike JSF Playground .................. SKIPPED
[INFO] Apache DeltaSpike Security Example CDI ............ SKIPPED
[INFO] Apache DeltaSpike Security Example PicketLink ..... SKIPPED
[INFO] Apache DeltaSpike Java-SE Scheduler Examples ...... SKIPPED
[INFO] Apache DeltaSpike Distribution .................... SKIPPED
[INFO] Apache DeltaSpike Distribution Bill of Materials .. SKIPPED
[INFO] Apache DeltaSpike Full Distribution ............... SKIPPED
[INFO] Apache DeltaSpike Documentation ................... SKIPPED
[INFO] Apache DeltaSpike Site ............................ SKIPPED
[INFO] ------------------------------------------------------------------------
[INFO] BUILD FAILURE
[INFO] ------------------------------------------------------------------------
[INFO] Total time: 13:47.295s
[INFO] Finished at: Sun Apr 03 13:55:55 UTC 2016
[INFO] Final Memory: 106M/1000M
[INFO] ------------------------------------------------------------------------
Waiting for Jenkins to finish collecting data
[ERROR] Failed to execute goal org.apache.rat:apache-rat-plugin:0.8:check (default) on project
data-module-project: Too many unapproved licenses: 15 -> [Help 1]
[ERROR] 
[ERROR] To see the full stack trace of the errors, re-run Maven with the -e switch.
[ERROR] Re-run Maven using the -X switch to enable full debug logging.
[ERROR] 
[ERROR] For more information about the errors and possible solutions, please read the following
articles:
[ERROR] [Help 1] http://cwiki.apache.org/confluence/display/MAVEN/MojoFailureException
[ERROR] 
[ERROR] After correcting the problems, you can resume the build with the command
[ERROR]   mvn <goals> -rf :data-module-project
[JENKINS] Archiving <https://builds.apache.org/job/DeltaSpike%20Deploy/ws/deltaspike/examples/jse-examples/pom.xml>
to org.apache.deltaspike.examples/deltaspike-jse-example/1.6.0-SNAPSHOT/deltaspike-jse-example-1.6.0-SNAPSHOT.pom
[JENKINS] Archiving <https://builds.apache.org/job/DeltaSpike%20Deploy/ws/deltaspike/examples/security-requested-page-after-login-cdi/pom.xml>
to org.apache.deltaspike.examples/deltaspike-security-requested-page-after-login-cdi/1.6.0-SNAPSHOT/deltaspike-security-requested-page-after-login-cdi-1.6.0-SNAPSHOT.pom
[JENKINS] Archiving <https://builds.apache.org/job/DeltaSpike%20Deploy/ws/deltaspike/test-utils/pom.xml>
to org.apache.deltaspike.test/test-utils/1.6.0-SNAPSHOT/test-utils-1.6.0-SNAPSHOT.pom
[JENKINS] Archiving <https://builds.apache.org/job/DeltaSpike%20Deploy/ws/deltaspike/test-utils/target/test-utils-1.6.0-SNAPSHOT.jar>
to org.apache.deltaspike.test/test-utils/1.6.0-20160403.134333-7/test-utils-1.6.0-20160403.134333-7.jar
[JENKINS] Archiving <https://builds.apache.org/job/DeltaSpike%20Deploy/ws/deltaspike/test-utils/target/test-utils-1.6.0-SNAPSHOT-sources.jar>
to org.apache.deltaspike.test/test-utils/1.6.0-20160403.134333-7/test-utils-1.6.0-20160403.134333-7-sources.jar
[JENKINS] Archiving <https://builds.apache.org/job/DeltaSpike%20Deploy/ws/documentation/pom.xml>
to org.apache.deltaspike/deltaspike-documentation/1.6.0-SNAPSHOT/deltaspike-documentation-1.6.0-SNAPSHOT.pom
[JENKINS] Archiving <https://builds.apache.org/job/DeltaSpike%20Deploy/ws/deltaspike/modules/data/impl/pom.xml>
to org.apache.deltaspike.modules/deltaspike-data-module-impl/1.6.0-SNAPSHOT/deltaspike-data-module-impl-1.6.0-SNAPSHOT.pom
[JENKINS] Archiving <https://builds.apache.org/job/DeltaSpike%20Deploy/ws/deltaspike/modules/data/api/pom.xml>
to org.apache.deltaspike.modules/deltaspike-data-module-api/1.6.0-SNAPSHOT/deltaspike-data-module-api-1.6.0-SNAPSHOT.pom
[JENKINS] Archiving <https://builds.apache.org/job/DeltaSpike%20Deploy/ws/deltaspike/core/impl/pom.xml>
to org.apache.deltaspike.core/deltaspike-core-impl/1.6.0-SNAPSHOT/deltaspike-core-impl-1.6.0-SNAPSHOT.pom
[JENKINS] Archiving <https://builds.apache.org/job/DeltaSpike%20Deploy/ws/deltaspike/core/impl/target/deltaspike-core-impl-1.6.0-SNAPSHOT.jar>
to org.apache.deltaspike.core/deltaspike-core-impl/1.6.0-20160403.134626-6/deltaspike-core-impl-1.6.0-20160403.134626-6.jar
[JENKINS] Archiving <https://builds.apache.org/job/DeltaSpike%20Deploy/ws/deltaspike/core/impl/target/deltaspike-core-impl-1.6.0-SNAPSHOT-tests.jar>
to org.apache.deltaspike.core/deltaspike-core-impl/1.6.0-20160403.134626-6/deltaspike-core-impl-1.6.0-20160403.134626-6-tests.jar
[JENKINS] Archiving <https://builds.apache.org/job/DeltaSpike%20Deploy/ws/deltaspike/core/impl/target/deltaspike-core-impl-1.6.0-SNAPSHOT-sources.jar>
to org.apache.deltaspike.core/deltaspike-core-impl/1.6.0-20160403.134626-6/deltaspike-core-impl-1.6.0-20160403.134626-6-sources.jar
[JENKINS] Archiving <https://builds.apache.org/job/DeltaSpike%20Deploy/ws/deltaspike/modules/pom.xml>
to org.apache.deltaspike.modules/modules-project/1.6.0-SNAPSHOT/modules-project-1.6.0-SNAPSHOT.pom
[JENKINS] Archiving <https://builds.apache.org/job/DeltaSpike%20Deploy/ws/deltaspike/modules/target/modules-project-1.6.0-SNAPSHOT-tests.jar>
to org.apache.deltaspike.modules/modules-project/1.6.0-20160403.134834-6/modules-project-1.6.0-20160403.134834-6-tests.jar
[JENKINS] Archiving <https://builds.apache.org/job/DeltaSpike%20Deploy/ws/deltaspike/modules/test-control/pom.xml>
to org.apache.deltaspike.modules/test-control-module-project/1.6.0-SNAPSHOT/test-control-module-project-1.6.0-SNAPSHOT.pom
[JENKINS] Archiving <https://builds.apache.org/job/DeltaSpike%20Deploy/ws/deltaspike/examples/jsf-examples/pom.xml>
to org.apache.deltaspike.examples/deltaspike-jsf-example/1.6.0-SNAPSHOT/deltaspike-jsf-example-1.6.0-SNAPSHOT.pom
[JENKINS] Archiving <https://builds.apache.org/job/DeltaSpike%20Deploy/ws/deltaspike/cdictrl/servlet/pom.xml>
to org.apache.deltaspike.cdictrl/deltaspike-cdictrl-servlet/1.6.0-SNAPSHOT/deltaspike-cdictrl-servlet-1.6.0-SNAPSHOT.pom
[JENKINS] Archiving <https://builds.apache.org/job/DeltaSpike%20Deploy/ws/deltaspike/cdictrl/servlet/target/deltaspike-cdictrl-servlet-1.6.0-SNAPSHOT.jar>
to org.apache.deltaspike.cdictrl/deltaspike-cdictrl-servlet/1.6.0-20160403.134820-6/deltaspike-cdictrl-servlet-1.6.0-20160403.134820-6.jar
[JENKINS] Archiving <https://builds.apache.org/job/DeltaSpike%20Deploy/ws/deltaspike/cdictrl/servlet/target/deltaspike-cdictrl-servlet-1.6.0-SNAPSHOT-sources.jar>
to org.apache.deltaspike.cdictrl/deltaspike-cdictrl-servlet/1.6.0-20160403.134820-6/deltaspike-cdictrl-servlet-1.6.0-20160403.134820-6-sources.jar
[JENKINS] Archiving <https://builds.apache.org/job/DeltaSpike%20Deploy/ws/deltaspike/cdictrl/api/pom.xml>
to org.apache.deltaspike.cdictrl/deltaspike-cdictrl-api/1.6.0-SNAPSHOT/deltaspike-cdictrl-api-1.6.0-SNAPSHOT.pom
[JENKINS] Archiving <https://builds.apache.org/job/DeltaSpike%20Deploy/ws/deltaspike/cdictrl/api/target/deltaspike-cdictrl-api-1.6.0-SNAPSHOT.jar>
to org.apache.deltaspike.cdictrl/deltaspike-cdictrl-api/1.6.0-20160403.134643-6/deltaspike-cdictrl-api-1.6.0-20160403.134643-6.jar
[JENKINS] Archiving <https://builds.apache.org/job/DeltaSpike%20Deploy/ws/deltaspike/cdictrl/api/target/deltaspike-cdictrl-api-1.6.0-SNAPSHOT-sources.jar>
to org.apache.deltaspike.cdictrl/deltaspike-cdictrl-api/1.6.0-20160403.134643-6/deltaspike-cdictrl-api-1.6.0-20160403.134643-6-sources.jar
[JENKINS] Archiving <https://builds.apache.org/job/DeltaSpike%20Deploy/ws/deltaspike/examples/scheduler-playground/pom.xml>
to org.apache.deltaspike.examples/deltaspike-scheduler-example/1.6.0-SNAPSHOT/deltaspike-scheduler-example-1.6.0-SNAPSHOT.pom
[JENKINS] Archiving <https://builds.apache.org/job/DeltaSpike%20Deploy/ws/deltaspike/checkstyle-rules/pom.xml>
to org.apache.deltaspike/checkstyle-rules/1.6.0-SNAPSHOT/checkstyle-rules-1.6.0-SNAPSHOT.pom
[JENKINS] Archiving <https://builds.apache.org/job/DeltaSpike%20Deploy/ws/deltaspike/checkstyle-rules/target/checkstyle-rules-1.6.0-SNAPSHOT.jar>
to org.apache.deltaspike/checkstyle-rules/1.6.0-20160403.134253-7/checkstyle-rules-1.6.0-20160403.134253-7.jar
[JENKINS] Archiving <https://builds.apache.org/job/DeltaSpike%20Deploy/ws/deltaspike/checkstyle-rules/target/checkstyle-rules-1.6.0-SNAPSHOT-sources.jar>
to org.apache.deltaspike/checkstyle-rules/1.6.0-20160403.134253-7/checkstyle-rules-1.6.0-20160403.134253-7-sources.jar
[JENKINS] Archiving <https://builds.apache.org/job/DeltaSpike%20Deploy/ws/deltaspike/parent/code/pom.xml>
to org.apache.deltaspike/parent-code/1.6.0-SNAPSHOT/parent-code-1.6.0-SNAPSHOT.pom
[JENKINS] Archiving <https://builds.apache.org/job/DeltaSpike%20Deploy/ws/deltaspike/parent/code/target/parent-code-1.6.0-SNAPSHOT-tests.jar>
to org.apache.deltaspike/parent-code/1.6.0-20160403.134343-7/parent-code-1.6.0-20160403.134343-7-tests.jar
Compressed 79.66 KB of artifacts by 40.2% relative to #1403
[JENKINS] Archiving <https://builds.apache.org/job/DeltaSpike%20Deploy/ws/deltaspike/modules/jsf/impl/pom.xml>
to org.apache.deltaspike.modules/deltaspike-jsf-module-impl/1.6.0-SNAPSHOT/deltaspike-jsf-module-impl-1.6.0-SNAPSHOT.pom
[JENKINS] Archiving <https://builds.apache.org/job/DeltaSpike%20Deploy/ws/deltaspike/modules/jsf/impl/target/deltaspike-jsf-module-impl-1.6.0-SNAPSHOT.jar>
to org.apache.deltaspike.modules/deltaspike-jsf-module-impl/1.6.0-20160403.135352-6/deltaspike-jsf-module-impl-1.6.0-20160403.135352-6.jar
[JENKINS] Archiving <https://builds.apache.org/job/DeltaSpike%20Deploy/ws/deltaspike/modules/jsf/impl/target/deltaspike-jsf-module-impl-1.6.0-SNAPSHOT-tests.jar>
to org.apache.deltaspike.modules/deltaspike-jsf-module-impl/1.6.0-20160403.135352-6/deltaspike-jsf-module-impl-1.6.0-20160403.135352-6-tests.jar
[JENKINS] Archiving <https://builds.apache.org/job/DeltaSpike%20Deploy/ws/deltaspike/modules/jsf/impl/target/deltaspike-jsf-module-impl-1.6.0-SNAPSHOT-sources.jar>
to org.apache.deltaspike.modules/deltaspike-jsf-module-impl/1.6.0-20160403.135352-6/deltaspike-jsf-module-impl-1.6.0-20160403.135352-6-sources.jar
[JENKINS] Archiving <https://builds.apache.org/job/DeltaSpike%20Deploy/ws/deltaspike/modules/partial-bean/pom.xml>
to org.apache.deltaspike.modules/partial-bean-module-project/1.6.0-SNAPSHOT/partial-bean-module-project-1.6.0-SNAPSHOT.pom
[JENKINS] Archiving <https://builds.apache.org/job/DeltaSpike%20Deploy/ws/deltaspike/modules/partial-bean/target/partial-bean-module-project-1.6.0-SNAPSHOT-tests.jar>
to org.apache.deltaspike.modules/partial-bean-module-project/1.6.0-20160403.135412-6/partial-bean-module-project-1.6.0-20160403.135412-6-tests.jar
[JENKINS] Archiving <https://builds.apache.org/job/DeltaSpike%20Deploy/ws/deltaspike/examples/pom.xml>
to org.apache.deltaspike.examples/examples-project/1.6.0-SNAPSHOT/examples-project-1.6.0-SNAPSHOT.pom
[JENKINS] Archiving <https://builds.apache.org/job/DeltaSpike%20Deploy/ws/deltaspike/cdictrl/impl-openejb/pom.xml>
to org.apache.deltaspike.cdictrl/deltaspike-cdictrl-openejb/1.6.0-SNAPSHOT/deltaspike-cdictrl-openejb-1.6.0-SNAPSHOT.pom
[JENKINS] Archiving <https://builds.apache.org/job/DeltaSpike%20Deploy/ws/deltaspike/cdictrl/impl-openejb/target/deltaspike-cdictrl-openejb-1.6.0-SNAPSHOT.jar>
to org.apache.deltaspike.cdictrl/deltaspike-cdictrl-openejb/1.6.0-20160403.134801-5/deltaspike-cdictrl-openejb-1.6.0-20160403.134801-5.jar
[JENKINS] Archiving <https://builds.apache.org/job/DeltaSpike%20Deploy/ws/deltaspike/cdictrl/impl-openejb/target/deltaspike-cdictrl-openejb-1.6.0-SNAPSHOT-sources.jar>
to org.apache.deltaspike.cdictrl/deltaspike-cdictrl-openejb/1.6.0-20160403.134801-5/deltaspike-cdictrl-openejb-1.6.0-20160403.134801-5-sources.jar
[JENKINS] Archiving <https://builds.apache.org/job/DeltaSpike%20Deploy/ws/deltaspike/modules/jsf/pom.xml>
to org.apache.deltaspike.modules/jsf-module-project/1.6.0-SNAPSHOT/jsf-module-project-1.6.0-SNAPSHOT.pom
[JENKINS] Archiving <https://builds.apache.org/job/DeltaSpike%20Deploy/ws/deltaspike/modules/jsf/target/jsf-module-project-1.6.0-SNAPSHOT-tests.jar>
to org.apache.deltaspike.modules/jsf-module-project/1.6.0-20160403.135249-6/jsf-module-project-1.6.0-20160403.135249-6-tests.jar
[JENKINS] Archiving <https://builds.apache.org/job/DeltaSpike%20Deploy/ws/deltaspike/cdictrl/tck/pom.xml>
to org.apache.deltaspike.test/deltaspike-cdictrl-tck/1.6.0-SNAPSHOT/deltaspike-cdictrl-tck-1.6.0-SNAPSHOT.pom
[JENKINS] Archiving <https://builds.apache.org/job/DeltaSpike%20Deploy/ws/deltaspike/cdictrl/tck/target/deltaspike-cdictrl-tck-1.6.0-SNAPSHOT.jar>
to org.apache.deltaspike.test/deltaspike-cdictrl-tck/1.6.0-20160403.134652-6/deltaspike-cdictrl-tck-1.6.0-20160403.134652-6.jar
[JENKINS] Archiving <https://builds.apache.org/job/DeltaSpike%20Deploy/ws/deltaspike/cdictrl/tck/target/deltaspike-cdictrl-tck-1.6.0-SNAPSHOT-sources.jar>
to org.apache.deltaspike.test/deltaspike-cdictrl-tck/1.6.0-20160403.134652-6/deltaspike-cdictrl-tck-1.6.0-20160403.134652-6-sources.jar
[JENKINS] Archiving <https://builds.apache.org/job/DeltaSpike%20Deploy/ws/deltaspike/modules/jsf/api/pom.xml>
to org.apache.deltaspike.modules/deltaspike-jsf-module-api/1.6.0-SNAPSHOT/deltaspike-jsf-module-api-1.6.0-SNAPSHOT.pom
[JENKINS] Archiving <https://builds.apache.org/job/DeltaSpike%20Deploy/ws/deltaspike/modules/jsf/api/target/deltaspike-jsf-module-api-1.6.0-SNAPSHOT.jar>
to org.apache.deltaspike.modules/deltaspike-jsf-module-api/1.6.0-20160403.135302-6/deltaspike-jsf-module-api-1.6.0-20160403.135302-6.jar
[JENKINS] Archiving <https://builds.apache.org/job/DeltaSpike%20Deploy/ws/deltaspike/modules/jsf/api/target/deltaspike-jsf-module-api-1.6.0-SNAPSHOT-tests.jar>
to org.apache.deltaspike.modules/deltaspike-jsf-module-api/1.6.0-20160403.135302-6/deltaspike-jsf-module-api-1.6.0-20160403.135302-6-tests.jar
[JENKINS] Archiving <https://builds.apache.org/job/DeltaSpike%20Deploy/ws/deltaspike/modules/jsf/api/target/deltaspike-jsf-module-api-1.6.0-SNAPSHOT-sources.jar>
to org.apache.deltaspike.modules/deltaspike-jsf-module-api/1.6.0-20160403.135302-6/deltaspike-jsf-module-api-1.6.0-20160403.135302-6-sources.jar
[JENKINS] Archiving <https://builds.apache.org/job/DeltaSpike%20Deploy/ws/deltaspike/modules/security/pom.xml>
to org.apache.deltaspike.modules/security-module-project/1.6.0-SNAPSHOT/security-module-project-1.6.0-SNAPSHOT.pom
[JENKINS] Archiving <https://builds.apache.org/job/DeltaSpike%20Deploy/ws/deltaspike/modules/security/target/security-module-project-1.6.0-SNAPSHOT-tests.jar>
to org.apache.deltaspike.modules/security-module-project/1.6.0-20160403.134951-6/security-module-project-1.6.0-20160403.134951-6-tests.jar
[JENKINS] Archiving <https://builds.apache.org/job/DeltaSpike%20Deploy/ws/deltaspike/modules/bean-validation/pom.xml>
to org.apache.deltaspike.modules/bean-validation-module-project/1.6.0-SNAPSHOT/bean-validation-module-project-1.6.0-SNAPSHOT.pom
[JENKINS] Archiving <https://builds.apache.org/job/DeltaSpike%20Deploy/ws/deltaspike/modules/bean-validation/target/bean-validation-module-project-1.6.0-SNAPSHOT-tests.jar>
to org.apache.deltaspike.modules/bean-validation-module-project/1.6.0-20160403.135513-6/bean-validation-module-project-1.6.0-20160403.135513-6-tests.jar
[JENKINS] Archiving <https://builds.apache.org/job/DeltaSpike%20Deploy/ws/deltaspike/modules/partial-bean/impl/pom.xml>
to org.apache.deltaspike.modules/deltaspike-partial-bean-module-impl/1.6.0-SNAPSHOT/deltaspike-partial-bean-module-impl-1.6.0-SNAPSHOT.pom
[JENKINS] Archiving <https://builds.apache.org/job/DeltaSpike%20Deploy/ws/deltaspike/modules/partial-bean/impl/target/deltaspike-partial-bean-module-impl-1.6.0-SNAPSHOT.jar>
to org.apache.deltaspike.modules/deltaspike-partial-bean-module-impl/1.6.0-20160403.135507-6/deltaspike-partial-bean-module-impl-1.6.0-20160403.135507-6.jar
[JENKINS] Archiving <https://builds.apache.org/job/DeltaSpike%20Deploy/ws/deltaspike/modules/partial-bean/impl/target/deltaspike-partial-bean-module-impl-1.6.0-SNAPSHOT-tests.jar>
to org.apache.deltaspike.modules/deltaspike-partial-bean-module-impl/1.6.0-20160403.135507-6/deltaspike-partial-bean-module-impl-1.6.0-20160403.135507-6-tests.jar
[JENKINS] Archiving <https://builds.apache.org/job/DeltaSpike%20Deploy/ws/deltaspike/modules/partial-bean/impl/target/deltaspike-partial-bean-module-impl-1.6.0-SNAPSHOT-sources.jar>
to org.apache.deltaspike.modules/deltaspike-partial-bean-module-impl/1.6.0-20160403.135507-6/deltaspike-partial-bean-module-impl-1.6.0-20160403.135507-6-sources.jar
[JENKINS] Archiving <https://builds.apache.org/job/DeltaSpike%20Deploy/ws/deltaspike/modules/proxy/api/pom.xml>
to org.apache.deltaspike.modules/deltaspike-proxy-module-api/1.6.0-SNAPSHOT/deltaspike-proxy-module-api-1.6.0-SNAPSHOT.pom
[JENKINS] Archiving <https://builds.apache.org/job/DeltaSpike%20Deploy/ws/deltaspike/modules/proxy/api/target/deltaspike-proxy-module-api-1.6.0-SNAPSHOT.jar>
to org.apache.deltaspike.modules/deltaspike-proxy-module-api/1.6.0-20160403.134913-6/deltaspike-proxy-module-api-1.6.0-20160403.134913-6.jar
[JENKINS] Archiving <https://builds.apache.org/job/DeltaSpike%20Deploy/ws/deltaspike/modules/proxy/api/target/deltaspike-proxy-module-api-1.6.0-SNAPSHOT-tests.jar>
to org.apache.deltaspike.modules/deltaspike-proxy-module-api/1.6.0-20160403.134913-6/deltaspike-proxy-module-api-1.6.0-20160403.134913-6-tests.jar
[JENKINS] Archiving <https://builds.apache.org/job/DeltaSpike%20Deploy/ws/deltaspike/modules/proxy/api/target/deltaspike-proxy-module-api-1.6.0-SNAPSHOT-sources.jar>
to org.apache.deltaspike.modules/deltaspike-proxy-module-api/1.6.0-20160403.134913-6/deltaspike-proxy-module-api-1.6.0-20160403.134913-6-sources.jar
[JENKINS] Archiving <https://builds.apache.org/job/DeltaSpike%20Deploy/ws/deltaspike/cdictrl/impl-weld/pom.xml>
to org.apache.deltaspike.cdictrl/deltaspike-cdictrl-weld/1.6.0-SNAPSHOT/deltaspike-cdictrl-weld-1.6.0-SNAPSHOT.pom
[JENKINS] Archiving <https://builds.apache.org/job/DeltaSpike%20Deploy/ws/deltaspike/cdictrl/impl-weld/target/deltaspike-cdictrl-weld-1.6.0-SNAPSHOT.jar>
to org.apache.deltaspike.cdictrl/deltaspike-cdictrl-weld/1.6.0-20160403.134723-5/deltaspike-cdictrl-weld-1.6.0-20160403.134723-5.jar
[JENKINS] Archiving <https://builds.apache.org/job/DeltaSpike%20Deploy/ws/deltaspike/cdictrl/impl-weld/target/deltaspike-cdictrl-weld-1.6.0-SNAPSHOT-sources.jar>
to org.apache.deltaspike.cdictrl/deltaspike-cdictrl-weld/1.6.0-20160403.134723-5/deltaspike-cdictrl-weld-1.6.0-20160403.134723-5-sources.jar
[JENKINS] Archiving <https://builds.apache.org/job/DeltaSpike%20Deploy/ws/deltaspike/modules/jpa/api/pom.xml>
to org.apache.deltaspike.modules/deltaspike-jpa-module-api/1.6.0-SNAPSHOT/deltaspike-jpa-module-api-1.6.0-SNAPSHOT.pom
[JENKINS] Archiving <https://builds.apache.org/job/DeltaSpike%20Deploy/ws/deltaspike/modules/jpa/api/target/deltaspike-jpa-module-api-1.6.0-SNAPSHOT.jar>
to org.apache.deltaspike.modules/deltaspike-jpa-module-api/1.6.0-20160403.135113-6/deltaspike-jpa-module-api-1.6.0-20160403.135113-6.jar
[JENKINS] Archiving <https://builds.apache.org/job/DeltaSpike%20Deploy/ws/deltaspike/modules/jpa/api/target/deltaspike-jpa-module-api-1.6.0-SNAPSHOT-tests.jar>
to org.apache.deltaspike.modules/deltaspike-jpa-module-api/1.6.0-20160403.135113-6/deltaspike-jpa-module-api-1.6.0-20160403.135113-6-tests.jar
[JENKINS] Archiving <https://builds.apache.org/job/DeltaSpike%20Deploy/ws/deltaspike/modules/jpa/api/target/deltaspike-jpa-module-api-1.6.0-SNAPSHOT-sources.jar>
to org.apache.deltaspike.modules/deltaspike-jpa-module-api/1.6.0-20160403.135113-6/deltaspike-jpa-module-api-1.6.0-20160403.135113-6-sources.jar
[JENKINS] Archiving <https://builds.apache.org/job/DeltaSpike%20Deploy/ws/deltaspike/dist/full/pom.xml>
to org.apache.deltaspike.distribution/distribution-full/1.6.0-SNAPSHOT/distribution-full-1.6.0-SNAPSHOT.pom
[JENKINS] Archiving <https://builds.apache.org/job/DeltaSpike%20Deploy/ws/deltaspike/modules/servlet/api/pom.xml>
to org.apache.deltaspike.modules/deltaspike-servlet-module-api/1.6.0-SNAPSHOT/deltaspike-servlet-module-api-1.6.0-SNAPSHOT.pom
[JENKINS] Archiving <https://builds.apache.org/job/DeltaSpike%20Deploy/ws/deltaspike/modules/servlet/api/target/deltaspike-servlet-module-api-1.6.0-SNAPSHOT.jar>
to org.apache.deltaspike.modules/deltaspike-servlet-module-api/1.6.0-20160403.135227-6/deltaspike-servlet-module-api-1.6.0-20160403.135227-6.jar
[JENKINS] Archiving <https://builds.apache.org/job/DeltaSpike%20Deploy/ws/deltaspike/modules/servlet/api/target/deltaspike-servlet-module-api-1.6.0-SNAPSHOT-tests.jar>
to org.apache.deltaspike.modules/deltaspike-servlet-module-api/1.6.0-20160403.135227-6/deltaspike-servlet-module-api-1.6.0-20160403.135227-6-tests.jar
[JENKINS] Archiving <https://builds.apache.org/job/DeltaSpike%20Deploy/ws/deltaspike/modules/servlet/api/target/deltaspike-servlet-module-api-1.6.0-SNAPSHOT-sources.jar>
to org.apache.deltaspike.modules/deltaspike-servlet-module-api/1.6.0-20160403.135227-6/deltaspike-servlet-module-api-1.6.0-20160403.135227-6-sources.jar
[JENKINS] Archiving <https://builds.apache.org/job/DeltaSpike%20Deploy/ws/deltaspike/modules/jpa/pom.xml>
to org.apache.deltaspike.modules/jpa-module-project/1.6.0-SNAPSHOT/jpa-module-project-1.6.0-SNAPSHOT.pom
[JENKINS] Archiving <https://builds.apache.org/job/DeltaSpike%20Deploy/ws/deltaspike/modules/jpa/target/jpa-module-project-1.6.0-SNAPSHOT-tests.jar>
to org.apache.deltaspike.modules/jpa-module-project/1.6.0-20160403.135056-6/jpa-module-project-1.6.0-20160403.135056-6-tests.jar
[JENKINS] Archiving <https://builds.apache.org/job/DeltaSpike%20Deploy/ws/deltaspike/cdictrl/pom.xml>
to org.apache.deltaspike.cdictrl/cdictrl-project/1.6.0-SNAPSHOT/cdictrl-project-1.6.0-SNAPSHOT.pom
[JENKINS] Archiving <https://builds.apache.org/job/DeltaSpike%20Deploy/ws/deltaspike/modules/scheduler/api/pom.xml>
to org.apache.deltaspike.modules/deltaspike-scheduler-module-api/1.6.0-SNAPSHOT/deltaspike-scheduler-module-api-1.6.0-SNAPSHOT.pom
[JENKINS] Archiving <https://builds.apache.org/job/DeltaSpike%20Deploy/ws/deltaspike/modules/test-control/impl/pom.xml>
to org.apache.deltaspike.modules/deltaspike-test-control-module-impl/1.6.0-SNAPSHOT/deltaspike-test-control-module-impl-1.6.0-SNAPSHOT.pom
[JENKINS] Archiving <https://builds.apache.org/job/DeltaSpike%20Deploy/ws/deltaspike/dist/bom/pom.xml>
to org.apache.deltaspike.distribution/distributions-bom/1.6.0-SNAPSHOT/distributions-bom-1.6.0-SNAPSHOT.pom
[JENKINS] Archiving <https://builds.apache.org/job/DeltaSpike%20Deploy/ws/deltaspike/modules/servlet/pom.xml>
to org.apache.deltaspike.modules/servlet-module-project/1.6.0-SNAPSHOT/servlet-module-project-1.6.0-SNAPSHOT.pom
[JENKINS] Archiving <https://builds.apache.org/job/DeltaSpike%20Deploy/ws/deltaspike/modules/servlet/target/servlet-module-project-1.6.0-SNAPSHOT-tests.jar>
to org.apache.deltaspike.modules/servlet-module-project/1.6.0-20160403.135219-6/servlet-module-project-1.6.0-20160403.135219-6-tests.jar
[JENKINS] Archiving <https://builds.apache.org/job/DeltaSpike%20Deploy/ws/deltaspike/modules/test-control/api/pom.xml>
to org.apache.deltaspike.modules/deltaspike-test-control-module-api/1.6.0-SNAPSHOT/deltaspike-test-control-module-api-1.6.0-SNAPSHOT.pom
[JENKINS] Archiving <https://builds.apache.org/job/DeltaSpike%20Deploy/ws/deltaspike/modules/jsf/impl-ee6/pom.xml>
to org.apache.deltaspike.modules/deltaspike-jsf-module-impl-ee6/1.6.0-SNAPSHOT/deltaspike-jsf-module-impl-ee6-1.6.0-SNAPSHOT.pom
[JENKINS] Archiving <https://builds.apache.org/job/DeltaSpike%20Deploy/ws/deltaspike/modules/jsf/impl-ee6/target/deltaspike-jsf-module-impl-ee6-1.6.0-SNAPSHOT.jar>
to org.apache.deltaspike.modules/deltaspike-jsf-module-impl-ee6/1.6.0-20160403.135407-6/deltaspike-jsf-module-impl-ee6-1.6.0-20160403.135407-6.jar
[JENKINS] Archiving <https://builds.apache.org/job/DeltaSpike%20Deploy/ws/deltaspike/modules/jsf/impl-ee6/target/deltaspike-jsf-module-impl-ee6-1.6.0-SNAPSHOT-tests.jar>
to org.apache.deltaspike.modules/deltaspike-jsf-module-impl-ee6/1.6.0-20160403.135407-6/deltaspike-jsf-module-impl-ee6-1.6.0-20160403.135407-6-tests.jar
[JENKINS] Archiving <https://builds.apache.org/job/DeltaSpike%20Deploy/ws/deltaspike/modules/jsf/impl-ee6/target/deltaspike-jsf-module-impl-ee6-1.6.0-SNAPSHOT-sources.jar>
to org.apache.deltaspike.modules/deltaspike-jsf-module-impl-ee6/1.6.0-20160403.135407-6/deltaspike-jsf-module-impl-ee6-1.6.0-20160403.135407-6-sources.jar
[JENKINS] Archiving <https://builds.apache.org/job/DeltaSpike%20Deploy/ws/deltaspike/modules/proxy/pom.xml>
to org.apache.deltaspike.modules/proxy-module-project/1.6.0-SNAPSHOT/proxy-module-project-1.6.0-SNAPSHOT.pom
[JENKINS] Archiving <https://builds.apache.org/job/DeltaSpike%20Deploy/ws/deltaspike/modules/proxy/target/proxy-module-project-1.6.0-SNAPSHOT-tests.jar>
to org.apache.deltaspike.modules/proxy-module-project/1.6.0-20160403.134843-6/proxy-module-project-1.6.0-20160403.134843-6-tests.jar
[JENKINS] Archiving <https://builds.apache.org/job/DeltaSpike%20Deploy/ws/deltaspike/dist/pom.xml>
to org.apache.deltaspike.distribution/distributions-project/1.6.0-SNAPSHOT/distributions-project-1.6.0-SNAPSHOT.pom
[JENKINS] Archiving <https://builds.apache.org/job/DeltaSpike%20Deploy/ws/deltaspike/modules/partial-bean/api/pom.xml>
to org.apache.deltaspike.modules/deltaspike-partial-bean-module-api/1.6.0-SNAPSHOT/deltaspike-partial-bean-module-api-1.6.0-SNAPSHOT.pom
[JENKINS] Archiving <https://builds.apache.org/job/DeltaSpike%20Deploy/ws/deltaspike/modules/partial-bean/api/target/deltaspike-partial-bean-module-api-1.6.0-SNAPSHOT.jar>
to org.apache.deltaspike.modules/deltaspike-partial-bean-module-api/1.6.0-20160403.135434-6/deltaspike-partial-bean-module-api-1.6.0-20160403.135434-6.jar
[JENKINS] Archiving <https://builds.apache.org/job/DeltaSpike%20Deploy/ws/deltaspike/modules/partial-bean/api/target/deltaspike-partial-bean-module-api-1.6.0-SNAPSHOT-tests.jar>
to org.apache.deltaspike.modules/deltaspike-partial-bean-module-api/1.6.0-20160403.135434-6/deltaspike-partial-bean-module-api-1.6.0-20160403.135434-6-tests.jar
[JENKINS] Archiving <https://builds.apache.org/job/DeltaSpike%20Deploy/ws/deltaspike/modules/partial-bean/api/target/deltaspike-partial-bean-module-api-1.6.0-SNAPSHOT-sources.jar>
to org.apache.deltaspike.modules/deltaspike-partial-bean-module-api/1.6.0-20160403.135434-6/deltaspike-partial-bean-module-api-1.6.0-20160403.135434-6-sources.jar
[JENKINS] Archiving <https://builds.apache.org/job/DeltaSpike%20Deploy/ws/deltaspike/modules/scheduler/impl/pom.xml>
to org.apache.deltaspike.modules/deltaspike-scheduler-module-impl/1.6.0-SNAPSHOT/deltaspike-scheduler-module-impl-1.6.0-SNAPSHOT.pom
[JENKINS] Archiving <https://builds.apache.org/job/DeltaSpike%20Deploy/ws/deltaspike/parent/pom.xml>
to org.apache.deltaspike/parent/1.6.0-SNAPSHOT/parent-1.6.0-SNAPSHOT.pom
Compressed 39.92 KB of artifacts by 80.2% relative to #1403
[JENKINS] Archiving <https://builds.apache.org/job/DeltaSpike%20Deploy/ws/deltaspike/core/pom.xml>
to org.apache.deltaspike.core/core-project/1.6.0-SNAPSHOT/core-project-1.6.0-SNAPSHOT.pom
[JENKINS] Archiving <https://builds.apache.org/job/DeltaSpike%20Deploy/ws/deltaspike/core/target/core-project-1.6.0-SNAPSHOT-tests.jar>
to org.apache.deltaspike.core/core-project/1.6.0-20160403.134351-6/core-project-1.6.0-20160403.134351-6-tests.jar
[JENKINS] Archiving <https://builds.apache.org/job/DeltaSpike%20Deploy/ws/deltaspike/modules/bean-validation/api/pom.xml>
to org.apache.deltaspike.modules/deltaspike-bean-validation-module-api/1.6.0-SNAPSHOT/deltaspike-bean-validation-module-api-1.6.0-SNAPSHOT.pom
[JENKINS] Archiving <https://builds.apache.org/job/DeltaSpike%20Deploy/ws/deltaspike/modules/bean-validation/api/target/deltaspike-bean-validation-module-api-1.6.0-SNAPSHOT.jar>
to org.apache.deltaspike.modules/deltaspike-bean-validation-module-api/1.6.0-20160403.135522-6/deltaspike-bean-validation-module-api-1.6.0-20160403.135522-6.jar
[JENKINS] Archiving <https://builds.apache.org/job/DeltaSpike%20Deploy/ws/deltaspike/modules/bean-validation/api/target/deltaspike-bean-validation-module-api-1.6.0-SNAPSHOT-tests.jar>
to org.apache.deltaspike.modules/deltaspike-bean-validation-module-api/1.6.0-20160403.135522-6/deltaspike-bean-validation-module-api-1.6.0-20160403.135522-6-tests.jar
[JENKINS] Archiving <https://builds.apache.org/job/DeltaSpike%20Deploy/ws/deltaspike/modules/bean-validation/api/target/deltaspike-bean-validation-module-api-1.6.0-SNAPSHOT-sources.jar>
to org.apache.deltaspike.modules/deltaspike-bean-validation-module-api/1.6.0-20160403.135522-6/deltaspike-bean-validation-module-api-1.6.0-20160403.135522-6-sources.jar
[JENKINS] Archiving <https://builds.apache.org/job/DeltaSpike%20Deploy/ws/deltaspike/core/api/pom.xml>
to org.apache.deltaspike.core/deltaspike-core-api/1.6.0-SNAPSHOT/deltaspike-core-api-1.6.0-SNAPSHOT.pom
[JENKINS] Archiving <https://builds.apache.org/job/DeltaSpike%20Deploy/ws/deltaspike/core/api/target/deltaspike-core-api-1.6.0-SNAPSHOT.jar>
to org.apache.deltaspike.core/deltaspike-core-api/1.6.0-20160403.134444-6/deltaspike-core-api-1.6.0-20160403.134444-6.jar
[JENKINS] Archiving <https://builds.apache.org/job/DeltaSpike%20Deploy/ws/deltaspike/core/api/target/deltaspike-core-api-1.6.0-SNAPSHOT-tests.jar>
to org.apache.deltaspike.core/deltaspike-core-api/1.6.0-20160403.134444-6/deltaspike-core-api-1.6.0-20160403.134444-6-tests.jar
[JENKINS] Archiving <https://builds.apache.org/job/DeltaSpike%20Deploy/ws/deltaspike/core/api/target/deltaspike-core-api-1.6.0-SNAPSHOT-sources.jar>
to org.apache.deltaspike.core/deltaspike-core-api/1.6.0-20160403.134444-6/deltaspike-core-api-1.6.0-20160403.134444-6-sources.jar
[JENKINS] Archiving <https://builds.apache.org/job/DeltaSpike%20Deploy/ws/deltaspike/modules/security/impl/pom.xml>
to org.apache.deltaspike.modules/deltaspike-security-module-impl/1.6.0-SNAPSHOT/deltaspike-security-module-impl-1.6.0-SNAPSHOT.pom
[JENKINS] Archiving <https://builds.apache.org/job/DeltaSpike%20Deploy/ws/deltaspike/modules/security/impl/target/deltaspike-security-module-impl-1.6.0-SNAPSHOT.jar>
to org.apache.deltaspike.modules/deltaspike-security-module-impl/1.6.0-20160403.135043-6/deltaspike-security-module-impl-1.6.0-20160403.135043-6.jar
[JENKINS] Archiving <https://builds.apache.org/job/DeltaSpike%20Deploy/ws/deltaspike/modules/security/impl/target/deltaspike-security-module-impl-1.6.0-SNAPSHOT-tests.jar>
to org.apache.deltaspike.modules/deltaspike-security-module-impl/1.6.0-20160403.135043-6/deltaspike-security-module-impl-1.6.0-20160403.135043-6-tests.jar
[JENKINS] Archiving <https://builds.apache.org/job/DeltaSpike%20Deploy/ws/deltaspike/modules/security/impl/target/deltaspike-security-module-impl-1.6.0-SNAPSHOT-sources.jar>
to org.apache.deltaspike.modules/deltaspike-security-module-impl/1.6.0-20160403.135043-6/deltaspike-security-module-impl-1.6.0-20160403.135043-6-sources.jar
[JENKINS] Archiving <https://builds.apache.org/job/DeltaSpike%20Deploy/ws/deltaspike/modules/scheduler/pom.xml>
to org.apache.deltaspike.modules/scheduler-module-project/1.6.0-SNAPSHOT/scheduler-module-project-1.6.0-SNAPSHOT.pom
[JENKINS] Archiving <https://builds.apache.org/job/DeltaSpike%20Deploy/ws/site/pom.xml>
to org.apache.deltaspike/deltaspike-site/1.6.0-SNAPSHOT/deltaspike-site-1.6.0-SNAPSHOT.pom
[JENKINS] Archiving <https://builds.apache.org/job/DeltaSpike%20Deploy/ws/deltaspike/modules/proxy/impl-asm5/pom.xml>
to org.apache.deltaspike.modules/deltaspike-proxy-module-impl-asm5/1.6.0-SNAPSHOT/deltaspike-proxy-module-impl-asm5-1.6.0-SNAPSHOT.pom
[JENKINS] Archiving <https://builds.apache.org/job/DeltaSpike%20Deploy/ws/deltaspike/modules/proxy/impl-asm5/target/deltaspike-proxy-module-impl-asm5-1.6.0-SNAPSHOT.jar>
to org.apache.deltaspike.modules/deltaspike-proxy-module-impl-asm5/1.6.0-20160403.134944-6/deltaspike-proxy-module-impl-asm5-1.6.0-20160403.134944-6.jar
[JENKINS] Archiving <https://builds.apache.org/job/DeltaSpike%20Deploy/ws/deltaspike/modules/proxy/impl-asm5/target/deltaspike-proxy-module-impl-asm5-1.6.0-SNAPSHOT-tests.jar>
to org.apache.deltaspike.modules/deltaspike-proxy-module-impl-asm5/1.6.0-20160403.134944-6/deltaspike-proxy-module-impl-asm5-1.6.0-20160403.134944-6-tests.jar
[JENKINS] Archiving <https://builds.apache.org/job/DeltaSpike%20Deploy/ws/deltaspike/modules/proxy/impl-asm5/target/deltaspike-proxy-module-impl-asm5-1.6.0-SNAPSHOT-sources.jar>
to org.apache.deltaspike.modules/deltaspike-proxy-module-impl-asm5/1.6.0-20160403.134944-6/deltaspike-proxy-module-impl-asm5-1.6.0-20160403.134944-6-sources.jar
[JENKINS] Archiving <https://builds.apache.org/job/DeltaSpike%20Deploy/ws/deltaspike/examples/jsf-playground/pom.xml>
to org.apache.deltaspike.examples/deltaspike-jsf-playground/1.6.0-SNAPSHOT/deltaspike-jsf-playground-1.6.0-SNAPSHOT.pom
[JENKINS] Archiving <https://builds.apache.org/job/DeltaSpike%20Deploy/ws/deltaspike/modules/servlet/impl/pom.xml>
to org.apache.deltaspike.modules/deltaspike-servlet-module-impl/1.6.0-SNAPSHOT/deltaspike-servlet-module-impl-1.6.0-SNAPSHOT.pom
[JENKINS] Archiving <https://builds.apache.org/job/DeltaSpike%20Deploy/ws/deltaspike/modules/servlet/impl/target/deltaspike-servlet-module-impl-1.6.0-SNAPSHOT.jar>
to org.apache.deltaspike.modules/deltaspike-servlet-module-impl/1.6.0-20160403.135242-6/deltaspike-servlet-module-impl-1.6.0-20160403.135242-6.jar
[JENKINS] Archiving <https://builds.apache.org/job/DeltaSpike%20Deploy/ws/deltaspike/modules/servlet/impl/target/deltaspike-servlet-module-impl-1.6.0-SNAPSHOT-tests.jar>
to org.apache.deltaspike.modules/deltaspike-servlet-module-impl/1.6.0-20160403.135242-6/deltaspike-servlet-module-impl-1.6.0-20160403.135242-6-tests.jar
[JENKINS] Archiving <https://builds.apache.org/job/DeltaSpike%20Deploy/ws/deltaspike/modules/servlet/impl/target/deltaspike-servlet-module-impl-1.6.0-SNAPSHOT-sources.jar>
to org.apache.deltaspike.modules/deltaspike-servlet-module-impl/1.6.0-20160403.135242-6/deltaspike-servlet-module-impl-1.6.0-20160403.135242-6-sources.jar
[JENKINS] Archiving <https://builds.apache.org/job/DeltaSpike%20Deploy/ws/deltaspike/modules/bean-validation/impl/pom.xml>
to org.apache.deltaspike.modules/deltaspike-bean-validation-module-impl/1.6.0-SNAPSHOT/deltaspike-bean-validation-module-impl-1.6.0-SNAPSHOT.pom
[JENKINS] Archiving <https://builds.apache.org/job/DeltaSpike%20Deploy/ws/deltaspike/modules/bean-validation/impl/target/deltaspike-bean-validation-module-impl-1.6.0-SNAPSHOT.jar>
to org.apache.deltaspike.modules/deltaspike-bean-validation-module-impl/1.6.0-20160403.135550-6/deltaspike-bean-validation-module-impl-1.6.0-20160403.135550-6.jar
[JENKINS] Archiving <https://builds.apache.org/job/DeltaSpike%20Deploy/ws/deltaspike/modules/bean-validation/impl/target/deltaspike-bean-validation-module-impl-1.6.0-SNAPSHOT-tests.jar>
to org.apache.deltaspike.modules/deltaspike-bean-validation-module-impl/1.6.0-20160403.135550-6/deltaspike-bean-validation-module-impl-1.6.0-20160403.135550-6-tests.jar
[JENKINS] Archiving <https://builds.apache.org/job/DeltaSpike%20Deploy/ws/deltaspike/modules/bean-validation/impl/target/deltaspike-bean-validation-module-impl-1.6.0-SNAPSHOT-sources.jar>
to org.apache.deltaspike.modules/deltaspike-bean-validation-module-impl/1.6.0-20160403.135550-6/deltaspike-bean-validation-module-impl-1.6.0-20160403.135550-6-sources.jar
[JENKINS] Archiving <https://builds.apache.org/job/DeltaSpike%20Deploy/ws/deltaspike/cdictrl/impl-owb/pom.xml>
to org.apache.deltaspike.cdictrl/deltaspike-cdictrl-owb/1.6.0-SNAPSHOT/deltaspike-cdictrl-owb-1.6.0-SNAPSHOT.pom
[JENKINS] Archiving <https://builds.apache.org/job/DeltaSpike%20Deploy/ws/deltaspike/cdictrl/impl-owb/target/deltaspike-cdictrl-owb-1.6.0-SNAPSHOT.jar>
to org.apache.deltaspike.cdictrl/deltaspike-cdictrl-owb/1.6.0-20160403.134707-6/deltaspike-cdictrl-owb-1.6.0-20160403.134707-6.jar
[JENKINS] Archiving <https://builds.apache.org/job/DeltaSpike%20Deploy/ws/deltaspike/cdictrl/impl-owb/target/deltaspike-cdictrl-owb-1.6.0-SNAPSHOT-sources.jar>
to org.apache.deltaspike.cdictrl/deltaspike-cdictrl-owb/1.6.0-20160403.134707-6/deltaspike-cdictrl-owb-1.6.0-20160403.134707-6-sources.jar
[JENKINS] Archiving <https://builds.apache.org/job/DeltaSpike%20Deploy/ws/pom.xml> to
org.apache.deltaspike/deltaspike/1.6.0-SNAPSHOT/deltaspike-1.6.0-SNAPSHOT.pom
[JENKINS] Archiving <https://builds.apache.org/job/DeltaSpike%20Deploy/ws/deltaspike/modules/jpa/impl/pom.xml>
to org.apache.deltaspike.modules/deltaspike-jpa-module-impl/1.6.0-SNAPSHOT/deltaspike-jpa-module-impl-1.6.0-SNAPSHOT.pom
[JENKINS] Archiving <https://builds.apache.org/job/DeltaSpike%20Deploy/ws/deltaspike/modules/jpa/impl/target/deltaspike-jpa-module-impl-1.6.0-SNAPSHOT.jar>
to org.apache.deltaspike.modules/deltaspike-jpa-module-impl/1.6.0-20160403.135212-6/deltaspike-jpa-module-impl-1.6.0-20160403.135212-6.jar
[JENKINS] Archiving <https://builds.apache.org/job/DeltaSpike%20Deploy/ws/deltaspike/modules/jpa/impl/target/deltaspike-jpa-module-impl-1.6.0-SNAPSHOT-tests.jar>
to org.apache.deltaspike.modules/deltaspike-jpa-module-impl/1.6.0-20160403.135212-6/deltaspike-jpa-module-impl-1.6.0-20160403.135212-6-tests.jar
[JENKINS] Archiving <https://builds.apache.org/job/DeltaSpike%20Deploy/ws/deltaspike/modules/jpa/impl/target/deltaspike-jpa-module-impl-1.6.0-SNAPSHOT-sources.jar>
to org.apache.deltaspike.modules/deltaspike-jpa-module-impl/1.6.0-20160403.135212-6/deltaspike-jpa-module-impl-1.6.0-20160403.135212-6-sources.jar
[JENKINS] Archiving <https://builds.apache.org/job/DeltaSpike%20Deploy/ws/deltaspike/modules/data/pom.xml>
to org.apache.deltaspike.modules/data-module-project/1.6.0-SNAPSHOT/data-module-project-1.6.0-SNAPSHOT.pom
[JENKINS] Archiving <https://builds.apache.org/job/DeltaSpike%20Deploy/ws/deltaspike/examples/security-requested-page-after-login-picketlink/pom.xml>
to org.apache.deltaspike.examples/deltaspike-security-requested-page-after-login-picketlink/1.6.0-SNAPSHOT/deltaspike-security-requested-page-after-login-picketlink-1.6.0-SNAPSHOT.pom
[JENKINS] Archiving <https://builds.apache.org/job/DeltaSpike%20Deploy/ws/deltaspike/pom.xml>
to org.apache.deltaspike/deltaspike-project/1.6.0-SNAPSHOT/deltaspike-project-1.6.0-SNAPSHOT.pom
[JENKINS] Archiving <https://builds.apache.org/job/DeltaSpike%20Deploy/ws/deltaspike/modules/security/api/pom.xml>
to org.apache.deltaspike.modules/deltaspike-security-module-api/1.6.0-SNAPSHOT/deltaspike-security-module-api-1.6.0-SNAPSHOT.pom
[JENKINS] Archiving <https://builds.apache.org/job/DeltaSpike%20Deploy/ws/deltaspike/modules/security/api/target/deltaspike-security-module-api-1.6.0-SNAPSHOT.jar>
to org.apache.deltaspike.modules/deltaspike-security-module-api/1.6.0-20160403.135008-6/deltaspike-security-module-api-1.6.0-20160403.135008-6.jar
[JENKINS] Archiving <https://builds.apache.org/job/DeltaSpike%20Deploy/ws/deltaspike/modules/security/api/target/deltaspike-security-module-api-1.6.0-SNAPSHOT-tests.jar>
to org.apache.deltaspike.modules/deltaspike-security-module-api/1.6.0-20160403.135008-6/deltaspike-security-module-api-1.6.0-20160403.135008-6-tests.jar
[JENKINS] Archiving <https://builds.apache.org/job/DeltaSpike%20Deploy/ws/deltaspike/modules/security/api/target/deltaspike-security-module-api-1.6.0-SNAPSHOT-sources.jar>
to org.apache.deltaspike.modules/deltaspike-security-module-api/1.6.0-20160403.135008-6/deltaspike-security-module-api-1.6.0-20160403.135008-6-sources.jar
Sending e-mails to: commits@deltaspike.apache.org
channel stopped

Mime
View raw message