deltaspike-commits mailing list archives

Site index · List index
Message view « Date » · « Thread »
Top « Date » · « Thread »
From Apache Jenkins Server <jenk...@builds.apache.org>
Subject Build failed in Jenkins: DeltaSpike OWB 1.2.0 #831
Date Thu, 14 Apr 2016 10:55:00 GMT
See <https://builds.apache.org/job/DeltaSpike%20OWB%201.2.0/831/changes>

Changes:

[gpetracek] DELTASPIKE-1107 moved dependency

[gpetracek] DELTASPIKE-1082 documentation for configurable cron-expressions

[gpetracek] DELTASPIKE-1106 release notes for v1.6.0

[johndament] News announcement

[johndament] DELTASPIKE-1105 Added param to control appending entity name.  Updated

[johndament] DELTASPIKE-1108 Ignore EE7 tests as they fail until DELTASPIKE-1060 is

[gpetracek] DELTASPIKE-1106 release notes for v1.6.0

[gpetracek] [maven-release-plugin] prepare release deltaspike-1.6.0

[gpetracek] [maven-release-plugin] prepare for next development iteration

[johndament] DELTASPIKE-1105 Data Module doc fixes.

[johndament] Added documentation to add DeltaSpike to a gradle project.

[johndament] Updated docs to show how to use Gradle when setting up.

[johndament] Updated docs to show how to use Gradle when using modules.

[johndament] Updated docs to show how to use Gradle when using modules.

[johndament] Ignore the target folder of all builds when doing rat check, as well as

[gpetracek] DELTASPIKE-1114 information about v1.6.0

[struberg] DELTASPIKE-1117 add a simple caching logic for TypedResolver

[johndament] DELTASPIKE-1110 Added some preliminary docs for async.

[johndament] DELTASPIKE-1110 Added some preliminary docs for async.

[johndament] DELTASPIKE-1105 Updated preceding example.

[gpetracek] DELTASPIKE-1124 optimized handling in case of

[struberg] DELTASPIKE-1125 make ParentExtension mechanism configurable

[struberg] DELTASPIKE-1126 variable support for configured values

[gpetracek] DELTASPIKE-1118 refactoring to ThrottledStrategy

[gpetracek] DELTASPIKE-1119 refactoring to FutureableStrategy

[gpetracek] DELTASPIKE-1120 refactoring to LockedStrategy

[struberg] DELTASPIKE-1126 add a config switch to log values when they got changed

[struberg] DELTASPIKE-1126 also suport evaluateVariables in @ConfigProperty

------------------------------------------
[...truncated 5197 lines...]
[ERROR] symbol  : variable Parent_
[ERROR] location: class org.apache.deltaspike.data.test.service.ParentRepository
[ERROR] <https://builds.apache.org/job/DeltaSpike%20OWB%201.2.0/ws/deltaspike/modules/data/impl/src/test/java/org/apache/deltaspike/data/test/service/ParentRepository.java>:[50,36]
cannot find symbol
[ERROR] symbol  : variable OneToMany_
[ERROR] location: class org.apache.deltaspike.data.test.service.ParentRepository
[ERROR] <https://builds.apache.org/job/DeltaSpike%20OWB%201.2.0/ws/deltaspike/modules/data/impl/src/test/java/org/apache/deltaspike/data/test/service/ParentRepository.java>:[44,22]
cannot find symbol
[ERROR] symbol  : variable Parent_
[ERROR] location: class org.apache.deltaspike.data.test.service.ParentRepository
[ERROR] <https://builds.apache.org/job/DeltaSpike%20OWB%201.2.0/ws/deltaspike/modules/data/impl/src/test/java/org/apache/deltaspike/data/test/service/ParentRepository.java>:[46,36]
cannot find symbol
[ERROR] symbol  : variable OneToOne_
[ERROR] location: class org.apache.deltaspike.data.test.service.ParentRepository
[ERROR] <https://builds.apache.org/job/DeltaSpike%20OWB%201.2.0/ws/deltaspike/modules/data/impl/src/test/java/org/apache/deltaspike/data/test/service/ParentRepository.java>:[43,20]
cannot find symbol
[ERROR] symbol  : variable Parent_
[ERROR] location: class org.apache.deltaspike.data.test.service.ParentRepository
[ERROR] <https://builds.apache.org/job/DeltaSpike%20OWB%201.2.0/ws/deltaspike/modules/data/impl/src/test/java/org/apache/deltaspike/data/test/service/ParentRepository.java>:[61,20]
cannot find symbol
[ERROR] symbol  : variable Parent_
[ERROR] location: class org.apache.deltaspike.data.test.service.ParentRepository
[ERROR] <https://builds.apache.org/job/DeltaSpike%20OWB%201.2.0/ws/deltaspike/modules/data/impl/src/test/java/org/apache/deltaspike/data/test/service/ParentRepository.java>:[60,20]
cannot find symbol
[ERROR] symbol  : variable Parent_
[ERROR] location: class org.apache.deltaspike.data.test.service.ParentRepository
[ERROR] <https://builds.apache.org/job/DeltaSpike%20OWB%201.2.0/ws/deltaspike/modules/data/impl/src/test/java/org/apache/deltaspike/data/test/service/ParentRepository.java>:[59,20]
cannot find symbol
[ERROR] symbol  : variable Parent_
[ERROR] location: class org.apache.deltaspike.data.test.service.ParentRepository
[ERROR] <https://builds.apache.org/job/DeltaSpike%20OWB%201.2.0/ws/deltaspike/modules/data/impl/src/test/java/org/apache/deltaspike/data/test/service/ParentRepository.java>:[70,23]
cannot find symbol
[ERROR] symbol  : variable Parent_
[ERROR] location: class org.apache.deltaspike.data.test.service.ParentRepository
[ERROR] <https://builds.apache.org/job/DeltaSpike%20OWB%201.2.0/ws/deltaspike/modules/data/impl/src/test/java/org/apache/deltaspike/data/test/service/ParentRepository.java>:[69,20]
cannot find symbol
[ERROR] symbol  : variable Parent_
[ERROR] location: class org.apache.deltaspike.data.test.service.ParentRepository
[ERROR] <https://builds.apache.org/job/DeltaSpike%20OWB%201.2.0/ws/deltaspike/modules/data/impl/src/test/java/org/apache/deltaspike/data/test/service/ParentRepository.java>:[79,20]
cannot find symbol
[ERROR] symbol  : variable Parent_
[ERROR] location: class org.apache.deltaspike.data.test.service.ParentRepository
[ERROR] <https://builds.apache.org/job/DeltaSpike%20OWB%201.2.0/ws/deltaspike/modules/data/impl/src/test/java/org/apache/deltaspike/data/test/service/ParentRepository.java>:[91,41]
cannot find symbol
[ERROR] symbol  : variable Parent_
[ERROR] location: class org.apache.deltaspike.data.test.service.ParentRepository
[ERROR] <https://builds.apache.org/job/DeltaSpike%20OWB%201.2.0/ws/deltaspike/modules/data/impl/src/test/java/org/apache/deltaspike/data/test/service/ParentRepository.java>:[90,36]
cannot find symbol
[ERROR] symbol  : variable Parent_
[ERROR] location: class org.apache.deltaspike.data.test.service.ParentRepository
[ERROR] <https://builds.apache.org/job/DeltaSpike%20OWB%201.2.0/ws/deltaspike/modules/data/impl/src/test/java/org/apache/deltaspike/data/test/service/ParentRepository.java>:[94,41]
cannot find symbol
[ERROR] symbol  : variable Parent_
[ERROR] location: class org.apache.deltaspike.data.test.service.ParentRepository
[ERROR] <https://builds.apache.org/job/DeltaSpike%20OWB%201.2.0/ws/deltaspike/modules/data/impl/src/test/java/org/apache/deltaspike/data/test/service/ParentRepository.java>:[93,36]
cannot find symbol
[ERROR] symbol  : variable Parent_
[ERROR] location: class org.apache.deltaspike.data.test.service.ParentRepository
[ERROR] <https://builds.apache.org/job/DeltaSpike%20OWB%201.2.0/ws/deltaspike/modules/data/impl/src/test/java/org/apache/deltaspike/data/test/service/ParentRepository.java>:[96,36]
cannot find symbol
[ERROR] symbol  : variable Parent_
[ERROR] location: class org.apache.deltaspike.data.test.service.ParentRepository
[ERROR] <https://builds.apache.org/job/DeltaSpike%20OWB%201.2.0/ws/deltaspike/modules/data/impl/src/test/java/org/apache/deltaspike/data/test/service/ParentRepository.java>:[105,26]
cannot find symbol
[ERROR] symbol  : variable Parent_
[ERROR] location: class org.apache.deltaspike.data.test.service.ParentRepository
[ERROR] <https://builds.apache.org/job/DeltaSpike%20OWB%201.2.0/ws/deltaspike/modules/data/impl/src/test/java/org/apache/deltaspike/data/impl/mapping/MappedRepositoryTest.java>:[154,36]
package Simple_ does not exist
[ERROR] <https://builds.apache.org/job/DeltaSpike%20OWB%201.2.0/ws/deltaspike/modules/data/impl/src/test/java/org/apache/deltaspike/data/impl/QueryResultTest.java>:[82,26]
cannot find symbol
[ERROR] symbol  : variable Simple_
[ERROR] location: class org.apache.deltaspike.data.impl.QueryResultTest
[ERROR] <https://builds.apache.org/job/DeltaSpike%20OWB%201.2.0/ws/deltaspike/modules/data/impl/src/test/java/org/apache/deltaspike/data/impl/QueryResultTest.java>:[81,27]
cannot find symbol
[ERROR] symbol  : variable Simple_
[ERROR] location: class org.apache.deltaspike.data.impl.QueryResultTest
[ERROR] <https://builds.apache.org/job/DeltaSpike%20OWB%201.2.0/ws/deltaspike/modules/data/impl/src/test/java/org/apache/deltaspike/data/impl/QueryResultTest.java>:[119,29]
cannot find symbol
[ERROR] symbol  : variable Simple_
[ERROR] location: class org.apache.deltaspike.data.impl.QueryResultTest
[ERROR] <https://builds.apache.org/job/DeltaSpike%20OWB%201.2.0/ws/deltaspike/modules/data/impl/src/test/java/org/apache/deltaspike/data/impl/QueryResultTest.java>:[122,29]
cannot find symbol
[ERROR] symbol  : variable Simple_
[ERROR] location: class org.apache.deltaspike.data.impl.QueryResultTest
[ERROR] <https://builds.apache.org/job/DeltaSpike%20OWB%201.2.0/ws/deltaspike/modules/data/impl/src/test/java/org/apache/deltaspike/data/impl/QueryResultTest.java>:[142,29]
cannot find symbol
[ERROR] symbol  : variable Simple_
[ERROR] location: class org.apache.deltaspike.data.impl.QueryResultTest
[ERROR] <https://builds.apache.org/job/DeltaSpike%20OWB%201.2.0/ws/deltaspike/modules/data/impl/src/test/java/org/apache/deltaspike/data/impl/QueryResultTest.java>:[179,27]
cannot find symbol
[ERROR] symbol  : variable Simple_
[ERROR] location: class org.apache.deltaspike.data.impl.QueryResultTest
[ERROR] <https://builds.apache.org/job/DeltaSpike%20OWB%201.2.0/ws/deltaspike/modules/data/impl/src/test/java/org/apache/deltaspike/data/impl/QueryResultTest.java>:[240,27]
cannot find symbol
[ERROR] symbol  : variable Simple_
[ERROR] location: class org.apache.deltaspike.data.impl.QueryResultTest
[ERROR] <https://builds.apache.org/job/DeltaSpike%20OWB%201.2.0/ws/deltaspike/modules/data/impl/src/test/java/org/apache/deltaspike/data/impl/QueryResultTest.java>:[396,26]
cannot find symbol
[ERROR] symbol  : variable Simple_
[ERROR] location: class org.apache.deltaspike.data.impl.QueryResultTest
[ERROR] <https://builds.apache.org/job/DeltaSpike%20OWB%201.2.0/ws/deltaspike/modules/data/impl/src/test/java/org/apache/deltaspike/data/impl/QueryResultTest.java>:[395,27]
cannot find symbol
[ERROR] symbol  : variable Simple_
[ERROR] location: class org.apache.deltaspike.data.impl.QueryResultTest
[ERROR] <https://builds.apache.org/job/DeltaSpike%20OWB%201.2.0/ws/deltaspike/modules/data/impl/src/test/java/org/apache/deltaspike/data/impl/handler/EntityRepositoryHandlerTest.java>:[179,48]
cannot find symbol
[ERROR] symbol  : variable Simple_
[ERROR] location: class org.apache.deltaspike.data.impl.handler.EntityRepositoryHandlerTest
[ERROR] <https://builds.apache.org/job/DeltaSpike%20OWB%201.2.0/ws/deltaspike/modules/data/impl/src/test/java/org/apache/deltaspike/data/impl/handler/EntityRepositoryHandlerTest.java>:[196,54]
cannot find symbol
[ERROR] symbol  : variable Simple_
[ERROR] location: class org.apache.deltaspike.data.impl.handler.EntityRepositoryHandlerTest
[ERROR] <https://builds.apache.org/job/DeltaSpike%20OWB%201.2.0/ws/deltaspike/modules/data/impl/src/test/java/org/apache/deltaspike/data/impl/handler/EntityRepositoryHandlerTest.java>:[196,68]
cannot find symbol
[ERROR] symbol  : variable Simple_
[ERROR] location: class org.apache.deltaspike.data.impl.handler.EntityRepositoryHandlerTest
[ERROR] <https://builds.apache.org/job/DeltaSpike%20OWB%201.2.0/ws/deltaspike/modules/data/impl/src/test/java/org/apache/deltaspike/data/impl/handler/EntityRepositoryHandlerTest.java>:[260,53]
cannot find symbol
[ERROR] symbol  : variable Simple_
[ERROR] location: class org.apache.deltaspike.data.impl.handler.EntityRepositoryHandlerTest
[ERROR] <https://builds.apache.org/job/DeltaSpike%20OWB%201.2.0/ws/deltaspike/modules/data/impl/src/test/java/org/apache/deltaspike/data/impl/handler/EntityRepositoryHandlerTest.java>:[276,60]
cannot find symbol
[ERROR] symbol  : variable Simple_
[ERROR] location: class org.apache.deltaspike.data.impl.handler.EntityRepositoryHandlerTest
[ERROR] <https://builds.apache.org/job/DeltaSpike%20OWB%201.2.0/ws/deltaspike/modules/data/impl/src/test/java/org/apache/deltaspike/data/impl/handler/EntityRepositoryHandlerTest.java>:[293,53]
cannot find symbol
[ERROR] symbol  : variable Simple_
[ERROR] location: class org.apache.deltaspike.data.impl.handler.EntityRepositoryHandlerTest
[ERROR] <https://builds.apache.org/job/DeltaSpike%20OWB%201.2.0/ws/deltaspike/modules/data/impl/src/test/java/org/apache/deltaspike/data/impl/handler/EntityRepositoryHandlerTest.java>:[293,67]
cannot find symbol
[ERROR] symbol  : variable Simple_
[ERROR] location: class org.apache.deltaspike.data.impl.handler.EntityRepositoryHandlerTest
[ERROR] <https://builds.apache.org/job/DeltaSpike%20OWB%201.2.0/ws/deltaspike/modules/data/impl/src/test/java/org/apache/deltaspike/data/impl/handler/EntityRepositoryHandlerTest.java>:[321,41]
cannot find symbol
[ERROR] symbol  : variable Simple_
[ERROR] location: class org.apache.deltaspike.data.impl.handler.EntityRepositoryHandlerTest
[ERROR] <https://builds.apache.org/job/DeltaSpike%20OWB%201.2.0/ws/deltaspike/modules/data/impl/src/test/java/org/apache/deltaspike/data/impl/handler/EntityRepositoryHandlerTest.java>:[321,55]
cannot find symbol
[ERROR] symbol  : variable Simple_
[ERROR] location: class org.apache.deltaspike.data.impl.handler.EntityRepositoryHandlerTest
[ERROR] <https://builds.apache.org/job/DeltaSpike%20OWB%201.2.0/ws/deltaspike/modules/data/impl/src/test/java/org/apache/deltaspike/data/impl/handler/EntityRepositoryHandlerTest.java>:[353,45]
cannot find symbol
[ERROR] symbol  : variable Simple_
[ERROR] location: class org.apache.deltaspike.data.impl.handler.EntityRepositoryHandlerTest
[ERROR] -> [Help 1]
[ERROR] 
[ERROR] To see the full stack trace of the errors, re-run Maven with the -e switch.
[ERROR] Re-run Maven using the -X switch to enable full debug logging.
[ERROR] 
[ERROR] For more information about the errors and possible solutions, please read the following
articles:
[ERROR] [Help 1] http://cwiki.apache.org/confluence/display/MAVEN/MojoFailureException
[ERROR] 
[ERROR] After correcting the problems, you can resume the build with the command
[ERROR]   mvn <goals> -rf :deltaspike-data-module-impl
[JENKINS] Archiving <https://builds.apache.org/job/DeltaSpike%20OWB%201.2.0/ws/deltaspike/examples/jse-examples/pom.xml>
to org.apache.deltaspike.examples/deltaspike-jse-example/1.6.1-SNAPSHOT/deltaspike-jse-example-1.6.1-SNAPSHOT.pom
[JENKINS] Archiving <https://builds.apache.org/job/DeltaSpike%20OWB%201.2.0/ws/deltaspike/examples/security-requested-page-after-login-cdi/pom.xml>
to org.apache.deltaspike.examples/deltaspike-security-requested-page-after-login-cdi/1.6.1-SNAPSHOT/deltaspike-security-requested-page-after-login-cdi-1.6.1-SNAPSHOT.pom
[JENKINS] Archiving <https://builds.apache.org/job/DeltaSpike%20OWB%201.2.0/ws/deltaspike/test-utils/pom.xml>
to org.apache.deltaspike.test/test-utils/1.6.1-SNAPSHOT/test-utils-1.6.1-SNAPSHOT.pom
[JENKINS] Archiving <https://builds.apache.org/job/DeltaSpike%20OWB%201.2.0/ws/deltaspike/test-utils/target/test-utils-1.6.1-SNAPSHOT.jar>
to org.apache.deltaspike.test/test-utils/1.6.1-SNAPSHOT/test-utils-1.6.1-SNAPSHOT.jar
[JENKINS] Archiving <https://builds.apache.org/job/DeltaSpike%20OWB%201.2.0/ws/deltaspike/test-utils/target/test-utils-1.6.1-SNAPSHOT-sources.jar>
to org.apache.deltaspike.test/test-utils/1.6.1-SNAPSHOT/test-utils-1.6.1-SNAPSHOT-sources.jar
[JENKINS] Archiving <https://builds.apache.org/job/DeltaSpike%20OWB%201.2.0/ws/deltaspike/modules/data/impl/pom.xml>
to org.apache.deltaspike.modules/deltaspike-data-module-impl/1.6.1-SNAPSHOT/deltaspike-data-module-impl-1.6.1-SNAPSHOT.pom
[JENKINS] Archiving <https://builds.apache.org/job/DeltaSpike%20OWB%201.2.0/ws/deltaspike/modules/data/api/pom.xml>
to org.apache.deltaspike.modules/deltaspike-data-module-api/1.6.1-SNAPSHOT/deltaspike-data-module-api-1.6.1-SNAPSHOT.pom
[JENKINS] Archiving <https://builds.apache.org/job/DeltaSpike%20OWB%201.2.0/ws/deltaspike/modules/data/api/target/deltaspike-data-module-api-1.6.1-SNAPSHOT.jar>
to org.apache.deltaspike.modules/deltaspike-data-module-api/1.6.1-SNAPSHOT/deltaspike-data-module-api-1.6.1-SNAPSHOT.jar
[JENKINS] Archiving <https://builds.apache.org/job/DeltaSpike%20OWB%201.2.0/ws/deltaspike/modules/data/api/target/deltaspike-data-module-api-1.6.1-SNAPSHOT-tests.jar>
to org.apache.deltaspike.modules/deltaspike-data-module-api/1.6.1-SNAPSHOT/deltaspike-data-module-api-1.6.1-SNAPSHOT-tests.jar
[JENKINS] Archiving <https://builds.apache.org/job/DeltaSpike%20OWB%201.2.0/ws/deltaspike/modules/data/api/target/deltaspike-data-module-api-1.6.1-SNAPSHOT-sources.jar>
to org.apache.deltaspike.modules/deltaspike-data-module-api/1.6.1-SNAPSHOT/deltaspike-data-module-api-1.6.1-SNAPSHOT-sources.jar
[JENKINS] Archiving <https://builds.apache.org/job/DeltaSpike%20OWB%201.2.0/ws/deltaspike/core/impl/pom.xml>
to org.apache.deltaspike.core/deltaspike-core-impl/1.6.1-SNAPSHOT/deltaspike-core-impl-1.6.1-SNAPSHOT.pom
[JENKINS] Archiving <https://builds.apache.org/job/DeltaSpike%20OWB%201.2.0/ws/deltaspike/core/impl/target/deltaspike-core-impl-1.6.1-SNAPSHOT.jar>
to org.apache.deltaspike.core/deltaspike-core-impl/1.6.1-SNAPSHOT/deltaspike-core-impl-1.6.1-SNAPSHOT.jar
[JENKINS] Archiving <https://builds.apache.org/job/DeltaSpike%20OWB%201.2.0/ws/deltaspike/core/impl/target/deltaspike-core-impl-1.6.1-SNAPSHOT-tests.jar>
to org.apache.deltaspike.core/deltaspike-core-impl/1.6.1-SNAPSHOT/deltaspike-core-impl-1.6.1-SNAPSHOT-tests.jar
[JENKINS] Archiving <https://builds.apache.org/job/DeltaSpike%20OWB%201.2.0/ws/deltaspike/core/impl/target/deltaspike-core-impl-1.6.1-SNAPSHOT-sources.jar>
to org.apache.deltaspike.core/deltaspike-core-impl/1.6.1-SNAPSHOT/deltaspike-core-impl-1.6.1-SNAPSHOT-sources.jar
[JENKINS] Archiving <https://builds.apache.org/job/DeltaSpike%20OWB%201.2.0/ws/deltaspike/modules/pom.xml>
to org.apache.deltaspike.modules/modules-project/1.6.1-SNAPSHOT/modules-project-1.6.1-SNAPSHOT.pom
[JENKINS] Archiving <https://builds.apache.org/job/DeltaSpike%20OWB%201.2.0/ws/deltaspike/modules/target/modules-project-1.6.1-SNAPSHOT-tests.jar>
to org.apache.deltaspike.modules/modules-project/1.6.1-SNAPSHOT/modules-project-1.6.1-SNAPSHOT-tests.jar
[JENKINS] Archiving <https://builds.apache.org/job/DeltaSpike%20OWB%201.2.0/ws/deltaspike/modules/test-control/pom.xml>
to org.apache.deltaspike.modules/test-control-module-project/1.6.1-SNAPSHOT/test-control-module-project-1.6.1-SNAPSHOT.pom
[JENKINS] Archiving <https://builds.apache.org/job/DeltaSpike%20OWB%201.2.0/ws/deltaspike/examples/jsf-examples/pom.xml>
to org.apache.deltaspike.examples/deltaspike-jsf-example/1.6.1-SNAPSHOT/deltaspike-jsf-example-1.6.1-SNAPSHOT.pom
[JENKINS] Archiving <https://builds.apache.org/job/DeltaSpike%20OWB%201.2.0/ws/deltaspike/cdictrl/api/pom.xml>
to org.apache.deltaspike.cdictrl/deltaspike-cdictrl-api/1.6.1-SNAPSHOT/deltaspike-cdictrl-api-1.6.1-SNAPSHOT.pom
[JENKINS] Archiving <https://builds.apache.org/job/DeltaSpike%20OWB%201.2.0/ws/deltaspike/cdictrl/api/target/deltaspike-cdictrl-api-1.6.1-SNAPSHOT.jar>
to org.apache.deltaspike.cdictrl/deltaspike-cdictrl-api/1.6.1-SNAPSHOT/deltaspike-cdictrl-api-1.6.1-SNAPSHOT.jar
[JENKINS] Archiving <https://builds.apache.org/job/DeltaSpike%20OWB%201.2.0/ws/deltaspike/cdictrl/api/target/deltaspike-cdictrl-api-1.6.1-SNAPSHOT-sources.jar>
to org.apache.deltaspike.cdictrl/deltaspike-cdictrl-api/1.6.1-SNAPSHOT/deltaspike-cdictrl-api-1.6.1-SNAPSHOT-sources.jar
[JENKINS] Archiving <https://builds.apache.org/job/DeltaSpike%20OWB%201.2.0/ws/deltaspike/cdictrl/servlet/pom.xml>
to org.apache.deltaspike.cdictrl/deltaspike-cdictrl-servlet/1.6.1-SNAPSHOT/deltaspike-cdictrl-servlet-1.6.1-SNAPSHOT.pom
[JENKINS] Archiving <https://builds.apache.org/job/DeltaSpike%20OWB%201.2.0/ws/deltaspike/cdictrl/servlet/target/deltaspike-cdictrl-servlet-1.6.1-SNAPSHOT.jar>
to org.apache.deltaspike.cdictrl/deltaspike-cdictrl-servlet/1.6.1-SNAPSHOT/deltaspike-cdictrl-servlet-1.6.1-SNAPSHOT.jar
[JENKINS] Archiving <https://builds.apache.org/job/DeltaSpike%20OWB%201.2.0/ws/deltaspike/cdictrl/servlet/target/deltaspike-cdictrl-servlet-1.6.1-SNAPSHOT-sources.jar>
to org.apache.deltaspike.cdictrl/deltaspike-cdictrl-servlet/1.6.1-SNAPSHOT/deltaspike-cdictrl-servlet-1.6.1-SNAPSHOT-sources.jar
[JENKINS] Archiving <https://builds.apache.org/job/DeltaSpike%20OWB%201.2.0/ws/deltaspike/examples/scheduler-playground/pom.xml>
to org.apache.deltaspike.examples/deltaspike-scheduler-example/1.6.1-SNAPSHOT/deltaspike-scheduler-example-1.6.1-SNAPSHOT.pom
[JENKINS] Archiving <https://builds.apache.org/job/DeltaSpike%20OWB%201.2.0/ws/deltaspike/checkstyle-rules/pom.xml>
to org.apache.deltaspike/checkstyle-rules/1.6.1-SNAPSHOT/checkstyle-rules-1.6.1-SNAPSHOT.pom
[JENKINS] Archiving <https://builds.apache.org/job/DeltaSpike%20OWB%201.2.0/ws/deltaspike/checkstyle-rules/target/checkstyle-rules-1.6.1-SNAPSHOT.jar>
to org.apache.deltaspike/checkstyle-rules/1.6.1-SNAPSHOT/checkstyle-rules-1.6.1-SNAPSHOT.jar
[JENKINS] Archiving <https://builds.apache.org/job/DeltaSpike%20OWB%201.2.0/ws/deltaspike/parent/code/pom.xml>
to org.apache.deltaspike/parent-code/1.6.1-SNAPSHOT/parent-code-1.6.1-SNAPSHOT.pom
[JENKINS] Archiving <https://builds.apache.org/job/DeltaSpike%20OWB%201.2.0/ws/deltaspike/parent/code/target/parent-code-1.6.1-SNAPSHOT-tests.jar>
to org.apache.deltaspike/parent-code/1.6.1-SNAPSHOT/parent-code-1.6.1-SNAPSHOT-tests.jar
Compressed 79.64 KB of artifacts by 40.2% relative to #829
[JENKINS] Archiving <https://builds.apache.org/job/DeltaSpike%20OWB%201.2.0/ws/deltaspike/modules/jsf/impl/pom.xml>
to org.apache.deltaspike.modules/deltaspike-jsf-module-impl/1.6.1-SNAPSHOT/deltaspike-jsf-module-impl-1.6.1-SNAPSHOT.pom
[JENKINS] Archiving <https://builds.apache.org/job/DeltaSpike%20OWB%201.2.0/ws/deltaspike/modules/jsf/impl/target/deltaspike-jsf-module-impl-1.6.1-SNAPSHOT.jar>
to org.apache.deltaspike.modules/deltaspike-jsf-module-impl/1.6.1-SNAPSHOT/deltaspike-jsf-module-impl-1.6.1-SNAPSHOT.jar
[JENKINS] Archiving <https://builds.apache.org/job/DeltaSpike%20OWB%201.2.0/ws/deltaspike/modules/jsf/impl/target/deltaspike-jsf-module-impl-1.6.1-SNAPSHOT-tests.jar>
to org.apache.deltaspike.modules/deltaspike-jsf-module-impl/1.6.1-SNAPSHOT/deltaspike-jsf-module-impl-1.6.1-SNAPSHOT-tests.jar
[JENKINS] Archiving <https://builds.apache.org/job/DeltaSpike%20OWB%201.2.0/ws/deltaspike/modules/jsf/impl/target/deltaspike-jsf-module-impl-1.6.1-SNAPSHOT-sources.jar>
to org.apache.deltaspike.modules/deltaspike-jsf-module-impl/1.6.1-SNAPSHOT/deltaspike-jsf-module-impl-1.6.1-SNAPSHOT-sources.jar
[JENKINS] Archiving <https://builds.apache.org/job/DeltaSpike%20OWB%201.2.0/ws/deltaspike/modules/partial-bean/pom.xml>
to org.apache.deltaspike.modules/partial-bean-module-project/1.6.1-SNAPSHOT/partial-bean-module-project-1.6.1-SNAPSHOT.pom
[JENKINS] Archiving <https://builds.apache.org/job/DeltaSpike%20OWB%201.2.0/ws/deltaspike/modules/partial-bean/target/partial-bean-module-project-1.6.1-SNAPSHOT-tests.jar>
to org.apache.deltaspike.modules/partial-bean-module-project/1.6.1-SNAPSHOT/partial-bean-module-project-1.6.1-SNAPSHOT-tests.jar
[JENKINS] Archiving <https://builds.apache.org/job/DeltaSpike%20OWB%201.2.0/ws/deltaspike/examples/pom.xml>
to org.apache.deltaspike.examples/examples-project/1.6.1-SNAPSHOT/examples-project-1.6.1-SNAPSHOT.pom
[JENKINS] Archiving <https://builds.apache.org/job/DeltaSpike%20OWB%201.2.0/ws/deltaspike/modules/jsf/pom.xml>
to org.apache.deltaspike.modules/jsf-module-project/1.6.1-SNAPSHOT/jsf-module-project-1.6.1-SNAPSHOT.pom
[JENKINS] Archiving <https://builds.apache.org/job/DeltaSpike%20OWB%201.2.0/ws/deltaspike/modules/jsf/target/jsf-module-project-1.6.1-SNAPSHOT-tests.jar>
to org.apache.deltaspike.modules/jsf-module-project/1.6.1-SNAPSHOT/jsf-module-project-1.6.1-SNAPSHOT-tests.jar
[JENKINS] Archiving <https://builds.apache.org/job/DeltaSpike%20OWB%201.2.0/ws/deltaspike/cdictrl/tck/pom.xml>
to org.apache.deltaspike.test/deltaspike-cdictrl-tck/1.6.1-SNAPSHOT/deltaspike-cdictrl-tck-1.6.1-SNAPSHOT.pom
[JENKINS] Archiving <https://builds.apache.org/job/DeltaSpike%20OWB%201.2.0/ws/deltaspike/cdictrl/tck/target/deltaspike-cdictrl-tck-1.6.1-SNAPSHOT.jar>
to org.apache.deltaspike.test/deltaspike-cdictrl-tck/1.6.1-SNAPSHOT/deltaspike-cdictrl-tck-1.6.1-SNAPSHOT.jar
[JENKINS] Archiving <https://builds.apache.org/job/DeltaSpike%20OWB%201.2.0/ws/deltaspike/cdictrl/tck/target/deltaspike-cdictrl-tck-1.6.1-SNAPSHOT-sources.jar>
to org.apache.deltaspike.test/deltaspike-cdictrl-tck/1.6.1-SNAPSHOT/deltaspike-cdictrl-tck-1.6.1-SNAPSHOT-sources.jar
[JENKINS] Archiving <https://builds.apache.org/job/DeltaSpike%20OWB%201.2.0/ws/deltaspike/modules/jsf/api/pom.xml>
to org.apache.deltaspike.modules/deltaspike-jsf-module-api/1.6.1-SNAPSHOT/deltaspike-jsf-module-api-1.6.1-SNAPSHOT.pom
[JENKINS] Archiving <https://builds.apache.org/job/DeltaSpike%20OWB%201.2.0/ws/deltaspike/modules/jsf/api/target/deltaspike-jsf-module-api-1.6.1-SNAPSHOT.jar>
to org.apache.deltaspike.modules/deltaspike-jsf-module-api/1.6.1-SNAPSHOT/deltaspike-jsf-module-api-1.6.1-SNAPSHOT.jar
[JENKINS] Archiving <https://builds.apache.org/job/DeltaSpike%20OWB%201.2.0/ws/deltaspike/modules/jsf/api/target/deltaspike-jsf-module-api-1.6.1-SNAPSHOT-tests.jar>
to org.apache.deltaspike.modules/deltaspike-jsf-module-api/1.6.1-SNAPSHOT/deltaspike-jsf-module-api-1.6.1-SNAPSHOT-tests.jar
[JENKINS] Archiving <https://builds.apache.org/job/DeltaSpike%20OWB%201.2.0/ws/deltaspike/modules/jsf/api/target/deltaspike-jsf-module-api-1.6.1-SNAPSHOT-sources.jar>
to org.apache.deltaspike.modules/deltaspike-jsf-module-api/1.6.1-SNAPSHOT/deltaspike-jsf-module-api-1.6.1-SNAPSHOT-sources.jar
[JENKINS] Archiving <https://builds.apache.org/job/DeltaSpike%20OWB%201.2.0/ws/deltaspike/modules/security/pom.xml>
to org.apache.deltaspike.modules/security-module-project/1.6.1-SNAPSHOT/security-module-project-1.6.1-SNAPSHOT.pom
[JENKINS] Archiving <https://builds.apache.org/job/DeltaSpike%20OWB%201.2.0/ws/deltaspike/modules/security/target/security-module-project-1.6.1-SNAPSHOT-tests.jar>
to org.apache.deltaspike.modules/security-module-project/1.6.1-SNAPSHOT/security-module-project-1.6.1-SNAPSHOT-tests.jar
[JENKINS] Archiving <https://builds.apache.org/job/DeltaSpike%20OWB%201.2.0/ws/deltaspike/modules/bean-validation/pom.xml>
to org.apache.deltaspike.modules/bean-validation-module-project/1.6.1-SNAPSHOT/bean-validation-module-project-1.6.1-SNAPSHOT.pom
[JENKINS] Archiving <https://builds.apache.org/job/DeltaSpike%20OWB%201.2.0/ws/deltaspike/modules/bean-validation/target/bean-validation-module-project-1.6.1-SNAPSHOT-tests.jar>
to org.apache.deltaspike.modules/bean-validation-module-project/1.6.1-SNAPSHOT/bean-validation-module-project-1.6.1-SNAPSHOT-tests.jar
[JENKINS] Archiving <https://builds.apache.org/job/DeltaSpike%20OWB%201.2.0/ws/deltaspike/modules/partial-bean/impl/pom.xml>
to org.apache.deltaspike.modules/deltaspike-partial-bean-module-impl/1.6.1-SNAPSHOT/deltaspike-partial-bean-module-impl-1.6.1-SNAPSHOT.pom
[JENKINS] Archiving <https://builds.apache.org/job/DeltaSpike%20OWB%201.2.0/ws/deltaspike/modules/partial-bean/impl/target/deltaspike-partial-bean-module-impl-1.6.1-SNAPSHOT.jar>
to org.apache.deltaspike.modules/deltaspike-partial-bean-module-impl/1.6.1-SNAPSHOT/deltaspike-partial-bean-module-impl-1.6.1-SNAPSHOT.jar
[JENKINS] Archiving <https://builds.apache.org/job/DeltaSpike%20OWB%201.2.0/ws/deltaspike/modules/partial-bean/impl/target/deltaspike-partial-bean-module-impl-1.6.1-SNAPSHOT-tests.jar>
to org.apache.deltaspike.modules/deltaspike-partial-bean-module-impl/1.6.1-SNAPSHOT/deltaspike-partial-bean-module-impl-1.6.1-SNAPSHOT-tests.jar
[JENKINS] Archiving <https://builds.apache.org/job/DeltaSpike%20OWB%201.2.0/ws/deltaspike/modules/partial-bean/impl/target/deltaspike-partial-bean-module-impl-1.6.1-SNAPSHOT-sources.jar>
to org.apache.deltaspike.modules/deltaspike-partial-bean-module-impl/1.6.1-SNAPSHOT/deltaspike-partial-bean-module-impl-1.6.1-SNAPSHOT-sources.jar
[JENKINS] Archiving <https://builds.apache.org/job/DeltaSpike%20OWB%201.2.0/ws/deltaspike/modules/proxy/api/pom.xml>
to org.apache.deltaspike.modules/deltaspike-proxy-module-api/1.6.1-SNAPSHOT/deltaspike-proxy-module-api-1.6.1-SNAPSHOT.pom
[JENKINS] Archiving <https://builds.apache.org/job/DeltaSpike%20OWB%201.2.0/ws/deltaspike/modules/proxy/api/target/deltaspike-proxy-module-api-1.6.1-SNAPSHOT.jar>
to org.apache.deltaspike.modules/deltaspike-proxy-module-api/1.6.1-SNAPSHOT/deltaspike-proxy-module-api-1.6.1-SNAPSHOT.jar
[JENKINS] Archiving <https://builds.apache.org/job/DeltaSpike%20OWB%201.2.0/ws/deltaspike/modules/proxy/api/target/deltaspike-proxy-module-api-1.6.1-SNAPSHOT-tests.jar>
to org.apache.deltaspike.modules/deltaspike-proxy-module-api/1.6.1-SNAPSHOT/deltaspike-proxy-module-api-1.6.1-SNAPSHOT-tests.jar
[JENKINS] Archiving <https://builds.apache.org/job/DeltaSpike%20OWB%201.2.0/ws/deltaspike/modules/proxy/api/target/deltaspike-proxy-module-api-1.6.1-SNAPSHOT-sources.jar>
to org.apache.deltaspike.modules/deltaspike-proxy-module-api/1.6.1-SNAPSHOT/deltaspike-proxy-module-api-1.6.1-SNAPSHOT-sources.jar
[JENKINS] Archiving <https://builds.apache.org/job/DeltaSpike%20OWB%201.2.0/ws/deltaspike/modules/jpa/api/pom.xml>
to org.apache.deltaspike.modules/deltaspike-jpa-module-api/1.6.1-SNAPSHOT/deltaspike-jpa-module-api-1.6.1-SNAPSHOT.pom
[JENKINS] Archiving <https://builds.apache.org/job/DeltaSpike%20OWB%201.2.0/ws/deltaspike/modules/jpa/api/target/deltaspike-jpa-module-api-1.6.1-SNAPSHOT.jar>
to org.apache.deltaspike.modules/deltaspike-jpa-module-api/1.6.1-SNAPSHOT/deltaspike-jpa-module-api-1.6.1-SNAPSHOT.jar
[JENKINS] Archiving <https://builds.apache.org/job/DeltaSpike%20OWB%201.2.0/ws/deltaspike/modules/jpa/api/target/deltaspike-jpa-module-api-1.6.1-SNAPSHOT-tests.jar>
to org.apache.deltaspike.modules/deltaspike-jpa-module-api/1.6.1-SNAPSHOT/deltaspike-jpa-module-api-1.6.1-SNAPSHOT-tests.jar
[JENKINS] Archiving <https://builds.apache.org/job/DeltaSpike%20OWB%201.2.0/ws/deltaspike/modules/jpa/api/target/deltaspike-jpa-module-api-1.6.1-SNAPSHOT-sources.jar>
to org.apache.deltaspike.modules/deltaspike-jpa-module-api/1.6.1-SNAPSHOT/deltaspike-jpa-module-api-1.6.1-SNAPSHOT-sources.jar
[JENKINS] Archiving <https://builds.apache.org/job/DeltaSpike%20OWB%201.2.0/ws/deltaspike/modules/servlet/api/pom.xml>
to org.apache.deltaspike.modules/deltaspike-servlet-module-api/1.6.1-SNAPSHOT/deltaspike-servlet-module-api-1.6.1-SNAPSHOT.pom
[JENKINS] Archiving <https://builds.apache.org/job/DeltaSpike%20OWB%201.2.0/ws/deltaspike/modules/servlet/api/target/deltaspike-servlet-module-api-1.6.1-SNAPSHOT.jar>
to org.apache.deltaspike.modules/deltaspike-servlet-module-api/1.6.1-SNAPSHOT/deltaspike-servlet-module-api-1.6.1-SNAPSHOT.jar
[JENKINS] Archiving <https://builds.apache.org/job/DeltaSpike%20OWB%201.2.0/ws/deltaspike/modules/servlet/api/target/deltaspike-servlet-module-api-1.6.1-SNAPSHOT-tests.jar>
to org.apache.deltaspike.modules/deltaspike-servlet-module-api/1.6.1-SNAPSHOT/deltaspike-servlet-module-api-1.6.1-SNAPSHOT-tests.jar
[JENKINS] Archiving <https://builds.apache.org/job/DeltaSpike%20OWB%201.2.0/ws/deltaspike/modules/servlet/api/target/deltaspike-servlet-module-api-1.6.1-SNAPSHOT-sources.jar>
to org.apache.deltaspike.modules/deltaspike-servlet-module-api/1.6.1-SNAPSHOT/deltaspike-servlet-module-api-1.6.1-SNAPSHOT-sources.jar
[JENKINS] Archiving <https://builds.apache.org/job/DeltaSpike%20OWB%201.2.0/ws/deltaspike/modules/jpa/pom.xml>
to org.apache.deltaspike.modules/jpa-module-project/1.6.1-SNAPSHOT/jpa-module-project-1.6.1-SNAPSHOT.pom
[JENKINS] Archiving <https://builds.apache.org/job/DeltaSpike%20OWB%201.2.0/ws/deltaspike/modules/jpa/target/jpa-module-project-1.6.1-SNAPSHOT-tests.jar>
to org.apache.deltaspike.modules/jpa-module-project/1.6.1-SNAPSHOT/jpa-module-project-1.6.1-SNAPSHOT-tests.jar
[JENKINS] Archiving <https://builds.apache.org/job/DeltaSpike%20OWB%201.2.0/ws/deltaspike/cdictrl/pom.xml>
to org.apache.deltaspike.cdictrl/cdictrl-project/1.6.1-SNAPSHOT/cdictrl-project-1.6.1-SNAPSHOT.pom
[JENKINS] Archiving <https://builds.apache.org/job/DeltaSpike%20OWB%201.2.0/ws/deltaspike/modules/scheduler/api/pom.xml>
to org.apache.deltaspike.modules/deltaspike-scheduler-module-api/1.6.1-SNAPSHOT/deltaspike-scheduler-module-api-1.6.1-SNAPSHOT.pom
[JENKINS] Archiving <https://builds.apache.org/job/DeltaSpike%20OWB%201.2.0/ws/deltaspike/modules/test-control/impl/pom.xml>
to org.apache.deltaspike.modules/deltaspike-test-control-module-impl/1.6.1-SNAPSHOT/deltaspike-test-control-module-impl-1.6.1-SNAPSHOT.pom
[JENKINS] Archiving <https://builds.apache.org/job/DeltaSpike%20OWB%201.2.0/ws/deltaspike/modules/servlet/pom.xml>
to org.apache.deltaspike.modules/servlet-module-project/1.6.1-SNAPSHOT/servlet-module-project-1.6.1-SNAPSHOT.pom
[JENKINS] Archiving <https://builds.apache.org/job/DeltaSpike%20OWB%201.2.0/ws/deltaspike/modules/servlet/target/servlet-module-project-1.6.1-SNAPSHOT-tests.jar>
to org.apache.deltaspike.modules/servlet-module-project/1.6.1-SNAPSHOT/servlet-module-project-1.6.1-SNAPSHOT-tests.jar
[JENKINS] Archiving <https://builds.apache.org/job/DeltaSpike%20OWB%201.2.0/ws/deltaspike/modules/test-control/api/pom.xml>
to org.apache.deltaspike.modules/deltaspike-test-control-module-api/1.6.1-SNAPSHOT/deltaspike-test-control-module-api-1.6.1-SNAPSHOT.pom
[JENKINS] Archiving <https://builds.apache.org/job/DeltaSpike%20OWB%201.2.0/ws/deltaspike/modules/jsf/impl-ee6/pom.xml>
to org.apache.deltaspike.modules/deltaspike-jsf-module-impl-ee6/1.6.1-SNAPSHOT/deltaspike-jsf-module-impl-ee6-1.6.1-SNAPSHOT.pom
[JENKINS] Archiving <https://builds.apache.org/job/DeltaSpike%20OWB%201.2.0/ws/deltaspike/modules/jsf/impl-ee6/target/deltaspike-jsf-module-impl-ee6-1.6.1-SNAPSHOT.jar>
to org.apache.deltaspike.modules/deltaspike-jsf-module-impl-ee6/1.6.1-SNAPSHOT/deltaspike-jsf-module-impl-ee6-1.6.1-SNAPSHOT.jar
[JENKINS] Archiving <https://builds.apache.org/job/DeltaSpike%20OWB%201.2.0/ws/deltaspike/modules/jsf/impl-ee6/target/deltaspike-jsf-module-impl-ee6-1.6.1-SNAPSHOT-tests.jar>
to org.apache.deltaspike.modules/deltaspike-jsf-module-impl-ee6/1.6.1-SNAPSHOT/deltaspike-jsf-module-impl-ee6-1.6.1-SNAPSHOT-tests.jar
[JENKINS] Archiving <https://builds.apache.org/job/DeltaSpike%20OWB%201.2.0/ws/deltaspike/modules/jsf/impl-ee6/target/deltaspike-jsf-module-impl-ee6-1.6.1-SNAPSHOT-sources.jar>
to org.apache.deltaspike.modules/deltaspike-jsf-module-impl-ee6/1.6.1-SNAPSHOT/deltaspike-jsf-module-impl-ee6-1.6.1-SNAPSHOT-sources.jar
[JENKINS] Archiving <https://builds.apache.org/job/DeltaSpike%20OWB%201.2.0/ws/deltaspike/modules/proxy/pom.xml>
to org.apache.deltaspike.modules/proxy-module-project/1.6.1-SNAPSHOT/proxy-module-project-1.6.1-SNAPSHOT.pom
[JENKINS] Archiving <https://builds.apache.org/job/DeltaSpike%20OWB%201.2.0/ws/deltaspike/modules/proxy/target/proxy-module-project-1.6.1-SNAPSHOT-tests.jar>
to org.apache.deltaspike.modules/proxy-module-project/1.6.1-SNAPSHOT/proxy-module-project-1.6.1-SNAPSHOT-tests.jar
[JENKINS] Archiving <https://builds.apache.org/job/DeltaSpike%20OWB%201.2.0/ws/deltaspike/modules/partial-bean/api/pom.xml>
to org.apache.deltaspike.modules/deltaspike-partial-bean-module-api/1.6.1-SNAPSHOT/deltaspike-partial-bean-module-api-1.6.1-SNAPSHOT.pom
[JENKINS] Archiving <https://builds.apache.org/job/DeltaSpike%20OWB%201.2.0/ws/deltaspike/modules/partial-bean/api/target/deltaspike-partial-bean-module-api-1.6.1-SNAPSHOT.jar>
to org.apache.deltaspike.modules/deltaspike-partial-bean-module-api/1.6.1-SNAPSHOT/deltaspike-partial-bean-module-api-1.6.1-SNAPSHOT.jar
[JENKINS] Archiving <https://builds.apache.org/job/DeltaSpike%20OWB%201.2.0/ws/deltaspike/modules/partial-bean/api/target/deltaspike-partial-bean-module-api-1.6.1-SNAPSHOT-tests.jar>
to org.apache.deltaspike.modules/deltaspike-partial-bean-module-api/1.6.1-SNAPSHOT/deltaspike-partial-bean-module-api-1.6.1-SNAPSHOT-tests.jar
[JENKINS] Archiving <https://builds.apache.org/job/DeltaSpike%20OWB%201.2.0/ws/deltaspike/modules/partial-bean/api/target/deltaspike-partial-bean-module-api-1.6.1-SNAPSHOT-sources.jar>
to org.apache.deltaspike.modules/deltaspike-partial-bean-module-api/1.6.1-SNAPSHOT/deltaspike-partial-bean-module-api-1.6.1-SNAPSHOT-sources.jar
[JENKINS] Archiving <https://builds.apache.org/job/DeltaSpike%20OWB%201.2.0/ws/deltaspike/modules/scheduler/impl/pom.xml>
to org.apache.deltaspike.modules/deltaspike-scheduler-module-impl/1.6.1-SNAPSHOT/deltaspike-scheduler-module-impl-1.6.1-SNAPSHOT.pom
[JENKINS] Archiving <https://builds.apache.org/job/DeltaSpike%20OWB%201.2.0/ws/deltaspike/parent/pom.xml>
to org.apache.deltaspike/parent/1.6.1-SNAPSHOT/parent-1.6.1-SNAPSHOT.pom
[JENKINS] Archiving <https://builds.apache.org/job/DeltaSpike%20OWB%201.2.0/ws/deltaspike/core/pom.xml>
to org.apache.deltaspike.core/core-project/1.6.1-SNAPSHOT/core-project-1.6.1-SNAPSHOT.pom
[JENKINS] Archiving <https://builds.apache.org/job/DeltaSpike%20OWB%201.2.0/ws/deltaspike/core/target/core-project-1.6.1-SNAPSHOT-tests.jar>
to org.apache.deltaspike.core/core-project/1.6.1-SNAPSHOT/core-project-1.6.1-SNAPSHOT-tests.jar
[JENKINS] Archiving <https://builds.apache.org/job/DeltaSpike%20OWB%201.2.0/ws/deltaspike/modules/bean-validation/api/pom.xml>
to org.apache.deltaspike.modules/deltaspike-bean-validation-module-api/1.6.1-SNAPSHOT/deltaspike-bean-validation-module-api-1.6.1-SNAPSHOT.pom
[JENKINS] Archiving <https://builds.apache.org/job/DeltaSpike%20OWB%201.2.0/ws/deltaspike/modules/bean-validation/api/target/deltaspike-bean-validation-module-api-1.6.1-SNAPSHOT.jar>
to org.apache.deltaspike.modules/deltaspike-bean-validation-module-api/1.6.1-SNAPSHOT/deltaspike-bean-validation-module-api-1.6.1-SNAPSHOT.jar
[JENKINS] Archiving <https://builds.apache.org/job/DeltaSpike%20OWB%201.2.0/ws/deltaspike/modules/bean-validation/api/target/deltaspike-bean-validation-module-api-1.6.1-SNAPSHOT-tests.jar>
to org.apache.deltaspike.modules/deltaspike-bean-validation-module-api/1.6.1-SNAPSHOT/deltaspike-bean-validation-module-api-1.6.1-SNAPSHOT-tests.jar
[JENKINS] Archiving <https://builds.apache.org/job/DeltaSpike%20OWB%201.2.0/ws/deltaspike/modules/bean-validation/api/target/deltaspike-bean-validation-module-api-1.6.1-SNAPSHOT-sources.jar>
to org.apache.deltaspike.modules/deltaspike-bean-validation-module-api/1.6.1-SNAPSHOT/deltaspike-bean-validation-module-api-1.6.1-SNAPSHOT-sources.jar
[JENKINS] Archiving <https://builds.apache.org/job/DeltaSpike%20OWB%201.2.0/ws/deltaspike/core/api/pom.xml>
to org.apache.deltaspike.core/deltaspike-core-api/1.6.1-SNAPSHOT/deltaspike-core-api-1.6.1-SNAPSHOT.pom
[JENKINS] Archiving <https://builds.apache.org/job/DeltaSpike%20OWB%201.2.0/ws/deltaspike/core/api/target/deltaspike-core-api-1.6.1-SNAPSHOT.jar>
to org.apache.deltaspike.core/deltaspike-core-api/1.6.1-SNAPSHOT/deltaspike-core-api-1.6.1-SNAPSHOT.jar
[JENKINS] Archiving <https://builds.apache.org/job/DeltaSpike%20OWB%201.2.0/ws/deltaspike/core/api/target/deltaspike-core-api-1.6.1-SNAPSHOT-tests.jar>
to org.apache.deltaspike.core/deltaspike-core-api/1.6.1-SNAPSHOT/deltaspike-core-api-1.6.1-SNAPSHOT-tests.jar
[JENKINS] Archiving <https://builds.apache.org/job/DeltaSpike%20OWB%201.2.0/ws/deltaspike/core/api/target/deltaspike-core-api-1.6.1-SNAPSHOT-sources.jar>
to org.apache.deltaspike.core/deltaspike-core-api/1.6.1-SNAPSHOT/deltaspike-core-api-1.6.1-SNAPSHOT-sources.jar
[JENKINS] Archiving <https://builds.apache.org/job/DeltaSpike%20OWB%201.2.0/ws/deltaspike/modules/security/impl/pom.xml>
to org.apache.deltaspike.modules/deltaspike-security-module-impl/1.6.1-SNAPSHOT/deltaspike-security-module-impl-1.6.1-SNAPSHOT.pom
[JENKINS] Archiving <https://builds.apache.org/job/DeltaSpike%20OWB%201.2.0/ws/deltaspike/modules/security/impl/target/deltaspike-security-module-impl-1.6.1-SNAPSHOT.jar>
to org.apache.deltaspike.modules/deltaspike-security-module-impl/1.6.1-SNAPSHOT/deltaspike-security-module-impl-1.6.1-SNAPSHOT.jar
[JENKINS] Archiving <https://builds.apache.org/job/DeltaSpike%20OWB%201.2.0/ws/deltaspike/modules/security/impl/target/deltaspike-security-module-impl-1.6.1-SNAPSHOT-tests.jar>
to org.apache.deltaspike.modules/deltaspike-security-module-impl/1.6.1-SNAPSHOT/deltaspike-security-module-impl-1.6.1-SNAPSHOT-tests.jar
[JENKINS] Archiving <https://builds.apache.org/job/DeltaSpike%20OWB%201.2.0/ws/deltaspike/modules/security/impl/target/deltaspike-security-module-impl-1.6.1-SNAPSHOT-sources.jar>
to org.apache.deltaspike.modules/deltaspike-security-module-impl/1.6.1-SNAPSHOT/deltaspike-security-module-impl-1.6.1-SNAPSHOT-sources.jar
[JENKINS] Archiving <https://builds.apache.org/job/DeltaSpike%20OWB%201.2.0/ws/deltaspike/modules/scheduler/pom.xml>
to org.apache.deltaspike.modules/scheduler-module-project/1.6.1-SNAPSHOT/scheduler-module-project-1.6.1-SNAPSHOT.pom
[JENKINS] Archiving <https://builds.apache.org/job/DeltaSpike%20OWB%201.2.0/ws/deltaspike/modules/proxy/impl-asm5/pom.xml>
to org.apache.deltaspike.modules/deltaspike-proxy-module-impl-asm5/1.6.1-SNAPSHOT/deltaspike-proxy-module-impl-asm5-1.6.1-SNAPSHOT.pom
[JENKINS] Archiving <https://builds.apache.org/job/DeltaSpike%20OWB%201.2.0/ws/deltaspike/modules/proxy/impl-asm5/target/deltaspike-proxy-module-impl-asm5-1.6.1-SNAPSHOT.jar>
to org.apache.deltaspike.modules/deltaspike-proxy-module-impl-asm5/1.6.1-SNAPSHOT/deltaspike-proxy-module-impl-asm5-1.6.1-SNAPSHOT.jar
[JENKINS] Archiving <https://builds.apache.org/job/DeltaSpike%20OWB%201.2.0/ws/deltaspike/modules/proxy/impl-asm5/target/deltaspike-proxy-module-impl-asm5-1.6.1-SNAPSHOT-tests.jar>
to org.apache.deltaspike.modules/deltaspike-proxy-module-impl-asm5/1.6.1-SNAPSHOT/deltaspike-proxy-module-impl-asm5-1.6.1-SNAPSHOT-tests.jar
[JENKINS] Archiving <https://builds.apache.org/job/DeltaSpike%20OWB%201.2.0/ws/deltaspike/modules/proxy/impl-asm5/target/deltaspike-proxy-module-impl-asm5-1.6.1-SNAPSHOT-sources.jar>
to org.apache.deltaspike.modules/deltaspike-proxy-module-impl-asm5/1.6.1-SNAPSHOT/deltaspike-proxy-module-impl-asm5-1.6.1-SNAPSHOT-sources.jar
[JENKINS] Archiving <https://builds.apache.org/job/DeltaSpike%20OWB%201.2.0/ws/deltaspike/examples/jsf-playground/pom.xml>
to org.apache.deltaspike.examples/deltaspike-jsf-playground/1.6.1-SNAPSHOT/deltaspike-jsf-playground-1.6.1-SNAPSHOT.pom
[JENKINS] Archiving <https://builds.apache.org/job/DeltaSpike%20OWB%201.2.0/ws/deltaspike/modules/servlet/impl/pom.xml>
to org.apache.deltaspike.modules/deltaspike-servlet-module-impl/1.6.1-SNAPSHOT/deltaspike-servlet-module-impl-1.6.1-SNAPSHOT.pom
[JENKINS] Archiving <https://builds.apache.org/job/DeltaSpike%20OWB%201.2.0/ws/deltaspike/modules/servlet/impl/target/deltaspike-servlet-module-impl-1.6.1-SNAPSHOT.jar>
to org.apache.deltaspike.modules/deltaspike-servlet-module-impl/1.6.1-SNAPSHOT/deltaspike-servlet-module-impl-1.6.1-SNAPSHOT.jar
[JENKINS] Archiving <https://builds.apache.org/job/DeltaSpike%20OWB%201.2.0/ws/deltaspike/modules/servlet/impl/target/deltaspike-servlet-module-impl-1.6.1-SNAPSHOT-tests.jar>
to org.apache.deltaspike.modules/deltaspike-servlet-module-impl/1.6.1-SNAPSHOT/deltaspike-servlet-module-impl-1.6.1-SNAPSHOT-tests.jar
[JENKINS] Archiving <https://builds.apache.org/job/DeltaSpike%20OWB%201.2.0/ws/deltaspike/modules/servlet/impl/target/deltaspike-servlet-module-impl-1.6.1-SNAPSHOT-sources.jar>
to org.apache.deltaspike.modules/deltaspike-servlet-module-impl/1.6.1-SNAPSHOT/deltaspike-servlet-module-impl-1.6.1-SNAPSHOT-sources.jar
[JENKINS] Archiving <https://builds.apache.org/job/DeltaSpike%20OWB%201.2.0/ws/deltaspike/modules/bean-validation/impl/pom.xml>
to org.apache.deltaspike.modules/deltaspike-bean-validation-module-impl/1.6.1-SNAPSHOT/deltaspike-bean-validation-module-impl-1.6.1-SNAPSHOT.pom
[JENKINS] Archiving <https://builds.apache.org/job/DeltaSpike%20OWB%201.2.0/ws/deltaspike/modules/bean-validation/impl/target/deltaspike-bean-validation-module-impl-1.6.1-SNAPSHOT.jar>
to org.apache.deltaspike.modules/deltaspike-bean-validation-module-impl/1.6.1-SNAPSHOT/deltaspike-bean-validation-module-impl-1.6.1-SNAPSHOT.jar
[JENKINS] Archiving <https://builds.apache.org/job/DeltaSpike%20OWB%201.2.0/ws/deltaspike/modules/bean-validation/impl/target/deltaspike-bean-validation-module-impl-1.6.1-SNAPSHOT-tests.jar>
to org.apache.deltaspike.modules/deltaspike-bean-validation-module-impl/1.6.1-SNAPSHOT/deltaspike-bean-validation-module-impl-1.6.1-SNAPSHOT-tests.jar
[JENKINS] Archiving <https://builds.apache.org/job/DeltaSpike%20OWB%201.2.0/ws/deltaspike/modules/bean-validation/impl/target/deltaspike-bean-validation-module-impl-1.6.1-SNAPSHOT-sources.jar>
to org.apache.deltaspike.modules/deltaspike-bean-validation-module-impl/1.6.1-SNAPSHOT/deltaspike-bean-validation-module-impl-1.6.1-SNAPSHOT-sources.jar
[JENKINS] Archiving <https://builds.apache.org/job/DeltaSpike%20OWB%201.2.0/ws/deltaspike/cdictrl/impl-owb/pom.xml>
to org.apache.deltaspike.cdictrl/deltaspike-cdictrl-owb/1.6.1-SNAPSHOT/deltaspike-cdictrl-owb-1.6.1-SNAPSHOT.pom
[JENKINS] Archiving <https://builds.apache.org/job/DeltaSpike%20OWB%201.2.0/ws/deltaspike/cdictrl/impl-owb/target/deltaspike-cdictrl-owb-1.6.1-SNAPSHOT.jar>
to org.apache.deltaspike.cdictrl/deltaspike-cdictrl-owb/1.6.1-SNAPSHOT/deltaspike-cdictrl-owb-1.6.1-SNAPSHOT.jar
[JENKINS] Archiving <https://builds.apache.org/job/DeltaSpike%20OWB%201.2.0/ws/deltaspike/cdictrl/impl-owb/target/deltaspike-cdictrl-owb-1.6.1-SNAPSHOT-sources.jar>
to org.apache.deltaspike.cdictrl/deltaspike-cdictrl-owb/1.6.1-SNAPSHOT/deltaspike-cdictrl-owb-1.6.1-SNAPSHOT-sources.jar
[JENKINS] Archiving <https://builds.apache.org/job/DeltaSpike%20OWB%201.2.0/ws/deltaspike/modules/jpa/impl/pom.xml>
to org.apache.deltaspike.modules/deltaspike-jpa-module-impl/1.6.1-SNAPSHOT/deltaspike-jpa-module-impl-1.6.1-SNAPSHOT.pom
[JENKINS] Archiving <https://builds.apache.org/job/DeltaSpike%20OWB%201.2.0/ws/deltaspike/modules/jpa/impl/target/deltaspike-jpa-module-impl-1.6.1-SNAPSHOT.jar>
to org.apache.deltaspike.modules/deltaspike-jpa-module-impl/1.6.1-SNAPSHOT/deltaspike-jpa-module-impl-1.6.1-SNAPSHOT.jar
[JENKINS] Archiving <https://builds.apache.org/job/DeltaSpike%20OWB%201.2.0/ws/deltaspike/modules/jpa/impl/target/deltaspike-jpa-module-impl-1.6.1-SNAPSHOT-tests.jar>
to org.apache.deltaspike.modules/deltaspike-jpa-module-impl/1.6.1-SNAPSHOT/deltaspike-jpa-module-impl-1.6.1-SNAPSHOT-tests.jar
[JENKINS] Archiving <https://builds.apache.org/job/DeltaSpike%20OWB%201.2.0/ws/deltaspike/modules/jpa/impl/target/deltaspike-jpa-module-impl-1.6.1-SNAPSHOT-sources.jar>
to org.apache.deltaspike.modules/deltaspike-jpa-module-impl/1.6.1-SNAPSHOT/deltaspike-jpa-module-impl-1.6.1-SNAPSHOT-sources.jar
[JENKINS] Archiving <https://builds.apache.org/job/DeltaSpike%20OWB%201.2.0/ws/deltaspike/modules/data/pom.xml>
to org.apache.deltaspike.modules/data-module-project/1.6.1-SNAPSHOT/data-module-project-1.6.1-SNAPSHOT.pom
[JENKINS] Archiving <https://builds.apache.org/job/DeltaSpike%20OWB%201.2.0/ws/deltaspike/modules/data/target/data-module-project-1.6.1-SNAPSHOT-tests.jar>
to org.apache.deltaspike.modules/data-module-project/1.6.1-SNAPSHOT/data-module-project-1.6.1-SNAPSHOT-tests.jar
[JENKINS] Archiving <https://builds.apache.org/job/DeltaSpike%20OWB%201.2.0/ws/deltaspike/examples/security-requested-page-after-login-picketlink/pom.xml>
to org.apache.deltaspike.examples/deltaspike-security-requested-page-after-login-picketlink/1.6.1-SNAPSHOT/deltaspike-security-requested-page-after-login-picketlink-1.6.1-SNAPSHOT.pom
[JENKINS] Archiving <https://builds.apache.org/job/DeltaSpike%20OWB%201.2.0/ws/deltaspike/pom.xml>
to org.apache.deltaspike/deltaspike-project/1.6.1-SNAPSHOT/deltaspike-project-1.6.1-SNAPSHOT.pom
[JENKINS] Archiving <https://builds.apache.org/job/DeltaSpike%20OWB%201.2.0/ws/deltaspike/modules/security/api/pom.xml>
to org.apache.deltaspike.modules/deltaspike-security-module-api/1.6.1-SNAPSHOT/deltaspike-security-module-api-1.6.1-SNAPSHOT.pom
[JENKINS] Archiving <https://builds.apache.org/job/DeltaSpike%20OWB%201.2.0/ws/deltaspike/modules/security/api/target/deltaspike-security-module-api-1.6.1-SNAPSHOT.jar>
to org.apache.deltaspike.modules/deltaspike-security-module-api/1.6.1-SNAPSHOT/deltaspike-security-module-api-1.6.1-SNAPSHOT.jar
[JENKINS] Archiving <https://builds.apache.org/job/DeltaSpike%20OWB%201.2.0/ws/deltaspike/modules/security/api/target/deltaspike-security-module-api-1.6.1-SNAPSHOT-tests.jar>
to org.apache.deltaspike.modules/deltaspike-security-module-api/1.6.1-SNAPSHOT/deltaspike-security-module-api-1.6.1-SNAPSHOT-tests.jar
[JENKINS] Archiving <https://builds.apache.org/job/DeltaSpike%20OWB%201.2.0/ws/deltaspike/modules/security/api/target/deltaspike-security-module-api-1.6.1-SNAPSHOT-sources.jar>
to org.apache.deltaspike.modules/deltaspike-security-module-api/1.6.1-SNAPSHOT/deltaspike-security-module-api-1.6.1-SNAPSHOT-sources.jar
Sending e-mails to: commits@deltaspike.apache.org
channel stopped

Mime
View raw message