deltaspike-commits mailing list archives

Site index · List index
Message view « Date » · « Thread »
Top « Date » · « Thread »
From Apache Jenkins Server <jenk...@builds.apache.org>
Subject Build failed in Jenkins: DeltaSpike_TomEE_7.0.0-M3 » Apache DeltaSpike Data-Module Impl #122
Date Sat, 26 Mar 2016 02:18:44 GMT
See <https://builds.apache.org/job/DeltaSpike_TomEE_7.0.0-M3/org.apache.deltaspike.modules$deltaspike-data-module-impl/122/changes>

Changes:

[danielsoro] DELTASPIKE-1100 Support remove expressions

------------------------------------------
[...truncated 5088 lines...]
SEVERE: can't delete /x1/jenkins/jenkins-slave/workspace/DeltaSpike_TomEE_7.0.0-M3/deltaspike/modules/data/impl/target/arquillian-test-working-dir/0/test/WEB-INF/classes/org/apache/deltaspike/data/test/domain/dto/SimpleId.class
Mar 26, 2016 2:17:43 AM org.apache.openejb.arquillian.common.Files delete
SEVERE: can't delete /x1/jenkins/jenkins-slave/workspace/DeltaSpike_TomEE_7.0.0-M3/deltaspike/modules/data/impl/target/arquillian-test-working-dir/0/test/WEB-INF/classes/org/apache/deltaspike/data/test/domain/dto/SimpleDto.class
Mar 26, 2016 2:17:43 AM org.apache.openejb.arquillian.common.Files delete
SEVERE: can't delete /x1/jenkins/jenkins-slave/workspace/DeltaSpike_TomEE_7.0.0-M3/deltaspike/modules/data/impl/target/arquillian-test-working-dir/0/test/WEB-INF/classes/org/apache/deltaspike/data/test/domain/dto
Mar 26, 2016 2:17:43 AM org.apache.openejb.arquillian.common.Files delete
SEVERE: can't delete /x1/jenkins/jenkins-slave/workspace/DeltaSpike_TomEE_7.0.0-M3/deltaspike/modules/data/impl/target/arquillian-test-working-dir/0/test/WEB-INF/classes/org/apache/deltaspike/data/test/domain/Principal.class
Mar 26, 2016 2:17:43 AM org.apache.openejb.arquillian.common.Files delete
SEVERE: can't delete /x1/jenkins/jenkins-slave/workspace/DeltaSpike_TomEE_7.0.0-M3/deltaspike/modules/data/impl/target/arquillian-test-working-dir/0/test/WEB-INF/classes/org/apache/deltaspike/data/test/domain/Simple_.class
Mar 26, 2016 2:17:43 AM org.apache.openejb.arquillian.common.Files delete
SEVERE: can't delete /x1/jenkins/jenkins-slave/workspace/DeltaSpike_TomEE_7.0.0-M3/deltaspike/modules/data/impl/target/arquillian-test-working-dir/0/test/WEB-INF/classes/org/apache/deltaspike/data/test/domain/SimpleStringId.class
Mar 26, 2016 2:17:43 AM org.apache.openejb.arquillian.common.Files delete
SEVERE: can't delete /x1/jenkins/jenkins-slave/workspace/DeltaSpike_TomEE_7.0.0-M3/deltaspike/modules/data/impl/target/arquillian-test-working-dir/0/test/WEB-INF/classes/org/apache/deltaspike/data/test/domain/OneToMany_.class
Mar 26, 2016 2:17:43 AM org.apache.openejb.arquillian.common.Files delete
SEVERE: can't delete /x1/jenkins/jenkins-slave/workspace/DeltaSpike_TomEE_7.0.0-M3/deltaspike/modules/data/impl/target/arquillian-test-working-dir/0/test/WEB-INF/classes/org/apache/deltaspike/data/test/domain/NamedEntity.class
Mar 26, 2016 2:17:43 AM org.apache.openejb.arquillian.common.Files delete
SEVERE: can't delete /x1/jenkins/jenkins-slave/workspace/DeltaSpike_TomEE_7.0.0-M3/deltaspike/modules/data/impl/target/arquillian-test-working-dir/0/test/WEB-INF/classes/org/apache/deltaspike/data/test/domain/Simple3_.class
Mar 26, 2016 2:17:43 AM org.apache.openejb.arquillian.common.Files delete
SEVERE: can't delete /x1/jenkins/jenkins-slave/workspace/DeltaSpike_TomEE_7.0.0-M3/deltaspike/modules/data/impl/target/arquillian-test-working-dir/0/test/WEB-INF/classes/org/apache/deltaspike/data/test/domain/TeeId.class
Mar 26, 2016 2:17:43 AM org.apache.openejb.arquillian.common.Files delete
SEVERE: can't delete /x1/jenkins/jenkins-slave/workspace/DeltaSpike_TomEE_7.0.0-M3/deltaspike/modules/data/impl/target/arquillian-test-working-dir/0/test/WEB-INF/classes/org/apache/deltaspike/data/test/domain/AuditedEntity_.class
Mar 26, 2016 2:17:43 AM org.apache.openejb.arquillian.common.Files delete
SEVERE: can't delete /x1/jenkins/jenkins-slave/workspace/DeltaSpike_TomEE_7.0.0-M3/deltaspike/modules/data/impl/target/arquillian-test-working-dir/0/test/WEB-INF/classes/org/apache/deltaspike/data/test/domain/SimpleStringId_.class
Mar 26, 2016 2:17:43 AM org.apache.openejb.arquillian.common.Files delete
SEVERE: can't delete /x1/jenkins/jenkins-slave/workspace/DeltaSpike_TomEE_7.0.0-M3/deltaspike/modules/data/impl/target/arquillian-test-working-dir/0/test/WEB-INF/classes/org/apache/deltaspike/data/test/domain/AuditedEntity.class
Mar 26, 2016 2:17:43 AM org.apache.openejb.arquillian.common.Files delete
SEVERE: can't delete /x1/jenkins/jenkins-slave/workspace/DeltaSpike_TomEE_7.0.0-M3/deltaspike/modules/data/impl/target/arquillian-test-working-dir/0/test/WEB-INF/classes/org/apache/deltaspike/data/test/domain/EmbeddedSimple_.class
Mar 26, 2016 2:17:43 AM org.apache.openejb.arquillian.common.Files delete
SEVERE: can't delete /x1/jenkins/jenkins-slave/workspace/DeltaSpike_TomEE_7.0.0-M3/deltaspike/modules/data/impl/target/arquillian-test-working-dir/0/test/WEB-INF/classes/org/apache/deltaspike/data/test/domain/TeeId_.class
Mar 26, 2016 2:17:43 AM org.apache.openejb.arquillian.common.Files delete
SEVERE: can't delete /x1/jenkins/jenkins-slave/workspace/DeltaSpike_TomEE_7.0.0-M3/deltaspike/modules/data/impl/target/arquillian-test-working-dir/0/test/WEB-INF/classes/org/apache/deltaspike/data/test/domain/Simple3.class
Mar 26, 2016 2:17:43 AM org.apache.openejb.arquillian.common.Files delete
SEVERE: can't delete /x1/jenkins/jenkins-slave/workspace/DeltaSpike_TomEE_7.0.0-M3/deltaspike/modules/data/impl/target/arquillian-test-working-dir/0/test/WEB-INF/classes/org/apache/deltaspike/data/test/domain/SimpleStringIdBuilder.class
Mar 26, 2016 2:17:43 AM org.apache.openejb.arquillian.common.Files delete
SEVERE: can't delete /x1/jenkins/jenkins-slave/workspace/DeltaSpike_TomEE_7.0.0-M3/deltaspike/modules/data/impl/target/arquillian-test-working-dir/0/test/WEB-INF/classes/org/apache/deltaspike/data/test/domain/Tee2.class
Mar 26, 2016 2:17:43 AM org.apache.openejb.arquillian.common.Files delete
SEVERE: can't delete /x1/jenkins/jenkins-slave/workspace/DeltaSpike_TomEE_7.0.0-M3/deltaspike/modules/data/impl/target/arquillian-test-working-dir/0/test/WEB-INF/classes/org/apache/deltaspike/data/test/domain/SuperSimple_.class
Mar 26, 2016 2:17:43 AM org.apache.openejb.arquillian.common.Files delete
SEVERE: can't delete /x1/jenkins/jenkins-slave/workspace/DeltaSpike_TomEE_7.0.0-M3/deltaspike/modules/data/impl/target/arquillian-test-working-dir/0/test/WEB-INF/classes/org/apache/deltaspike/data/test/domain/Simple2_.class
Mar 26, 2016 2:17:43 AM org.apache.openejb.arquillian.common.Files delete
SEVERE: can't delete /x1/jenkins/jenkins-slave/workspace/DeltaSpike_TomEE_7.0.0-M3/deltaspike/modules/data/impl/target/arquillian-test-working-dir/0/test/WEB-INF/classes/org/apache/deltaspike/data/test/domain/OneToOne.class
Mar 26, 2016 2:17:43 AM org.apache.openejb.arquillian.common.Files delete
SEVERE: can't delete /x1/jenkins/jenkins-slave/workspace/DeltaSpike_TomEE_7.0.0-M3/deltaspike/modules/data/impl/target/arquillian-test-working-dir/0/test/WEB-INF/classes/org/apache/deltaspike/data/test/domain/Simple.class
Mar 26, 2016 2:17:43 AM org.apache.openejb.arquillian.common.Files delete
SEVERE: can't delete /x1/jenkins/jenkins-slave/workspace/DeltaSpike_TomEE_7.0.0-M3/deltaspike/modules/data/impl/target/arquillian-test-working-dir/0/test/WEB-INF/classes/org/apache/deltaspike/data/test/domain/Simple2.class
Mar 26, 2016 2:17:43 AM org.apache.openejb.arquillian.common.Files delete
SEVERE: can't delete /x1/jenkins/jenkins-slave/workspace/DeltaSpike_TomEE_7.0.0-M3/deltaspike/modules/data/impl/target/arquillian-test-working-dir/0/test/WEB-INF/classes/org/apache/deltaspike/data/test/domain/SimpleBuilder.class
Mar 26, 2016 2:17:43 AM org.apache.openejb.arquillian.common.Files delete
SEVERE: can't delete /x1/jenkins/jenkins-slave/workspace/DeltaSpike_TomEE_7.0.0-M3/deltaspike/modules/data/impl/target/arquillian-test-working-dir/0/test/WEB-INF/classes/org/apache/deltaspike/data/test/domain/Tee2_.class
Mar 26, 2016 2:17:43 AM org.apache.openejb.arquillian.common.Files delete
SEVERE: can't delete /x1/jenkins/jenkins-slave/workspace/DeltaSpike_TomEE_7.0.0-M3/deltaspike/modules/data/impl/target/arquillian-test-working-dir/0/test/WEB-INF/classes/org/apache/deltaspike/data/test/domain/EmbeddedSimple.class
Mar 26, 2016 2:17:43 AM org.apache.openejb.arquillian.common.Files delete
SEVERE: can't delete /x1/jenkins/jenkins-slave/workspace/DeltaSpike_TomEE_7.0.0-M3/deltaspike/modules/data/impl/target/arquillian-test-working-dir/0/test/WEB-INF/classes/org/apache/deltaspike/data/test/domain/SuperSimple.class
Mar 26, 2016 2:17:43 AM org.apache.openejb.arquillian.common.Files delete
SEVERE: can't delete /x1/jenkins/jenkins-slave/workspace/DeltaSpike_TomEE_7.0.0-M3/deltaspike/modules/data/impl/target/arquillian-test-working-dir/0/test/WEB-INF/classes/org/apache/deltaspike/data/test/domain/Parent.class
Mar 26, 2016 2:17:43 AM org.apache.openejb.arquillian.common.Files delete
SEVERE: can't delete /x1/jenkins/jenkins-slave/workspace/DeltaSpike_TomEE_7.0.0-M3/deltaspike/modules/data/impl/target/arquillian-test-working-dir/0/test/WEB-INF/classes/org/apache/deltaspike/data/test/domain/Principal_.class
Mar 26, 2016 2:17:43 AM org.apache.openejb.arquillian.common.Files delete
SEVERE: can't delete /x1/jenkins/jenkins-slave/workspace/DeltaSpike_TomEE_7.0.0-M3/deltaspike/modules/data/impl/target/arquillian-test-working-dir/0/test/WEB-INF/classes/org/apache/deltaspike/data/test/domain/Tee.class
Mar 26, 2016 2:17:43 AM org.apache.openejb.arquillian.common.Files delete
SEVERE: can't delete /x1/jenkins/jenkins-slave/workspace/DeltaSpike_TomEE_7.0.0-M3/deltaspike/modules/data/impl/target/arquillian-test-working-dir/0/test/WEB-INF/classes/org/apache/deltaspike/data/test/domain/Parent_.class
Mar 26, 2016 2:17:43 AM org.apache.openejb.arquillian.common.Files delete
SEVERE: can't delete /x1/jenkins/jenkins-slave/workspace/DeltaSpike_TomEE_7.0.0-M3/deltaspike/modules/data/impl/target/arquillian-test-working-dir/0/test/WEB-INF/classes/org/apache/deltaspike/data/test/domain/Simple4_.class
Mar 26, 2016 2:17:43 AM org.apache.openejb.arquillian.common.Files delete
SEVERE: can't delete /x1/jenkins/jenkins-slave/workspace/DeltaSpike_TomEE_7.0.0-M3/deltaspike/modules/data/impl/target/arquillian-test-working-dir/0/test/WEB-INF/classes/org/apache/deltaspike/data/test/domain/OneToMany.class
Mar 26, 2016 2:17:43 AM org.apache.openejb.arquillian.common.Files delete
SEVERE: can't delete /x1/jenkins/jenkins-slave/workspace/DeltaSpike_TomEE_7.0.0-M3/deltaspike/modules/data/impl/target/arquillian-test-working-dir/0/test/WEB-INF/classes/org/apache/deltaspike/data/test/domain/Home_.class
Mar 26, 2016 2:17:43 AM org.apache.openejb.arquillian.common.Files delete
SEVERE: can't delete /x1/jenkins/jenkins-slave/workspace/DeltaSpike_TomEE_7.0.0-M3/deltaspike/modules/data/impl/target/arquillian-test-working-dir/0/test/WEB-INF/classes/org/apache/deltaspike/data/test/domain/NamedEntity_.class
Mar 26, 2016 2:17:43 AM org.apache.openejb.arquillian.common.Files delete
SEVERE: can't delete /x1/jenkins/jenkins-slave/workspace/DeltaSpike_TomEE_7.0.0-M3/deltaspike/modules/data/impl/target/arquillian-test-working-dir/0/test/WEB-INF/classes/org/apache/deltaspike/data/test/domain/mapped/MappedTwo.class
Mar 26, 2016 2:17:43 AM org.apache.openejb.arquillian.common.Files delete
SEVERE: can't delete /x1/jenkins/jenkins-slave/workspace/DeltaSpike_TomEE_7.0.0-M3/deltaspike/modules/data/impl/target/arquillian-test-working-dir/0/test/WEB-INF/classes/org/apache/deltaspike/data/test/domain/mapped/MappedId.class
Mar 26, 2016 2:17:43 AM org.apache.openejb.arquillian.common.Files delete
SEVERE: can't delete /x1/jenkins/jenkins-slave/workspace/DeltaSpike_TomEE_7.0.0-M3/deltaspike/modules/data/impl/target/arquillian-test-working-dir/0/test/WEB-INF/classes/org/apache/deltaspike/data/test/domain/mapped/MappedSuperclass.class
Mar 26, 2016 2:17:43 AM org.apache.openejb.arquillian.common.Files delete
SEVERE: can't delete /x1/jenkins/jenkins-slave/workspace/DeltaSpike_TomEE_7.0.0-M3/deltaspike/modules/data/impl/target/arquillian-test-working-dir/0/test/WEB-INF/classes/org/apache/deltaspike/data/test/domain/mapped/MappedOne.class
Mar 26, 2016 2:17:43 AM org.apache.openejb.arquillian.common.Files delete
SEVERE: can't delete /x1/jenkins/jenkins-slave/workspace/DeltaSpike_TomEE_7.0.0-M3/deltaspike/modules/data/impl/target/arquillian-test-working-dir/0/test/WEB-INF/classes/org/apache/deltaspike/data/test/domain/mapped/MappedThree.class
Mar 26, 2016 2:17:43 AM org.apache.openejb.arquillian.common.Files delete
SEVERE: can't delete /x1/jenkins/jenkins-slave/workspace/DeltaSpike_TomEE_7.0.0-M3/deltaspike/modules/data/impl/target/arquillian-test-working-dir/0/test/WEB-INF/classes/org/apache/deltaspike/data/test/domain/mapped
Mar 26, 2016 2:17:43 AM org.apache.openejb.arquillian.common.Files delete
SEVERE: can't delete /x1/jenkins/jenkins-slave/workspace/DeltaSpike_TomEE_7.0.0-M3/deltaspike/modules/data/impl/target/arquillian-test-working-dir/0/test/WEB-INF/classes/org/apache/deltaspike/data/test/domain/Simple4.class
Mar 26, 2016 2:17:43 AM org.apache.openejb.arquillian.common.Files delete
SEVERE: can't delete /x1/jenkins/jenkins-slave/workspace/DeltaSpike_TomEE_7.0.0-M3/deltaspike/modules/data/impl/target/arquillian-test-working-dir/0/test/WEB-INF/classes/org/apache/deltaspike/data/test/domain/OneToOne_.class
Mar 26, 2016 2:17:43 AM org.apache.openejb.arquillian.common.Files delete
SEVERE: can't delete /x1/jenkins/jenkins-slave/workspace/DeltaSpike_TomEE_7.0.0-M3/deltaspike/modules/data/impl/target/arquillian-test-working-dir/0/test/WEB-INF/classes/org/apache/deltaspike/data/test/domain
Mar 26, 2016 2:17:43 AM org.apache.openejb.arquillian.common.Files delete
SEVERE: can't delete /x1/jenkins/jenkins-slave/workspace/DeltaSpike_TomEE_7.0.0-M3/deltaspike/modules/data/impl/target/arquillian-test-working-dir/0/test/WEB-INF/classes/org/apache/deltaspike/data/test/TransactionalTestCase.class
Mar 26, 2016 2:17:43 AM org.apache.openejb.arquillian.common.Files delete
SEVERE: can't delete /x1/jenkins/jenkins-slave/workspace/DeltaSpike_TomEE_7.0.0-M3/deltaspike/modules/data/impl/target/arquillian-test-working-dir/0/test/WEB-INF/classes/org/apache/deltaspike/data/test/util/TestData.class
Mar 26, 2016 2:17:43 AM org.apache.openejb.arquillian.common.Files delete
SEVERE: can't delete /x1/jenkins/jenkins-slave/workspace/DeltaSpike_TomEE_7.0.0-M3/deltaspike/modules/data/impl/target/arquillian-test-working-dir/0/test/WEB-INF/classes/org/apache/deltaspike/data/test/util/EntityManagerProducer.class
Mar 26, 2016 2:17:43 AM org.apache.openejb.arquillian.common.Files delete
SEVERE: can't delete /x1/jenkins/jenkins-slave/workspace/DeltaSpike_TomEE_7.0.0-M3/deltaspike/modules/data/impl/target/arquillian-test-working-dir/0/test/WEB-INF/classes/org/apache/deltaspike/data/test/util
Mar 26, 2016 2:17:43 AM org.apache.openejb.arquillian.common.Files delete
SEVERE: can't delete /x1/jenkins/jenkins-slave/workspace/DeltaSpike_TomEE_7.0.0-M3/deltaspike/modules/data/impl/target/arquillian-test-working-dir/0/test/WEB-INF/classes/org/apache/deltaspike/data/test
Mar 26, 2016 2:17:43 AM org.apache.openejb.arquillian.common.Files delete
SEVERE: can't delete /x1/jenkins/jenkins-slave/workspace/DeltaSpike_TomEE_7.0.0-M3/deltaspike/modules/data/impl/target/arquillian-test-working-dir/0/test/WEB-INF/classes/org/apache/deltaspike/data/impl/mapping/MappedRepositoryTest.class
Mar 26, 2016 2:17:43 AM org.apache.openejb.arquillian.common.Files delete
SEVERE: can't delete /x1/jenkins/jenkins-slave/workspace/DeltaSpike_TomEE_7.0.0-M3/deltaspike/modules/data/impl/target/arquillian-test-working-dir/0/test/WEB-INF/classes/org/apache/deltaspike/data/impl/mapping
Mar 26, 2016 2:17:43 AM org.apache.openejb.arquillian.common.Files delete
SEVERE: can't delete /x1/jenkins/jenkins-slave/workspace/DeltaSpike_TomEE_7.0.0-M3/deltaspike/modules/data/impl/target/arquillian-test-working-dir/0/test/WEB-INF/classes/org/apache/deltaspike/data/impl
Mar 26, 2016 2:17:43 AM org.apache.openejb.arquillian.common.Files delete
SEVERE: can't delete /x1/jenkins/jenkins-slave/workspace/DeltaSpike_TomEE_7.0.0-M3/deltaspike/modules/data/impl/target/arquillian-test-working-dir/0/test/WEB-INF/classes/org/apache/deltaspike/data
Mar 26, 2016 2:17:43 AM org.apache.openejb.arquillian.common.Files delete
SEVERE: can't delete /x1/jenkins/jenkins-slave/workspace/DeltaSpike_TomEE_7.0.0-M3/deltaspike/modules/data/impl/target/arquillian-test-working-dir/0/test/WEB-INF/classes/org/apache/deltaspike
Mar 26, 2016 2:17:43 AM org.apache.openejb.arquillian.common.Files delete
SEVERE: can't delete /x1/jenkins/jenkins-slave/workspace/DeltaSpike_TomEE_7.0.0-M3/deltaspike/modules/data/impl/target/arquillian-test-working-dir/0/test/WEB-INF/classes/org/apache
Mar 26, 2016 2:17:43 AM org.apache.openejb.arquillian.common.Files delete
SEVERE: can't delete /x1/jenkins/jenkins-slave/workspace/DeltaSpike_TomEE_7.0.0-M3/deltaspike/modules/data/impl/target/arquillian-test-working-dir/0/test/WEB-INF/classes/org/jboss/arquillian/protocol/servlet/runner/ServletCommandService.class
Mar 26, 2016 2:17:43 AM org.apache.openejb.arquillian.common.Files delete
SEVERE: can't delete /x1/jenkins/jenkins-slave/workspace/DeltaSpike_TomEE_7.0.0-M3/deltaspike/modules/data/impl/target/arquillian-test-working-dir/0/test/WEB-INF/classes/org/jboss/arquillian/protocol/servlet/runner/SecurityActions$GetTcclAction.class
Mar 26, 2016 2:17:43 AM org.apache.openejb.arquillian.common.Files delete
SEVERE: can't delete /x1/jenkins/jenkins-slave/workspace/DeltaSpike_TomEE_7.0.0-M3/deltaspike/modules/data/impl/target/arquillian-test-working-dir/0/test/WEB-INF/classes/org/jboss/arquillian/protocol/servlet/runner/SecurityActions$2.class
Mar 26, 2016 2:17:43 AM org.apache.openejb.arquillian.common.Files delete
SEVERE: can't delete /x1/jenkins/jenkins-slave/workspace/DeltaSpike_TomEE_7.0.0-M3/deltaspike/modules/data/impl/target/arquillian-test-working-dir/0/test/WEB-INF/classes/org/jboss/arquillian/protocol/servlet/runner/ServletRemoteExtension.class
Mar 26, 2016 2:17:43 AM org.apache.openejb.arquillian.common.Files delete
SEVERE: can't delete /x1/jenkins/jenkins-slave/workspace/DeltaSpike_TomEE_7.0.0-M3/deltaspike/modules/data/impl/target/arquillian-test-working-dir/0/test/WEB-INF/classes/org/jboss/arquillian/protocol/servlet/runner/SecurityActions$1.class
Mar 26, 2016 2:17:43 AM org.apache.openejb.arquillian.common.Files delete
SEVERE: can't delete /x1/jenkins/jenkins-slave/workspace/DeltaSpike_TomEE_7.0.0-M3/deltaspike/modules/data/impl/target/arquillian-test-working-dir/0/test/WEB-INF/classes/org/jboss/arquillian/protocol/servlet/runner/SecurityActions$3.class
Mar 26, 2016 2:17:43 AM org.apache.openejb.arquillian.common.Files delete
SEVERE: can't delete /x1/jenkins/jenkins-slave/workspace/DeltaSpike_TomEE_7.0.0-M3/deltaspike/modules/data/impl/target/arquillian-test-working-dir/0/test/WEB-INF/classes/org/jboss/arquillian/protocol/servlet/runner/SecurityActions$4.class
Mar 26, 2016 2:17:43 AM org.apache.openejb.arquillian.common.Files delete
SEVERE: can't delete /x1/jenkins/jenkins-slave/workspace/DeltaSpike_TomEE_7.0.0-M3/deltaspike/modules/data/impl/target/arquillian-test-working-dir/0/test/WEB-INF/classes/org/jboss/arquillian/protocol/servlet/runner/ServletTestRunner.class
Mar 26, 2016 2:17:43 AM org.apache.openejb.arquillian.common.Files delete
SEVERE: can't delete /x1/jenkins/jenkins-slave/workspace/DeltaSpike_TomEE_7.0.0-M3/deltaspike/modules/data/impl/target/arquillian-test-working-dir/0/test/WEB-INF/classes/org/jboss/arquillian/protocol/servlet/runner/SecurityActions$5.class
Mar 26, 2016 2:17:43 AM org.apache.openejb.arquillian.common.Files delete
SEVERE: can't delete /x1/jenkins/jenkins-slave/workspace/DeltaSpike_TomEE_7.0.0-M3/deltaspike/modules/data/impl/target/arquillian-test-working-dir/0/test/WEB-INF/classes/org/jboss/arquillian/protocol/servlet/runner/SecurityActions.class
Mar 26, 2016 2:17:43 AM org.apache.openejb.arquillian.common.Files delete
SEVERE: can't delete /x1/jenkins/jenkins-slave/workspace/DeltaSpike_TomEE_7.0.0-M3/deltaspike/modules/data/impl/target/arquillian-test-working-dir/0/test/WEB-INF/classes/org/jboss/arquillian/protocol/servlet/runner
Mar 26, 2016 2:17:43 AM org.apache.openejb.arquillian.common.Files delete
SEVERE: can't delete /x1/jenkins/jenkins-slave/workspace/DeltaSpike_TomEE_7.0.0-M3/deltaspike/modules/data/impl/target/arquillian-test-working-dir/0/test/WEB-INF/classes/org/jboss/arquillian/protocol/servlet
Mar 26, 2016 2:17:43 AM org.apache.openejb.arquillian.common.Files delete
SEVERE: can't delete /x1/jenkins/jenkins-slave/workspace/DeltaSpike_TomEE_7.0.0-M3/deltaspike/modules/data/impl/target/arquillian-test-working-dir/0/test/WEB-INF/classes/org/jboss/arquillian/protocol
Mar 26, 2016 2:17:43 AM org.apache.openejb.arquillian.common.Files delete
SEVERE: can't delete /x1/jenkins/jenkins-slave/workspace/DeltaSpike_TomEE_7.0.0-M3/deltaspike/modules/data/impl/target/arquillian-test-working-dir/0/test/WEB-INF/classes/org/jboss/arquillian
Mar 26, 2016 2:17:43 AM org.apache.openejb.arquillian.common.Files delete
SEVERE: can't delete /x1/jenkins/jenkins-slave/workspace/DeltaSpike_TomEE_7.0.0-M3/deltaspike/modules/data/impl/target/arquillian-test-working-dir/0/test/WEB-INF/classes/org/jboss
Mar 26, 2016 2:17:43 AM org.apache.openejb.arquillian.common.Files delete
SEVERE: can't delete /x1/jenkins/jenkins-slave/workspace/DeltaSpike_TomEE_7.0.0-M3/deltaspike/modules/data/impl/target/arquillian-test-working-dir/0/test/WEB-INF/classes/org
Mar 26, 2016 2:17:43 AM org.apache.openejb.arquillian.common.Files delete
SEVERE: can't delete /x1/jenkins/jenkins-slave/workspace/DeltaSpike_TomEE_7.0.0-M3/deltaspike/modules/data/impl/target/arquillian-test-working-dir/0/test/WEB-INF/classes
Mar 26, 2016 2:17:43 AM org.apache.openejb.arquillian.common.Files delete
SEVERE: can't delete /x1/jenkins/jenkins-slave/workspace/DeltaSpike_TomEE_7.0.0-M3/deltaspike/modules/data/impl/target/arquillian-test-working-dir/0/test/WEB-INF/beans.xml
Mar 26, 2016 2:17:43 AM org.apache.openejb.arquillian.common.Files delete
SEVERE: can't delete /x1/jenkins/jenkins-slave/workspace/DeltaSpike_TomEE_7.0.0-M3/deltaspike/modules/data/impl/target/arquillian-test-working-dir/0/test/WEB-INF/lib/deltaspike-jpa-module-api-1.5.5-SNAPSHOT.jar
Mar 26, 2016 2:17:43 AM org.apache.openejb.arquillian.common.Files delete
SEVERE: can't delete /x1/jenkins/jenkins-slave/workspace/DeltaSpike_TomEE_7.0.0-M3/deltaspike/modules/data/impl/target/arquillian-test-working-dir/0/test/WEB-INF/lib/deltaspike-data-module-impl-1.5.5-SNAPSHOT.jar
Mar 26, 2016 2:17:43 AM org.apache.openejb.arquillian.common.Files delete
SEVERE: can't delete /x1/jenkins/jenkins-slave/workspace/DeltaSpike_TomEE_7.0.0-M3/deltaspike/modules/data/impl/target/arquillian-test-working-dir/0/test/WEB-INF/lib/test-utils.jar
Mar 26, 2016 2:17:43 AM org.apache.openejb.arquillian.common.Files delete
SEVERE: can't delete /x1/jenkins/jenkins-slave/workspace/DeltaSpike_TomEE_7.0.0-M3/deltaspike/modules/data/impl/target/arquillian-test-working-dir/0/test/WEB-INF/lib/deltaspike-jpa-module-impl-1.5.5-SNAPSHOT.jar
Mar 26, 2016 2:17:43 AM org.apache.openejb.arquillian.common.Files delete
SEVERE: can't delete /x1/jenkins/jenkins-slave/workspace/DeltaSpike_TomEE_7.0.0-M3/deltaspike/modules/data/impl/target/arquillian-test-working-dir/0/test/WEB-INF/lib/arquillian-junit.jar
Mar 26, 2016 2:17:43 AM org.apache.openejb.arquillian.common.Files delete
SEVERE: can't delete /x1/jenkins/jenkins-slave/workspace/DeltaSpike_TomEE_7.0.0-M3/deltaspike/modules/data/impl/target/arquillian-test-working-dir/0/test/WEB-INF/lib/deltaspike-core-api-1.5.5-SNAPSHOT.jar
Mar 26, 2016 2:17:43 AM org.apache.openejb.arquillian.common.Files delete
SEVERE: can't delete /x1/jenkins/jenkins-slave/workspace/DeltaSpike_TomEE_7.0.0-M3/deltaspike/modules/data/impl/target/arquillian-test-working-dir/0/test/WEB-INF/lib/arquillian-tomee-archive-appender.jar
Mar 26, 2016 2:17:43 AM org.apache.openejb.arquillian.common.Files delete
SEVERE: can't delete /x1/jenkins/jenkins-slave/workspace/DeltaSpike_TomEE_7.0.0-M3/deltaspike/modules/data/impl/target/arquillian-test-working-dir/0/test/WEB-INF/lib/deltaspike-data-module-api-1.5.5-SNAPSHOT.jar
Mar 26, 2016 2:17:43 AM org.apache.openejb.arquillian.common.Files delete
SEVERE: can't delete /x1/jenkins/jenkins-slave/workspace/DeltaSpike_TomEE_7.0.0-M3/deltaspike/modules/data/impl/target/arquillian-test-working-dir/0/test/WEB-INF/lib/arquillian-transaction.jar
Mar 26, 2016 2:17:43 AM org.apache.openejb.arquillian.common.Files delete
SEVERE: can't delete /x1/jenkins/jenkins-slave/workspace/DeltaSpike_TomEE_7.0.0-M3/deltaspike/modules/data/impl/target/arquillian-test-working-dir/0/test/WEB-INF/lib/deltaspike-proxy-module-api-1.5.5-SNAPSHOT.jar
Mar 26, 2016 2:17:43 AM org.apache.openejb.arquillian.common.Files delete
SEVERE: can't delete /x1/jenkins/jenkins-slave/workspace/DeltaSpike_TomEE_7.0.0-M3/deltaspike/modules/data/impl/target/arquillian-test-working-dir/0/test/WEB-INF/lib/arquillian-testenricher-cdi.jar
Mar 26, 2016 2:17:43 AM org.apache.openejb.arquillian.common.Files delete
SEVERE: can't delete /x1/jenkins/jenkins-slave/workspace/DeltaSpike_TomEE_7.0.0-M3/deltaspike/modules/data/impl/target/arquillian-test-working-dir/0/test/WEB-INF/lib/deltaspike-core-impl-1.5.5-SNAPSHOT.jar
Mar 26, 2016 2:17:43 AM org.apache.openejb.arquillian.common.Files delete
SEVERE: can't delete /x1/jenkins/jenkins-slave/workspace/DeltaSpike_TomEE_7.0.0-M3/deltaspike/modules/data/impl/target/arquillian-test-working-dir/0/test/WEB-INF/lib/deltaspike-proxy-module-impl-asm5-1.5.5-SNAPSHOT.jar
Mar 26, 2016 2:17:43 AM org.apache.openejb.arquillian.common.Files delete
SEVERE: can't delete /x1/jenkins/jenkins-slave/workspace/DeltaSpike_TomEE_7.0.0-M3/deltaspike/modules/data/impl/target/arquillian-test-working-dir/0/test/WEB-INF/lib/deltaspike-partial-bean-module-api-1.5.5-SNAPSHOT.jar
Mar 26, 2016 2:17:43 AM org.apache.openejb.arquillian.common.Files delete
SEVERE: can't delete /x1/jenkins/jenkins-slave/workspace/DeltaSpike_TomEE_7.0.0-M3/deltaspike/modules/data/impl/target/arquillian-test-working-dir/0/test/WEB-INF/lib/deltaspike-partial-bean-module-impl-1.5.5-SNAPSHOT.jar
Mar 26, 2016 2:17:43 AM org.apache.openejb.arquillian.common.Files delete
SEVERE: can't delete /x1/jenkins/jenkins-slave/workspace/DeltaSpike_TomEE_7.0.0-M3/deltaspike/modules/data/impl/target/arquillian-test-working-dir/0/test/WEB-INF/lib/arquillian-core.jar
Mar 26, 2016 2:17:43 AM org.apache.openejb.arquillian.common.Files delete
SEVERE: can't delete /x1/jenkins/jenkins-slave/workspace/DeltaSpike_TomEE_7.0.0-M3/deltaspike/modules/data/impl/target/arquillian-test-working-dir/0/test/WEB-INF/lib/maven-artifact.jar
Mar 26, 2016 2:17:43 AM org.apache.openejb.arquillian.common.Files delete
SEVERE: can't delete /x1/jenkins/jenkins-slave/workspace/DeltaSpike_TomEE_7.0.0-M3/deltaspike/modules/data/impl/target/arquillian-test-working-dir/0/test/WEB-INF/lib
Mar 26, 2016 2:17:43 AM org.apache.openejb.arquillian.common.Files delete
SEVERE: can't delete /x1/jenkins/jenkins-slave/workspace/DeltaSpike_TomEE_7.0.0-M3/deltaspike/modules/data/impl/target/arquillian-test-working-dir/0/test/WEB-INF/web.xml
Mar 26, 2016 2:17:43 AM org.apache.openejb.arquillian.common.Files delete
SEVERE: can't delete /x1/jenkins/jenkins-slave/workspace/DeltaSpike_TomEE_7.0.0-M3/deltaspike/modules/data/impl/target/arquillian-test-working-dir/0/test/WEB-INF
Mar 26, 2016 2:17:43 AM org.apache.openejb.arquillian.common.Files delete
SEVERE: can't delete /x1/jenkins/jenkins-slave/workspace/DeltaSpike_TomEE_7.0.0-M3/deltaspike/modules/data/impl/target/arquillian-test-working-dir/0/test
Running org.apache.deltaspike.data.impl.criteria.CriteriaTest
Tests run: 19, Failures: 0, Errors: 1, Skipped: 0, Time elapsed: 1.173 sec <<< FAILURE!
Running org.apache.deltaspike.data.impl.mapping.MappedRepositoryTest
Tests run: 6, Failures: 0, Errors: 0, Skipped: 0, Time elapsed: 0.366 sec
Running org.apache.deltaspike.data.impl.handler.QueryHandlerTest
Tests run: 24, Failures: 0, Errors: 2, Skipped: 0, Time elapsed: 0.961 sec <<< FAILURE!
INFO - A valid shutdown command was received via the shutdown port. Stopping the Server instance.
INFO - Pausing ProtocolHandler ["http-nio-46662"]
INFO - Pausing ProtocolHandler ["ajp-nio-37087"]
INFO - Stopping service Catalina
INFO - Stopping ProtocolHandler ["http-nio-46662"]
INFO - Stopping ProtocolHandler ["ajp-nio-37087"]
INFO - Stopping server services
INFO - Undeploying app: openejb
SEVERE - Unable to unregister MBean openejb.management:J2EEServer=openejb,J2EEApplication=<empty>,EJBModule=openejb,SingletonSessionBean=openejb/Deployer,name=openejb/Deployer,j2eeType=Invocations
SEVERE - Unable to unregister MBean openejb.management:J2EEServer=openejb,J2EEApplication=<empty>,EJBModule=openejb,SingletonSessionBean=openejb/Deployer,name=openejb/Deployer,j2eeType=Invocations
INFO - Closing DataSource: testDatabase
INFO - Closing DataSource: testDatabaseNonJta
INFO - Destroying ProtocolHandler ["http-nio-46662"]
INFO - Destroying ProtocolHandler ["ajp-nio-37087"]

Results :

Tests in error: 
  should_create_count_criteria(org.apache.deltaspike.data.impl.criteria.CriteriaTest): Failed
to execute query "null". Check the query syntax for correctness. See nested exception for
details.
  should_create_query_remove_by_method_name(org.apache.deltaspike.data.impl.handler.QueryHandlerTest):
Failed calling Repository: [Repository=org.apache.deltaspike.data.test.service.SimpleRepository,entity=org.apache.deltaspike.data.test.domain.Simple,method=removeByName,exception=class
org.apache.deltaspike.data.api.QueryInvocationException,message=Failed calling Repository:
[Repository=org.apache.deltaspike.data.test.service.SimpleRepository,entity=org.apache.deltaspike.data.test.domain.Simple,method=removeByName,
  should_create_query_remove_by_method_name_with_multiply_params(org.apache.deltaspike.data.impl.handler.QueryHandlerTest):
Failed calling Repository: [Repository=org.apache.deltaspike.data.test.service.SimpleRepository,entity=org.apache.deltaspike.data.test.domain.Simple,method=removeByNameAndEnabled,exception=class
org.apache.deltaspike.data.api.QueryInvocationException,message=Failed calling Repository:
[Repository=org.apache.deltaspike.data.test.service.SimpleRepository,entity=org.apache.deltaspike.data.test.domain.Simple,method=removeByNameAndEnabled,

Tests run: 163, Failures: 0, Errors: 3, Skipped: 0

[ERROR] There are test failures.

Please refer to <https://builds.apache.org/job/DeltaSpike_TomEE_7.0.0-M3/org.apache.deltaspike.modules$deltaspike-data-module-impl/ws/target/surefire-reports>
for the individual test results.
[JENKINS] Recording test results
[INFO] 
[INFO] --- maven-bundle-plugin:2.3.7:bundle (default-bundle) @ deltaspike-data-module-impl
---
[WARNING] Bundle org.apache.deltaspike.modules:deltaspike-data-module-impl:bundle:1.5.5-SNAPSHOT
: Did not find matching referal for !org.apache.deltaspike.data.impl.*
[INFO] 
[INFO] --- maven-site-plugin:3.3:attach-descriptor (attach-descriptor) @ deltaspike-data-module-impl
---
[INFO] 
[INFO] --- maven-jar-plugin:2.4:test-jar (default) @ deltaspike-data-module-impl ---
[INFO] Building jar: <https://builds.apache.org/job/DeltaSpike_TomEE_7.0.0-M3/org.apache.deltaspike.modules$deltaspike-data-module-impl/ws/target/deltaspike-data-module-impl-1.5.5-SNAPSHOT-tests.jar>
[INFO] 
[INFO] --- maven-bundle-plugin:2.3.7:cleanVersions (versions) @ deltaspike-data-module-impl
---
[INFO] 
[INFO] --- maven-antrun-plugin:1.7:run (javadoc.resources) @ deltaspike-data-module-impl ---
[WARNING] Parameter tasks is deprecated, use target instead
[INFO] Executing tasks

main:
[INFO] Executed tasks
[WARNING] Failed to getClass for org.apache.maven.plugin.source.SourceJarMojo
[INFO] 
[INFO] --- maven-source-plugin:2.2.1:jar (attach-sources) @ deltaspike-data-module-impl ---
[INFO] Building jar: <https://builds.apache.org/job/DeltaSpike_TomEE_7.0.0-M3/org.apache.deltaspike.modules$deltaspike-data-module-impl/ws/target/deltaspike-data-module-impl-1.5.5-SNAPSHOT-sources.jar>
[INFO] 
[INFO] --- maven-checkstyle-plugin:2.9.1:check (verify-style) @ deltaspike-data-module-impl
---
[INFO] Starting audit...
<https://builds.apache.org/job/DeltaSpike_TomEE_7.0.0-M3/org.apache.deltaspike.modules$deltaspike-data-module-impl/ws/src/main/java/org/apache/deltaspike/data/impl/meta/MethodPrefix.java>:90:
Line is longer than 120 characters.
Audit done.

[INFO] There are 1 checkstyle errors.

Mime
View raw message