deltaspike-commits mailing list archives

Site index · List index
Message view « Date » · « Thread »
Top « Date » · « Thread »
From Apache Jenkins Server <jenk...@builds.apache.org>
Subject Build failed in Jenkins: DeltaSpike_TomEE_7.0.0-M3 #122
Date Sat, 26 Mar 2016 02:18:50 GMT
See <https://builds.apache.org/job/DeltaSpike_TomEE_7.0.0-M3/122/changes>

Changes:

[danielsoro] DELTASPIKE-1100 Support remove expressions

------------------------------------------
[...truncated 21706 lines...]
  should_create_query_remove_by_method_name_with_multiply_params(org.apache.deltaspike.data.impl.handler.QueryHandlerTest):
Failed calling Repository: [Repository=org.apache.deltaspike.data.test.service.SimpleRepository,entity=org.apache.deltaspike.data.test.domain.Simple,method=removeByNameAndEnabled,exception=class
org.apache.deltaspike.data.api.QueryInvocationException,message=Failed calling Repository:
[Repository=org.apache.deltaspike.data.test.service.SimpleRepository,entity=org.apache.deltaspike.data.test.domain.Simple,method=removeByNameAndEnabled,

Tests run: 163, Failures: 0, Errors: 3, Skipped: 0

[ERROR] There are test failures.

Please refer to <https://builds.apache.org/job/DeltaSpike_TomEE_7.0.0-M3/ws/deltaspike/modules/data/impl/target/surefire-reports>
for the individual test results.
[JENKINS] Recording test results
[INFO] 
[INFO] --- maven-bundle-plugin:2.3.7:bundle (default-bundle) @ deltaspike-data-module-impl
---
[WARNING] Bundle org.apache.deltaspike.modules:deltaspike-data-module-impl:bundle:1.5.5-SNAPSHOT
: Did not find matching referal for !org.apache.deltaspike.data.impl.*
[INFO] 
[INFO] --- maven-site-plugin:3.3:attach-descriptor (attach-descriptor) @ deltaspike-data-module-impl
---
[INFO] 
[INFO] --- maven-jar-plugin:2.4:test-jar (default) @ deltaspike-data-module-impl ---
[INFO] Building jar: <https://builds.apache.org/job/DeltaSpike_TomEE_7.0.0-M3/ws/deltaspike/modules/data/impl/target/deltaspike-data-module-impl-1.5.5-SNAPSHOT-tests.jar>
[INFO] 
[INFO] --- maven-bundle-plugin:2.3.7:cleanVersions (versions) @ deltaspike-data-module-impl
---
[INFO] 
[INFO] --- maven-antrun-plugin:1.7:run (javadoc.resources) @ deltaspike-data-module-impl ---
[WARNING] Parameter tasks is deprecated, use target instead
[INFO] Executing tasks

main:
[INFO] Executed tasks
[WARNING] Failed to getClass for org.apache.maven.plugin.source.SourceJarMojo
[INFO] 
[INFO] --- maven-source-plugin:2.2.1:jar (attach-sources) @ deltaspike-data-module-impl ---
[INFO] Building jar: <https://builds.apache.org/job/DeltaSpike_TomEE_7.0.0-M3/ws/deltaspike/modules/data/impl/target/deltaspike-data-module-impl-1.5.5-SNAPSHOT-sources.jar>
[INFO] 
[INFO] --- maven-checkstyle-plugin:2.9.1:check (verify-style) @ deltaspike-data-module-impl
---
[INFO] Starting audit...
<https://builds.apache.org/job/DeltaSpike_TomEE_7.0.0-M3/ws/deltaspike/modules/data/impl/src/main/java/org/apache/deltaspike/data/impl/meta/MethodPrefix.java>:90:
Line is longer than 120 characters.
Audit done.

[INFO] There are 1 checkstyle errors.
[INFO] ------------------------------------------------------------------------
[INFO] Reactor Summary:
[INFO] 
[INFO] Apache DeltaSpike ................................. SUCCESS [4.651s]
[INFO] Apache DeltaSpike Sources ......................... SUCCESS [0.076s]
[INFO] Apache DeltaSpike CheckStyle-rules ................ SUCCESS [2.945s]
[INFO] Apache DeltaSpike Parent .......................... SUCCESS [4.305s]
[INFO] Apache DeltaSpike Test-Utils ...................... SUCCESS [4.537s]
[INFO] Apache DeltaSpike Code Parent ..................... SUCCESS [16.586s]
[INFO] Apache DeltaSpike Core ............................ SUCCESS [1.529s]
[INFO] Apache DeltaSpike Core-API ........................ SUCCESS [19.038s]
[INFO] Apache DeltaSpike Core-Implementation ............. SUCCESS [2:00.879s]
[INFO] Apache DeltaSpike ContainerControl parent ......... SUCCESS [1.007s]
[INFO] Apache DeltaSpike CDI ContainerControl API ........ SUCCESS [1.672s]
[INFO] Apache DeltaSpike CDI ContainerControl TCK ........ SUCCESS [1.808s]
[INFO] Apache DeltaSpike CDI OpenEJB-ContainerControl .... SUCCESS [9.174s]
[INFO] Apache DeltaSpike Modules ......................... SUCCESS [1.395s]
[INFO] Apache DeltaSpike Proxy-Module .................... SUCCESS [4.371s]
[INFO] Apache DeltaSpike Proxy-Module API ................ SUCCESS [8.754s]
[INFO] Apache DeltaSpike Proxy-Module Impl ASM5 .......... SUCCESS [29.911s]
[INFO] Apache DeltaSpike Security-Module ................. SUCCESS [1.679s]
[INFO] Apache DeltaSpike Security-Module API ............. SUCCESS [12.839s]
[INFO] Apache DeltaSpike Security-Module Impl ............ SUCCESS [35.248s]
[INFO] Apache DeltaSpike JPA-Module ...................... SUCCESS [3.355s]
[INFO] Apache DeltaSpike JPA-Module API .................. SUCCESS [7.572s]
[INFO] Apache DeltaSpike JPA-Module Impl ................. SUCCESS [17.969s]
[INFO] Apache DeltaSpike Servlet-Module .................. SUCCESS [1.363s]
[INFO] Apache DeltaSpike Servlet-Module API .............. SUCCESS [3.124s]
[INFO] Apache DeltaSpike Servlet-Module Impl ............. SUCCESS [31.638s]
[INFO] Apache DeltaSpike JSF-Module ...................... SUCCESS [1.537s]
[INFO] Apache DeltaSpike JSF-Module API .................. SUCCESS [7.875s]
[INFO] Apache DeltaSpike JSF-Module Impl ................. SUCCESS [2:00.161s]
[INFO] Apache DeltaSpike JSF-Module Impl (EE6 only) ...... SUCCESS [4.186s]
[INFO] Apache DeltaSpike Partial-Bean-Module ............. SUCCESS [1.709s]
[INFO] Apache DeltaSpike Partial-Bean-Module API ......... SUCCESS [9.560s]
[INFO] Apache DeltaSpike Partial-Bean-Module Impl ........ SUCCESS [54.643s]
[INFO] Apache DeltaSpike BeanValidation-Module ........... SUCCESS [2.649s]
[INFO] Apache DeltaSpike BeanValidation-Module API ....... SUCCESS [2.048s]
[INFO] Apache DeltaSpike BeanValidation-Module Impl ...... SUCCESS [22.202s]
[INFO] Apache DeltaSpike Data-Module ..................... SUCCESS [1.376s]
[INFO] Apache DeltaSpike Data-Module API ................. SUCCESS [9.471s]
[INFO] Apache DeltaSpike Data-Module Impl ................ FAILURE [1:28.143s]
[INFO] Apache DeltaSpike Data-Module Tests on Java EE 7 .. SKIPPED
[INFO] Apache DeltaSpike Scheduler-Module ................ SKIPPED
[INFO] Apache DeltaSpike Scheduler-Module API ............ SKIPPED
[INFO] Apache DeltaSpike Scheduler-Module Impl ........... SKIPPED
[INFO] Apache DeltaSpike Test-Control-Module ............. SKIPPED
[INFO] Apache DeltaSpike Test-Control-Module API ......... SKIPPED
[INFO] Apache DeltaSpike Test-Control-Module Impl ........ SKIPPED
[INFO] Apache DeltaSpike Examples ........................ SKIPPED
[INFO] Apache DeltaSpike Java-SE Examples ................ SKIPPED
[INFO] Apache DeltaSpike JSF Examples .................... SKIPPED
[INFO] Apache DeltaSpike JSF Playground .................. SKIPPED
[INFO] Apache DeltaSpike Security Example CDI ............ SKIPPED
[INFO] Apache DeltaSpike Security Example PicketLink ..... SKIPPED
[INFO] Apache DeltaSpike Java-SE Scheduler Examples ...... SKIPPED
[INFO] Apache DeltaSpike Documentation ................... SKIPPED
[INFO] Apache DeltaSpike Site ............................ SKIPPED
[INFO] ------------------------------------------------------------------------
[INFO] BUILD FAILURE
[INFO] ------------------------------------------------------------------------
[INFO] Total time: 11:26.537s
[INFO] Finished at: Sat Mar 26 02:17:47 UTC 2016
[INFO] Final Memory: 118M/773M
[INFO] ------------------------------------------------------------------------
Waiting for Jenkins to finish collecting data
[ERROR] Failed to execute goal org.apache.maven.plugins:maven-checkstyle-plugin:2.9.1:check
(verify-style) on project deltaspike-data-module-impl: You have 1 Checkstyle violation. ->
[Help 1]
[ERROR] 
[ERROR] To see the full stack trace of the errors, re-run Maven with the -e switch.
[ERROR] Re-run Maven using the -X switch to enable full debug logging.
[ERROR] 
[ERROR] For more information about the errors and possible solutions, please read the following
articles:
[ERROR] [Help 1] http://cwiki.apache.org/confluence/display/MAVEN/MojoFailureException
[ERROR] 
[ERROR] After correcting the problems, you can resume the build with the command
[ERROR]   mvn <goals> -rf :deltaspike-data-module-impl
[JENKINS] Archiving <https://builds.apache.org/job/DeltaSpike_TomEE_7.0.0-M3/ws/deltaspike/examples/jse-examples/pom.xml>
to org.apache.deltaspike.examples/deltaspike-jse-example/1.5.5-SNAPSHOT/deltaspike-jse-example-1.5.5-SNAPSHOT.pom
[JENKINS] Archiving <https://builds.apache.org/job/DeltaSpike_TomEE_7.0.0-M3/ws/deltaspike/examples/security-requested-page-after-login-cdi/pom.xml>
to org.apache.deltaspike.examples/deltaspike-security-requested-page-after-login-cdi/1.5.5-SNAPSHOT/deltaspike-security-requested-page-after-login-cdi-1.5.5-SNAPSHOT.pom
[JENKINS] Archiving <https://builds.apache.org/job/DeltaSpike_TomEE_7.0.0-M3/ws/deltaspike/test-utils/pom.xml>
to org.apache.deltaspike.test/test-utils/1.5.5-SNAPSHOT/test-utils-1.5.5-SNAPSHOT.pom
[JENKINS] Archiving <https://builds.apache.org/job/DeltaSpike_TomEE_7.0.0-M3/ws/deltaspike/test-utils/target/test-utils-1.5.5-SNAPSHOT.jar>
to org.apache.deltaspike.test/test-utils/1.5.5-SNAPSHOT/test-utils-1.5.5-SNAPSHOT.jar
[JENKINS] Archiving <https://builds.apache.org/job/DeltaSpike_TomEE_7.0.0-M3/ws/deltaspike/test-utils/target/test-utils-1.5.5-SNAPSHOT-sources.jar>
to org.apache.deltaspike.test/test-utils/1.5.5-SNAPSHOT/test-utils-1.5.5-SNAPSHOT-sources.jar
[JENKINS] Archiving <https://builds.apache.org/job/DeltaSpike_TomEE_7.0.0-M3/ws/documentation/pom.xml>
to org.apache.deltaspike/deltaspike-documentation/1.5.5-SNAPSHOT/deltaspike-documentation-1.5.5-SNAPSHOT.pom
[JENKINS] Archiving <https://builds.apache.org/job/DeltaSpike_TomEE_7.0.0-M3/ws/deltaspike/modules/data/impl/pom.xml>
to org.apache.deltaspike.modules/deltaspike-data-module-impl/1.5.5-SNAPSHOT/deltaspike-data-module-impl-1.5.5-SNAPSHOT.pom
[JENKINS] Archiving <https://builds.apache.org/job/DeltaSpike_TomEE_7.0.0-M3/ws/deltaspike/modules/data/impl/target/deltaspike-data-module-impl-1.5.5-SNAPSHOT.jar>
to org.apache.deltaspike.modules/deltaspike-data-module-impl/1.5.5-SNAPSHOT/deltaspike-data-module-impl-1.5.5-SNAPSHOT.jar
[JENKINS] Archiving <https://builds.apache.org/job/DeltaSpike_TomEE_7.0.0-M3/ws/deltaspike/modules/data/impl/target/deltaspike-data-module-impl-1.5.5-SNAPSHOT-tests.jar>
to org.apache.deltaspike.modules/deltaspike-data-module-impl/1.5.5-SNAPSHOT/deltaspike-data-module-impl-1.5.5-SNAPSHOT-tests.jar
[JENKINS] Archiving <https://builds.apache.org/job/DeltaSpike_TomEE_7.0.0-M3/ws/deltaspike/modules/data/impl/target/deltaspike-data-module-impl-1.5.5-SNAPSHOT-sources.jar>
to org.apache.deltaspike.modules/deltaspike-data-module-impl/1.5.5-SNAPSHOT/deltaspike-data-module-impl-1.5.5-SNAPSHOT-sources.jar
[JENKINS] Archiving <https://builds.apache.org/job/DeltaSpike_TomEE_7.0.0-M3/ws/deltaspike/modules/data/api/pom.xml>
to org.apache.deltaspike.modules/deltaspike-data-module-api/1.5.5-SNAPSHOT/deltaspike-data-module-api-1.5.5-SNAPSHOT.pom
[JENKINS] Archiving <https://builds.apache.org/job/DeltaSpike_TomEE_7.0.0-M3/ws/deltaspike/modules/data/api/target/deltaspike-data-module-api-1.5.5-SNAPSHOT.jar>
to org.apache.deltaspike.modules/deltaspike-data-module-api/1.5.5-SNAPSHOT/deltaspike-data-module-api-1.5.5-SNAPSHOT.jar
[JENKINS] Archiving <https://builds.apache.org/job/DeltaSpike_TomEE_7.0.0-M3/ws/deltaspike/modules/data/api/target/deltaspike-data-module-api-1.5.5-SNAPSHOT-tests.jar>
to org.apache.deltaspike.modules/deltaspike-data-module-api/1.5.5-SNAPSHOT/deltaspike-data-module-api-1.5.5-SNAPSHOT-tests.jar
[JENKINS] Archiving <https://builds.apache.org/job/DeltaSpike_TomEE_7.0.0-M3/ws/deltaspike/modules/data/api/target/deltaspike-data-module-api-1.5.5-SNAPSHOT-sources.jar>
to org.apache.deltaspike.modules/deltaspike-data-module-api/1.5.5-SNAPSHOT/deltaspike-data-module-api-1.5.5-SNAPSHOT-sources.jar
[JENKINS] Archiving <https://builds.apache.org/job/DeltaSpike_TomEE_7.0.0-M3/ws/deltaspike/core/impl/pom.xml>
to org.apache.deltaspike.core/deltaspike-core-impl/1.5.5-SNAPSHOT/deltaspike-core-impl-1.5.5-SNAPSHOT.pom
[JENKINS] Archiving <https://builds.apache.org/job/DeltaSpike_TomEE_7.0.0-M3/ws/deltaspike/core/impl/target/deltaspike-core-impl-1.5.5-SNAPSHOT.jar>
to org.apache.deltaspike.core/deltaspike-core-impl/1.5.5-SNAPSHOT/deltaspike-core-impl-1.5.5-SNAPSHOT.jar
[JENKINS] Archiving <https://builds.apache.org/job/DeltaSpike_TomEE_7.0.0-M3/ws/deltaspike/core/impl/target/deltaspike-core-impl-1.5.5-SNAPSHOT-tests.jar>
to org.apache.deltaspike.core/deltaspike-core-impl/1.5.5-SNAPSHOT/deltaspike-core-impl-1.5.5-SNAPSHOT-tests.jar
[JENKINS] Archiving <https://builds.apache.org/job/DeltaSpike_TomEE_7.0.0-M3/ws/deltaspike/core/impl/target/deltaspike-core-impl-1.5.5-SNAPSHOT-sources.jar>
to org.apache.deltaspike.core/deltaspike-core-impl/1.5.5-SNAPSHOT/deltaspike-core-impl-1.5.5-SNAPSHOT-sources.jar
[JENKINS] Archiving <https://builds.apache.org/job/DeltaSpike_TomEE_7.0.0-M3/ws/deltaspike/modules/pom.xml>
to org.apache.deltaspike.modules/modules-project/1.5.5-SNAPSHOT/modules-project-1.5.5-SNAPSHOT.pom
[JENKINS] Archiving <https://builds.apache.org/job/DeltaSpike_TomEE_7.0.0-M3/ws/deltaspike/modules/target/modules-project-1.5.5-SNAPSHOT-tests.jar>
to org.apache.deltaspike.modules/modules-project/1.5.5-SNAPSHOT/modules-project-1.5.5-SNAPSHOT-tests.jar
[JENKINS] Archiving <https://builds.apache.org/job/DeltaSpike_TomEE_7.0.0-M3/ws/deltaspike/modules/test-control/pom.xml>
to org.apache.deltaspike.modules/test-control-module-project/1.5.5-SNAPSHOT/test-control-module-project-1.5.5-SNAPSHOT.pom
[JENKINS] Archiving <https://builds.apache.org/job/DeltaSpike_TomEE_7.0.0-M3/ws/deltaspike/examples/jsf-examples/pom.xml>
to org.apache.deltaspike.examples/deltaspike-jsf-example/1.5.5-SNAPSHOT/deltaspike-jsf-example-1.5.5-SNAPSHOT.pom
[JENKINS] Archiving <https://builds.apache.org/job/DeltaSpike_TomEE_7.0.0-M3/ws/deltaspike/cdictrl/api/pom.xml>
to org.apache.deltaspike.cdictrl/deltaspike-cdictrl-api/1.5.5-SNAPSHOT/deltaspike-cdictrl-api-1.5.5-SNAPSHOT.pom
[JENKINS] Archiving <https://builds.apache.org/job/DeltaSpike_TomEE_7.0.0-M3/ws/deltaspike/cdictrl/api/target/deltaspike-cdictrl-api-1.5.5-SNAPSHOT.jar>
to org.apache.deltaspike.cdictrl/deltaspike-cdictrl-api/1.5.5-SNAPSHOT/deltaspike-cdictrl-api-1.5.5-SNAPSHOT.jar
[JENKINS] Archiving <https://builds.apache.org/job/DeltaSpike_TomEE_7.0.0-M3/ws/deltaspike/cdictrl/api/target/deltaspike-cdictrl-api-1.5.5-SNAPSHOT-sources.jar>
to org.apache.deltaspike.cdictrl/deltaspike-cdictrl-api/1.5.5-SNAPSHOT/deltaspike-cdictrl-api-1.5.5-SNAPSHOT-sources.jar
[JENKINS] Archiving <https://builds.apache.org/job/DeltaSpike_TomEE_7.0.0-M3/ws/deltaspike/examples/scheduler-playground/pom.xml>
to org.apache.deltaspike.examples/deltaspike-scheduler-example/1.5.5-SNAPSHOT/deltaspike-scheduler-example-1.5.5-SNAPSHOT.pom
[JENKINS] Archiving <https://builds.apache.org/job/DeltaSpike_TomEE_7.0.0-M3/ws/deltaspike/checkstyle-rules/pom.xml>
to org.apache.deltaspike/checkstyle-rules/1.5.5-SNAPSHOT/checkstyle-rules-1.5.5-SNAPSHOT.pom
[JENKINS] Archiving <https://builds.apache.org/job/DeltaSpike_TomEE_7.0.0-M3/ws/deltaspike/checkstyle-rules/target/checkstyle-rules-1.5.5-SNAPSHOT.jar>
to org.apache.deltaspike/checkstyle-rules/1.5.5-SNAPSHOT/checkstyle-rules-1.5.5-SNAPSHOT.jar
[JENKINS] Archiving <https://builds.apache.org/job/DeltaSpike_TomEE_7.0.0-M3/ws/deltaspike/parent/code/pom.xml>
to org.apache.deltaspike/parent-code/1.5.5-SNAPSHOT/parent-code-1.5.5-SNAPSHOT.pom
[JENKINS] Archiving <https://builds.apache.org/job/DeltaSpike_TomEE_7.0.0-M3/ws/deltaspike/parent/code/target/parent-code-1.5.5-SNAPSHOT-tests.jar>
to org.apache.deltaspike/parent-code/1.5.5-SNAPSHOT/parent-code-1.5.5-SNAPSHOT-tests.jar
Compressed 79.65 KB of artifacts by 40.2% relative to #121
[JENKINS] Archiving <https://builds.apache.org/job/DeltaSpike_TomEE_7.0.0-M3/ws/deltaspike/modules/jsf/impl/pom.xml>
to org.apache.deltaspike.modules/deltaspike-jsf-module-impl/1.5.5-SNAPSHOT/deltaspike-jsf-module-impl-1.5.5-SNAPSHOT.pom
[JENKINS] Archiving <https://builds.apache.org/job/DeltaSpike_TomEE_7.0.0-M3/ws/deltaspike/modules/jsf/impl/target/deltaspike-jsf-module-impl-1.5.5-SNAPSHOT.jar>
to org.apache.deltaspike.modules/deltaspike-jsf-module-impl/1.5.5-SNAPSHOT/deltaspike-jsf-module-impl-1.5.5-SNAPSHOT.jar
[JENKINS] Archiving <https://builds.apache.org/job/DeltaSpike_TomEE_7.0.0-M3/ws/deltaspike/modules/jsf/impl/target/deltaspike-jsf-module-impl-1.5.5-SNAPSHOT-tests.jar>
to org.apache.deltaspike.modules/deltaspike-jsf-module-impl/1.5.5-SNAPSHOT/deltaspike-jsf-module-impl-1.5.5-SNAPSHOT-tests.jar
[JENKINS] Archiving <https://builds.apache.org/job/DeltaSpike_TomEE_7.0.0-M3/ws/deltaspike/modules/jsf/impl/target/deltaspike-jsf-module-impl-1.5.5-SNAPSHOT-sources.jar>
to org.apache.deltaspike.modules/deltaspike-jsf-module-impl/1.5.5-SNAPSHOT/deltaspike-jsf-module-impl-1.5.5-SNAPSHOT-sources.jar
[JENKINS] Archiving <https://builds.apache.org/job/DeltaSpike_TomEE_7.0.0-M3/ws/deltaspike/modules/partial-bean/pom.xml>
to org.apache.deltaspike.modules/partial-bean-module-project/1.5.5-SNAPSHOT/partial-bean-module-project-1.5.5-SNAPSHOT.pom
[JENKINS] Archiving <https://builds.apache.org/job/DeltaSpike_TomEE_7.0.0-M3/ws/deltaspike/modules/partial-bean/target/partial-bean-module-project-1.5.5-SNAPSHOT-tests.jar>
to org.apache.deltaspike.modules/partial-bean-module-project/1.5.5-SNAPSHOT/partial-bean-module-project-1.5.5-SNAPSHOT-tests.jar
[JENKINS] Archiving <https://builds.apache.org/job/DeltaSpike_TomEE_7.0.0-M3/ws/deltaspike/examples/pom.xml>
to org.apache.deltaspike.examples/examples-project/1.5.5-SNAPSHOT/examples-project-1.5.5-SNAPSHOT.pom
[JENKINS] Archiving <https://builds.apache.org/job/DeltaSpike_TomEE_7.0.0-M3/ws/deltaspike/cdictrl/impl-openejb/pom.xml>
to org.apache.deltaspike.cdictrl/deltaspike-cdictrl-openejb/1.5.5-SNAPSHOT/deltaspike-cdictrl-openejb-1.5.5-SNAPSHOT.pom
[JENKINS] Archiving <https://builds.apache.org/job/DeltaSpike_TomEE_7.0.0-M3/ws/deltaspike/cdictrl/impl-openejb/target/deltaspike-cdictrl-openejb-1.5.5-SNAPSHOT.jar>
to org.apache.deltaspike.cdictrl/deltaspike-cdictrl-openejb/1.5.5-SNAPSHOT/deltaspike-cdictrl-openejb-1.5.5-SNAPSHOT.jar
[JENKINS] Archiving <https://builds.apache.org/job/DeltaSpike_TomEE_7.0.0-M3/ws/deltaspike/cdictrl/impl-openejb/target/deltaspike-cdictrl-openejb-1.5.5-SNAPSHOT-sources.jar>
to org.apache.deltaspike.cdictrl/deltaspike-cdictrl-openejb/1.5.5-SNAPSHOT/deltaspike-cdictrl-openejb-1.5.5-SNAPSHOT-sources.jar
[JENKINS] Archiving <https://builds.apache.org/job/DeltaSpike_TomEE_7.0.0-M3/ws/deltaspike/modules/jsf/pom.xml>
to org.apache.deltaspike.modules/jsf-module-project/1.5.5-SNAPSHOT/jsf-module-project-1.5.5-SNAPSHOT.pom
[JENKINS] Archiving <https://builds.apache.org/job/DeltaSpike_TomEE_7.0.0-M3/ws/deltaspike/modules/jsf/target/jsf-module-project-1.5.5-SNAPSHOT-tests.jar>
to org.apache.deltaspike.modules/jsf-module-project/1.5.5-SNAPSHOT/jsf-module-project-1.5.5-SNAPSHOT-tests.jar
[JENKINS] Archiving <https://builds.apache.org/job/DeltaSpike_TomEE_7.0.0-M3/ws/deltaspike/cdictrl/tck/pom.xml>
to org.apache.deltaspike.test/deltaspike-cdictrl-tck/1.5.5-SNAPSHOT/deltaspike-cdictrl-tck-1.5.5-SNAPSHOT.pom
[JENKINS] Archiving <https://builds.apache.org/job/DeltaSpike_TomEE_7.0.0-M3/ws/deltaspike/cdictrl/tck/target/deltaspike-cdictrl-tck-1.5.5-SNAPSHOT.jar>
to org.apache.deltaspike.test/deltaspike-cdictrl-tck/1.5.5-SNAPSHOT/deltaspike-cdictrl-tck-1.5.5-SNAPSHOT.jar
[JENKINS] Archiving <https://builds.apache.org/job/DeltaSpike_TomEE_7.0.0-M3/ws/deltaspike/cdictrl/tck/target/deltaspike-cdictrl-tck-1.5.5-SNAPSHOT-sources.jar>
to org.apache.deltaspike.test/deltaspike-cdictrl-tck/1.5.5-SNAPSHOT/deltaspike-cdictrl-tck-1.5.5-SNAPSHOT-sources.jar
[JENKINS] Archiving <https://builds.apache.org/job/DeltaSpike_TomEE_7.0.0-M3/ws/deltaspike/modules/jsf/api/pom.xml>
to org.apache.deltaspike.modules/deltaspike-jsf-module-api/1.5.5-SNAPSHOT/deltaspike-jsf-module-api-1.5.5-SNAPSHOT.pom
[JENKINS] Archiving <https://builds.apache.org/job/DeltaSpike_TomEE_7.0.0-M3/ws/deltaspike/modules/jsf/api/target/deltaspike-jsf-module-api-1.5.5-SNAPSHOT.jar>
to org.apache.deltaspike.modules/deltaspike-jsf-module-api/1.5.5-SNAPSHOT/deltaspike-jsf-module-api-1.5.5-SNAPSHOT.jar
[JENKINS] Archiving <https://builds.apache.org/job/DeltaSpike_TomEE_7.0.0-M3/ws/deltaspike/modules/jsf/api/target/deltaspike-jsf-module-api-1.5.5-SNAPSHOT-tests.jar>
to org.apache.deltaspike.modules/deltaspike-jsf-module-api/1.5.5-SNAPSHOT/deltaspike-jsf-module-api-1.5.5-SNAPSHOT-tests.jar
[JENKINS] Archiving <https://builds.apache.org/job/DeltaSpike_TomEE_7.0.0-M3/ws/deltaspike/modules/jsf/api/target/deltaspike-jsf-module-api-1.5.5-SNAPSHOT-sources.jar>
to org.apache.deltaspike.modules/deltaspike-jsf-module-api/1.5.5-SNAPSHOT/deltaspike-jsf-module-api-1.5.5-SNAPSHOT-sources.jar
[JENKINS] Archiving <https://builds.apache.org/job/DeltaSpike_TomEE_7.0.0-M3/ws/deltaspike/modules/security/pom.xml>
to org.apache.deltaspike.modules/security-module-project/1.5.5-SNAPSHOT/security-module-project-1.5.5-SNAPSHOT.pom
[JENKINS] Archiving <https://builds.apache.org/job/DeltaSpike_TomEE_7.0.0-M3/ws/deltaspike/modules/security/target/security-module-project-1.5.5-SNAPSHOT-tests.jar>
to org.apache.deltaspike.modules/security-module-project/1.5.5-SNAPSHOT/security-module-project-1.5.5-SNAPSHOT-tests.jar
[JENKINS] Archiving <https://builds.apache.org/job/DeltaSpike_TomEE_7.0.0-M3/ws/deltaspike/modules/bean-validation/pom.xml>
to org.apache.deltaspike.modules/bean-validation-module-project/1.5.5-SNAPSHOT/bean-validation-module-project-1.5.5-SNAPSHOT.pom
[JENKINS] Archiving <https://builds.apache.org/job/DeltaSpike_TomEE_7.0.0-M3/ws/deltaspike/modules/bean-validation/target/bean-validation-module-project-1.5.5-SNAPSHOT-tests.jar>
to org.apache.deltaspike.modules/bean-validation-module-project/1.5.5-SNAPSHOT/bean-validation-module-project-1.5.5-SNAPSHOT-tests.jar
[JENKINS] Archiving <https://builds.apache.org/job/DeltaSpike_TomEE_7.0.0-M3/ws/deltaspike/modules/partial-bean/impl/pom.xml>
to org.apache.deltaspike.modules/deltaspike-partial-bean-module-impl/1.5.5-SNAPSHOT/deltaspike-partial-bean-module-impl-1.5.5-SNAPSHOT.pom
[JENKINS] Archiving <https://builds.apache.org/job/DeltaSpike_TomEE_7.0.0-M3/ws/deltaspike/modules/partial-bean/impl/target/deltaspike-partial-bean-module-impl-1.5.5-SNAPSHOT.jar>
to org.apache.deltaspike.modules/deltaspike-partial-bean-module-impl/1.5.5-SNAPSHOT/deltaspike-partial-bean-module-impl-1.5.5-SNAPSHOT.jar
[JENKINS] Archiving <https://builds.apache.org/job/DeltaSpike_TomEE_7.0.0-M3/ws/deltaspike/modules/partial-bean/impl/target/deltaspike-partial-bean-module-impl-1.5.5-SNAPSHOT-tests.jar>
to org.apache.deltaspike.modules/deltaspike-partial-bean-module-impl/1.5.5-SNAPSHOT/deltaspike-partial-bean-module-impl-1.5.5-SNAPSHOT-tests.jar
[JENKINS] Archiving <https://builds.apache.org/job/DeltaSpike_TomEE_7.0.0-M3/ws/deltaspike/modules/partial-bean/impl/target/deltaspike-partial-bean-module-impl-1.5.5-SNAPSHOT-sources.jar>
to org.apache.deltaspike.modules/deltaspike-partial-bean-module-impl/1.5.5-SNAPSHOT/deltaspike-partial-bean-module-impl-1.5.5-SNAPSHOT-sources.jar
[JENKINS] Archiving <https://builds.apache.org/job/DeltaSpike_TomEE_7.0.0-M3/ws/deltaspike/modules/proxy/api/pom.xml>
to org.apache.deltaspike.modules/deltaspike-proxy-module-api/1.5.5-SNAPSHOT/deltaspike-proxy-module-api-1.5.5-SNAPSHOT.pom
[JENKINS] Archiving <https://builds.apache.org/job/DeltaSpike_TomEE_7.0.0-M3/ws/deltaspike/modules/proxy/api/target/deltaspike-proxy-module-api-1.5.5-SNAPSHOT.jar>
to org.apache.deltaspike.modules/deltaspike-proxy-module-api/1.5.5-SNAPSHOT/deltaspike-proxy-module-api-1.5.5-SNAPSHOT.jar
[JENKINS] Archiving <https://builds.apache.org/job/DeltaSpike_TomEE_7.0.0-M3/ws/deltaspike/modules/proxy/api/target/deltaspike-proxy-module-api-1.5.5-SNAPSHOT-tests.jar>
to org.apache.deltaspike.modules/deltaspike-proxy-module-api/1.5.5-SNAPSHOT/deltaspike-proxy-module-api-1.5.5-SNAPSHOT-tests.jar
[JENKINS] Archiving <https://builds.apache.org/job/DeltaSpike_TomEE_7.0.0-M3/ws/deltaspike/modules/proxy/api/target/deltaspike-proxy-module-api-1.5.5-SNAPSHOT-sources.jar>
to org.apache.deltaspike.modules/deltaspike-proxy-module-api/1.5.5-SNAPSHOT/deltaspike-proxy-module-api-1.5.5-SNAPSHOT-sources.jar
[JENKINS] Archiving <https://builds.apache.org/job/DeltaSpike_TomEE_7.0.0-M3/ws/deltaspike/modules/jpa/api/pom.xml>
to org.apache.deltaspike.modules/deltaspike-jpa-module-api/1.5.5-SNAPSHOT/deltaspike-jpa-module-api-1.5.5-SNAPSHOT.pom
[JENKINS] Archiving <https://builds.apache.org/job/DeltaSpike_TomEE_7.0.0-M3/ws/deltaspike/modules/jpa/api/target/deltaspike-jpa-module-api-1.5.5-SNAPSHOT.jar>
to org.apache.deltaspike.modules/deltaspike-jpa-module-api/1.5.5-SNAPSHOT/deltaspike-jpa-module-api-1.5.5-SNAPSHOT.jar
[JENKINS] Archiving <https://builds.apache.org/job/DeltaSpike_TomEE_7.0.0-M3/ws/deltaspike/modules/jpa/api/target/deltaspike-jpa-module-api-1.5.5-SNAPSHOT-tests.jar>
to org.apache.deltaspike.modules/deltaspike-jpa-module-api/1.5.5-SNAPSHOT/deltaspike-jpa-module-api-1.5.5-SNAPSHOT-tests.jar
[JENKINS] Archiving <https://builds.apache.org/job/DeltaSpike_TomEE_7.0.0-M3/ws/deltaspike/modules/jpa/api/target/deltaspike-jpa-module-api-1.5.5-SNAPSHOT-sources.jar>
to org.apache.deltaspike.modules/deltaspike-jpa-module-api/1.5.5-SNAPSHOT/deltaspike-jpa-module-api-1.5.5-SNAPSHOT-sources.jar
[JENKINS] Archiving <https://builds.apache.org/job/DeltaSpike_TomEE_7.0.0-M3/ws/deltaspike/modules/servlet/api/pom.xml>
to org.apache.deltaspike.modules/deltaspike-servlet-module-api/1.5.5-SNAPSHOT/deltaspike-servlet-module-api-1.5.5-SNAPSHOT.pom
[JENKINS] Archiving <https://builds.apache.org/job/DeltaSpike_TomEE_7.0.0-M3/ws/deltaspike/modules/servlet/api/target/deltaspike-servlet-module-api-1.5.5-SNAPSHOT.jar>
to org.apache.deltaspike.modules/deltaspike-servlet-module-api/1.5.5-SNAPSHOT/deltaspike-servlet-module-api-1.5.5-SNAPSHOT.jar
[JENKINS] Archiving <https://builds.apache.org/job/DeltaSpike_TomEE_7.0.0-M3/ws/deltaspike/modules/servlet/api/target/deltaspike-servlet-module-api-1.5.5-SNAPSHOT-tests.jar>
to org.apache.deltaspike.modules/deltaspike-servlet-module-api/1.5.5-SNAPSHOT/deltaspike-servlet-module-api-1.5.5-SNAPSHOT-tests.jar
[JENKINS] Archiving <https://builds.apache.org/job/DeltaSpike_TomEE_7.0.0-M3/ws/deltaspike/modules/servlet/api/target/deltaspike-servlet-module-api-1.5.5-SNAPSHOT-sources.jar>
to org.apache.deltaspike.modules/deltaspike-servlet-module-api/1.5.5-SNAPSHOT/deltaspike-servlet-module-api-1.5.5-SNAPSHOT-sources.jar
[JENKINS] Archiving <https://builds.apache.org/job/DeltaSpike_TomEE_7.0.0-M3/ws/deltaspike/modules/jpa/pom.xml>
to org.apache.deltaspike.modules/jpa-module-project/1.5.5-SNAPSHOT/jpa-module-project-1.5.5-SNAPSHOT.pom
[JENKINS] Archiving <https://builds.apache.org/job/DeltaSpike_TomEE_7.0.0-M3/ws/deltaspike/modules/jpa/target/jpa-module-project-1.5.5-SNAPSHOT-tests.jar>
to org.apache.deltaspike.modules/jpa-module-project/1.5.5-SNAPSHOT/jpa-module-project-1.5.5-SNAPSHOT-tests.jar
[JENKINS] Archiving <https://builds.apache.org/job/DeltaSpike_TomEE_7.0.0-M3/ws/deltaspike/cdictrl/pom.xml>
to org.apache.deltaspike.cdictrl/cdictrl-project/1.5.5-SNAPSHOT/cdictrl-project-1.5.5-SNAPSHOT.pom
[JENKINS] Archiving <https://builds.apache.org/job/DeltaSpike_TomEE_7.0.0-M3/ws/deltaspike/modules/scheduler/api/pom.xml>
to org.apache.deltaspike.modules/deltaspike-scheduler-module-api/1.5.5-SNAPSHOT/deltaspike-scheduler-module-api-1.5.5-SNAPSHOT.pom
[JENKINS] Archiving <https://builds.apache.org/job/DeltaSpike_TomEE_7.0.0-M3/ws/deltaspike/modules/test-control/impl/pom.xml>
to org.apache.deltaspike.modules/deltaspike-test-control-module-impl/1.5.5-SNAPSHOT/deltaspike-test-control-module-impl-1.5.5-SNAPSHOT.pom
[JENKINS] Archiving <https://builds.apache.org/job/DeltaSpike_TomEE_7.0.0-M3/ws/deltaspike/modules/servlet/pom.xml>
to org.apache.deltaspike.modules/servlet-module-project/1.5.5-SNAPSHOT/servlet-module-project-1.5.5-SNAPSHOT.pom
[JENKINS] Archiving <https://builds.apache.org/job/DeltaSpike_TomEE_7.0.0-M3/ws/deltaspike/modules/servlet/target/servlet-module-project-1.5.5-SNAPSHOT-tests.jar>
to org.apache.deltaspike.modules/servlet-module-project/1.5.5-SNAPSHOT/servlet-module-project-1.5.5-SNAPSHOT-tests.jar
[JENKINS] Archiving <https://builds.apache.org/job/DeltaSpike_TomEE_7.0.0-M3/ws/deltaspike/modules/test-control/api/pom.xml>
to org.apache.deltaspike.modules/deltaspike-test-control-module-api/1.5.5-SNAPSHOT/deltaspike-test-control-module-api-1.5.5-SNAPSHOT.pom
[JENKINS] Archiving <https://builds.apache.org/job/DeltaSpike_TomEE_7.0.0-M3/ws/deltaspike/modules/jsf/impl-ee6/pom.xml>
to org.apache.deltaspike.modules/deltaspike-jsf-module-impl-ee6/1.5.5-SNAPSHOT/deltaspike-jsf-module-impl-ee6-1.5.5-SNAPSHOT.pom
[JENKINS] Archiving <https://builds.apache.org/job/DeltaSpike_TomEE_7.0.0-M3/ws/deltaspike/modules/jsf/impl-ee6/target/deltaspike-jsf-module-impl-ee6-1.5.5-SNAPSHOT.jar>
to org.apache.deltaspike.modules/deltaspike-jsf-module-impl-ee6/1.5.5-SNAPSHOT/deltaspike-jsf-module-impl-ee6-1.5.5-SNAPSHOT.jar
[JENKINS] Archiving <https://builds.apache.org/job/DeltaSpike_TomEE_7.0.0-M3/ws/deltaspike/modules/jsf/impl-ee6/target/deltaspike-jsf-module-impl-ee6-1.5.5-SNAPSHOT-tests.jar>
to org.apache.deltaspike.modules/deltaspike-jsf-module-impl-ee6/1.5.5-SNAPSHOT/deltaspike-jsf-module-impl-ee6-1.5.5-SNAPSHOT-tests.jar
[JENKINS] Archiving <https://builds.apache.org/job/DeltaSpike_TomEE_7.0.0-M3/ws/deltaspike/modules/jsf/impl-ee6/target/deltaspike-jsf-module-impl-ee6-1.5.5-SNAPSHOT-sources.jar>
to org.apache.deltaspike.modules/deltaspike-jsf-module-impl-ee6/1.5.5-SNAPSHOT/deltaspike-jsf-module-impl-ee6-1.5.5-SNAPSHOT-sources.jar
[JENKINS] Archiving <https://builds.apache.org/job/DeltaSpike_TomEE_7.0.0-M3/ws/deltaspike/modules/proxy/pom.xml>
to org.apache.deltaspike.modules/proxy-module-project/1.5.5-SNAPSHOT/proxy-module-project-1.5.5-SNAPSHOT.pom
[JENKINS] Archiving <https://builds.apache.org/job/DeltaSpike_TomEE_7.0.0-M3/ws/deltaspike/modules/proxy/target/proxy-module-project-1.5.5-SNAPSHOT-tests.jar>
to org.apache.deltaspike.modules/proxy-module-project/1.5.5-SNAPSHOT/proxy-module-project-1.5.5-SNAPSHOT-tests.jar
[JENKINS] Archiving <https://builds.apache.org/job/DeltaSpike_TomEE_7.0.0-M3/ws/deltaspike/modules/partial-bean/api/pom.xml>
to org.apache.deltaspike.modules/deltaspike-partial-bean-module-api/1.5.5-SNAPSHOT/deltaspike-partial-bean-module-api-1.5.5-SNAPSHOT.pom
[JENKINS] Archiving <https://builds.apache.org/job/DeltaSpike_TomEE_7.0.0-M3/ws/deltaspike/modules/partial-bean/api/target/deltaspike-partial-bean-module-api-1.5.5-SNAPSHOT.jar>
to org.apache.deltaspike.modules/deltaspike-partial-bean-module-api/1.5.5-SNAPSHOT/deltaspike-partial-bean-module-api-1.5.5-SNAPSHOT.jar
[JENKINS] Archiving <https://builds.apache.org/job/DeltaSpike_TomEE_7.0.0-M3/ws/deltaspike/modules/partial-bean/api/target/deltaspike-partial-bean-module-api-1.5.5-SNAPSHOT-tests.jar>
to org.apache.deltaspike.modules/deltaspike-partial-bean-module-api/1.5.5-SNAPSHOT/deltaspike-partial-bean-module-api-1.5.5-SNAPSHOT-tests.jar
[JENKINS] Archiving <https://builds.apache.org/job/DeltaSpike_TomEE_7.0.0-M3/ws/deltaspike/modules/partial-bean/api/target/deltaspike-partial-bean-module-api-1.5.5-SNAPSHOT-sources.jar>
to org.apache.deltaspike.modules/deltaspike-partial-bean-module-api/1.5.5-SNAPSHOT/deltaspike-partial-bean-module-api-1.5.5-SNAPSHOT-sources.jar
[JENKINS] Archiving <https://builds.apache.org/job/DeltaSpike_TomEE_7.0.0-M3/ws/deltaspike/modules/scheduler/impl/pom.xml>
to org.apache.deltaspike.modules/deltaspike-scheduler-module-impl/1.5.5-SNAPSHOT/deltaspike-scheduler-module-impl-1.5.5-SNAPSHOT.pom
[JENKINS] Archiving <https://builds.apache.org/job/DeltaSpike_TomEE_7.0.0-M3/ws/deltaspike/parent/pom.xml>
to org.apache.deltaspike/parent/1.5.5-SNAPSHOT/parent-1.5.5-SNAPSHOT.pom
Compressed 39.92 KB of artifacts by 80.2% relative to #121
[JENKINS] Archiving <https://builds.apache.org/job/DeltaSpike_TomEE_7.0.0-M3/ws/deltaspike/core/pom.xml>
to org.apache.deltaspike.core/core-project/1.5.5-SNAPSHOT/core-project-1.5.5-SNAPSHOT.pom
[JENKINS] Archiving <https://builds.apache.org/job/DeltaSpike_TomEE_7.0.0-M3/ws/deltaspike/core/target/core-project-1.5.5-SNAPSHOT-tests.jar>
to org.apache.deltaspike.core/core-project/1.5.5-SNAPSHOT/core-project-1.5.5-SNAPSHOT-tests.jar
[JENKINS] Archiving <https://builds.apache.org/job/DeltaSpike_TomEE_7.0.0-M3/ws/deltaspike/modules/bean-validation/api/pom.xml>
to org.apache.deltaspike.modules/deltaspike-bean-validation-module-api/1.5.5-SNAPSHOT/deltaspike-bean-validation-module-api-1.5.5-SNAPSHOT.pom
[JENKINS] Archiving <https://builds.apache.org/job/DeltaSpike_TomEE_7.0.0-M3/ws/deltaspike/modules/bean-validation/api/target/deltaspike-bean-validation-module-api-1.5.5-SNAPSHOT.jar>
to org.apache.deltaspike.modules/deltaspike-bean-validation-module-api/1.5.5-SNAPSHOT/deltaspike-bean-validation-module-api-1.5.5-SNAPSHOT.jar
[JENKINS] Archiving <https://builds.apache.org/job/DeltaSpike_TomEE_7.0.0-M3/ws/deltaspike/modules/bean-validation/api/target/deltaspike-bean-validation-module-api-1.5.5-SNAPSHOT-tests.jar>
to org.apache.deltaspike.modules/deltaspike-bean-validation-module-api/1.5.5-SNAPSHOT/deltaspike-bean-validation-module-api-1.5.5-SNAPSHOT-tests.jar
[JENKINS] Archiving <https://builds.apache.org/job/DeltaSpike_TomEE_7.0.0-M3/ws/deltaspike/modules/bean-validation/api/target/deltaspike-bean-validation-module-api-1.5.5-SNAPSHOT-sources.jar>
to org.apache.deltaspike.modules/deltaspike-bean-validation-module-api/1.5.5-SNAPSHOT/deltaspike-bean-validation-module-api-1.5.5-SNAPSHOT-sources.jar
[JENKINS] Archiving <https://builds.apache.org/job/DeltaSpike_TomEE_7.0.0-M3/ws/deltaspike/core/api/pom.xml>
to org.apache.deltaspike.core/deltaspike-core-api/1.5.5-SNAPSHOT/deltaspike-core-api-1.5.5-SNAPSHOT.pom
[JENKINS] Archiving <https://builds.apache.org/job/DeltaSpike_TomEE_7.0.0-M3/ws/deltaspike/core/api/target/deltaspike-core-api-1.5.5-SNAPSHOT.jar>
to org.apache.deltaspike.core/deltaspike-core-api/1.5.5-SNAPSHOT/deltaspike-core-api-1.5.5-SNAPSHOT.jar
[JENKINS] Archiving <https://builds.apache.org/job/DeltaSpike_TomEE_7.0.0-M3/ws/deltaspike/core/api/target/deltaspike-core-api-1.5.5-SNAPSHOT-tests.jar>
to org.apache.deltaspike.core/deltaspike-core-api/1.5.5-SNAPSHOT/deltaspike-core-api-1.5.5-SNAPSHOT-tests.jar
[JENKINS] Archiving <https://builds.apache.org/job/DeltaSpike_TomEE_7.0.0-M3/ws/deltaspike/core/api/target/deltaspike-core-api-1.5.5-SNAPSHOT-sources.jar>
to org.apache.deltaspike.core/deltaspike-core-api/1.5.5-SNAPSHOT/deltaspike-core-api-1.5.5-SNAPSHOT-sources.jar
[JENKINS] Archiving <https://builds.apache.org/job/DeltaSpike_TomEE_7.0.0-M3/ws/deltaspike/modules/security/impl/pom.xml>
to org.apache.deltaspike.modules/deltaspike-security-module-impl/1.5.5-SNAPSHOT/deltaspike-security-module-impl-1.5.5-SNAPSHOT.pom
[JENKINS] Archiving <https://builds.apache.org/job/DeltaSpike_TomEE_7.0.0-M3/ws/deltaspike/modules/security/impl/target/deltaspike-security-module-impl-1.5.5-SNAPSHOT.jar>
to org.apache.deltaspike.modules/deltaspike-security-module-impl/1.5.5-SNAPSHOT/deltaspike-security-module-impl-1.5.5-SNAPSHOT.jar
[JENKINS] Archiving <https://builds.apache.org/job/DeltaSpike_TomEE_7.0.0-M3/ws/deltaspike/modules/security/impl/target/deltaspike-security-module-impl-1.5.5-SNAPSHOT-tests.jar>
to org.apache.deltaspike.modules/deltaspike-security-module-impl/1.5.5-SNAPSHOT/deltaspike-security-module-impl-1.5.5-SNAPSHOT-tests.jar
[JENKINS] Archiving <https://builds.apache.org/job/DeltaSpike_TomEE_7.0.0-M3/ws/deltaspike/modules/security/impl/target/deltaspike-security-module-impl-1.5.5-SNAPSHOT-sources.jar>
to org.apache.deltaspike.modules/deltaspike-security-module-impl/1.5.5-SNAPSHOT/deltaspike-security-module-impl-1.5.5-SNAPSHOT-sources.jar
[JENKINS] Archiving <https://builds.apache.org/job/DeltaSpike_TomEE_7.0.0-M3/ws/deltaspike/modules/scheduler/pom.xml>
to org.apache.deltaspike.modules/scheduler-module-project/1.5.5-SNAPSHOT/scheduler-module-project-1.5.5-SNAPSHOT.pom
[JENKINS] Archiving <https://builds.apache.org/job/DeltaSpike_TomEE_7.0.0-M3/ws/site/pom.xml>
to org.apache.deltaspike/deltaspike-site/1.5.5-SNAPSHOT/deltaspike-site-1.5.5-SNAPSHOT.pom
[JENKINS] Archiving <https://builds.apache.org/job/DeltaSpike_TomEE_7.0.0-M3/ws/deltaspike/modules/proxy/impl-asm5/pom.xml>
to org.apache.deltaspike.modules/deltaspike-proxy-module-impl-asm5/1.5.5-SNAPSHOT/deltaspike-proxy-module-impl-asm5-1.5.5-SNAPSHOT.pom
[JENKINS] Archiving <https://builds.apache.org/job/DeltaSpike_TomEE_7.0.0-M3/ws/deltaspike/modules/proxy/impl-asm5/target/deltaspike-proxy-module-impl-asm5-1.5.5-SNAPSHOT.jar>
to org.apache.deltaspike.modules/deltaspike-proxy-module-impl-asm5/1.5.5-SNAPSHOT/deltaspike-proxy-module-impl-asm5-1.5.5-SNAPSHOT.jar
[JENKINS] Archiving <https://builds.apache.org/job/DeltaSpike_TomEE_7.0.0-M3/ws/deltaspike/modules/proxy/impl-asm5/target/deltaspike-proxy-module-impl-asm5-1.5.5-SNAPSHOT-tests.jar>
to org.apache.deltaspike.modules/deltaspike-proxy-module-impl-asm5/1.5.5-SNAPSHOT/deltaspike-proxy-module-impl-asm5-1.5.5-SNAPSHOT-tests.jar
[JENKINS] Archiving <https://builds.apache.org/job/DeltaSpike_TomEE_7.0.0-M3/ws/deltaspike/modules/proxy/impl-asm5/target/deltaspike-proxy-module-impl-asm5-1.5.5-SNAPSHOT-sources.jar>
to org.apache.deltaspike.modules/deltaspike-proxy-module-impl-asm5/1.5.5-SNAPSHOT/deltaspike-proxy-module-impl-asm5-1.5.5-SNAPSHOT-sources.jar
[JENKINS] Archiving <https://builds.apache.org/job/DeltaSpike_TomEE_7.0.0-M3/ws/deltaspike/examples/jsf-playground/pom.xml>
to org.apache.deltaspike.examples/deltaspike-jsf-playground/1.5.5-SNAPSHOT/deltaspike-jsf-playground-1.5.5-SNAPSHOT.pom
[JENKINS] Archiving <https://builds.apache.org/job/DeltaSpike_TomEE_7.0.0-M3/ws/deltaspike/modules/servlet/impl/pom.xml>
to org.apache.deltaspike.modules/deltaspike-servlet-module-impl/1.5.5-SNAPSHOT/deltaspike-servlet-module-impl-1.5.5-SNAPSHOT.pom
[JENKINS] Archiving <https://builds.apache.org/job/DeltaSpike_TomEE_7.0.0-M3/ws/deltaspike/modules/servlet/impl/target/deltaspike-servlet-module-impl-1.5.5-SNAPSHOT.jar>
to org.apache.deltaspike.modules/deltaspike-servlet-module-impl/1.5.5-SNAPSHOT/deltaspike-servlet-module-impl-1.5.5-SNAPSHOT.jar
[JENKINS] Archiving <https://builds.apache.org/job/DeltaSpike_TomEE_7.0.0-M3/ws/deltaspike/modules/servlet/impl/target/deltaspike-servlet-module-impl-1.5.5-SNAPSHOT-tests.jar>
to org.apache.deltaspike.modules/deltaspike-servlet-module-impl/1.5.5-SNAPSHOT/deltaspike-servlet-module-impl-1.5.5-SNAPSHOT-tests.jar
[JENKINS] Archiving <https://builds.apache.org/job/DeltaSpike_TomEE_7.0.0-M3/ws/deltaspike/modules/servlet/impl/target/deltaspike-servlet-module-impl-1.5.5-SNAPSHOT-sources.jar>
to org.apache.deltaspike.modules/deltaspike-servlet-module-impl/1.5.5-SNAPSHOT/deltaspike-servlet-module-impl-1.5.5-SNAPSHOT-sources.jar
[JENKINS] Archiving <https://builds.apache.org/job/DeltaSpike_TomEE_7.0.0-M3/ws/deltaspike/modules/bean-validation/impl/pom.xml>
to org.apache.deltaspike.modules/deltaspike-bean-validation-module-impl/1.5.5-SNAPSHOT/deltaspike-bean-validation-module-impl-1.5.5-SNAPSHOT.pom
[JENKINS] Archiving <https://builds.apache.org/job/DeltaSpike_TomEE_7.0.0-M3/ws/deltaspike/modules/bean-validation/impl/target/deltaspike-bean-validation-module-impl-1.5.5-SNAPSHOT.jar>
to org.apache.deltaspike.modules/deltaspike-bean-validation-module-impl/1.5.5-SNAPSHOT/deltaspike-bean-validation-module-impl-1.5.5-SNAPSHOT.jar
[JENKINS] Archiving <https://builds.apache.org/job/DeltaSpike_TomEE_7.0.0-M3/ws/deltaspike/modules/bean-validation/impl/target/deltaspike-bean-validation-module-impl-1.5.5-SNAPSHOT-tests.jar>
to org.apache.deltaspike.modules/deltaspike-bean-validation-module-impl/1.5.5-SNAPSHOT/deltaspike-bean-validation-module-impl-1.5.5-SNAPSHOT-tests.jar
[JENKINS] Archiving <https://builds.apache.org/job/DeltaSpike_TomEE_7.0.0-M3/ws/deltaspike/modules/bean-validation/impl/target/deltaspike-bean-validation-module-impl-1.5.5-SNAPSHOT-sources.jar>
to org.apache.deltaspike.modules/deltaspike-bean-validation-module-impl/1.5.5-SNAPSHOT/deltaspike-bean-validation-module-impl-1.5.5-SNAPSHOT-sources.jar
[JENKINS] Archiving <https://builds.apache.org/job/DeltaSpike_TomEE_7.0.0-M3/ws/deltaspike/modules/data/test-ee7/pom.xml>
to org.apache.deltaspike.modules/deltaspike-data-module-test-ee7/1.5.5-SNAPSHOT/deltaspike-data-module-test-ee7-1.5.5-SNAPSHOT.pom
[JENKINS] Archiving <https://builds.apache.org/job/DeltaSpike_TomEE_7.0.0-M3/ws/pom.xml>
to org.apache.deltaspike/deltaspike/1.5.5-SNAPSHOT/deltaspike-1.5.5-SNAPSHOT.pom
[JENKINS] Archiving <https://builds.apache.org/job/DeltaSpike_TomEE_7.0.0-M3/ws/deltaspike/modules/jpa/impl/pom.xml>
to org.apache.deltaspike.modules/deltaspike-jpa-module-impl/1.5.5-SNAPSHOT/deltaspike-jpa-module-impl-1.5.5-SNAPSHOT.pom
[JENKINS] Archiving <https://builds.apache.org/job/DeltaSpike_TomEE_7.0.0-M3/ws/deltaspike/modules/jpa/impl/target/deltaspike-jpa-module-impl-1.5.5-SNAPSHOT.jar>
to org.apache.deltaspike.modules/deltaspike-jpa-module-impl/1.5.5-SNAPSHOT/deltaspike-jpa-module-impl-1.5.5-SNAPSHOT.jar
[JENKINS] Archiving <https://builds.apache.org/job/DeltaSpike_TomEE_7.0.0-M3/ws/deltaspike/modules/jpa/impl/target/deltaspike-jpa-module-impl-1.5.5-SNAPSHOT-tests.jar>
to org.apache.deltaspike.modules/deltaspike-jpa-module-impl/1.5.5-SNAPSHOT/deltaspike-jpa-module-impl-1.5.5-SNAPSHOT-tests.jar
[JENKINS] Archiving <https://builds.apache.org/job/DeltaSpike_TomEE_7.0.0-M3/ws/deltaspike/modules/jpa/impl/target/deltaspike-jpa-module-impl-1.5.5-SNAPSHOT-sources.jar>
to org.apache.deltaspike.modules/deltaspike-jpa-module-impl/1.5.5-SNAPSHOT/deltaspike-jpa-module-impl-1.5.5-SNAPSHOT-sources.jar
[JENKINS] Archiving <https://builds.apache.org/job/DeltaSpike_TomEE_7.0.0-M3/ws/deltaspike/modules/data/pom.xml>
to org.apache.deltaspike.modules/data-module-project/1.5.5-SNAPSHOT/data-module-project-1.5.5-SNAPSHOT.pom
[JENKINS] Archiving <https://builds.apache.org/job/DeltaSpike_TomEE_7.0.0-M3/ws/deltaspike/modules/data/target/data-module-project-1.5.5-SNAPSHOT-tests.jar>
to org.apache.deltaspike.modules/data-module-project/1.5.5-SNAPSHOT/data-module-project-1.5.5-SNAPSHOT-tests.jar
[JENKINS] Archiving <https://builds.apache.org/job/DeltaSpike_TomEE_7.0.0-M3/ws/deltaspike/examples/security-requested-page-after-login-picketlink/pom.xml>
to org.apache.deltaspike.examples/deltaspike-security-requested-page-after-login-picketlink/1.5.5-SNAPSHOT/deltaspike-security-requested-page-after-login-picketlink-1.5.5-SNAPSHOT.pom
[JENKINS] Archiving <https://builds.apache.org/job/DeltaSpike_TomEE_7.0.0-M3/ws/deltaspike/pom.xml>
to org.apache.deltaspike/deltaspike-project/1.5.5-SNAPSHOT/deltaspike-project-1.5.5-SNAPSHOT.pom
[JENKINS] Archiving <https://builds.apache.org/job/DeltaSpike_TomEE_7.0.0-M3/ws/deltaspike/modules/security/api/pom.xml>
to org.apache.deltaspike.modules/deltaspike-security-module-api/1.5.5-SNAPSHOT/deltaspike-security-module-api-1.5.5-SNAPSHOT.pom
[JENKINS] Archiving <https://builds.apache.org/job/DeltaSpike_TomEE_7.0.0-M3/ws/deltaspike/modules/security/api/target/deltaspike-security-module-api-1.5.5-SNAPSHOT.jar>
to org.apache.deltaspike.modules/deltaspike-security-module-api/1.5.5-SNAPSHOT/deltaspike-security-module-api-1.5.5-SNAPSHOT.jar
[JENKINS] Archiving <https://builds.apache.org/job/DeltaSpike_TomEE_7.0.0-M3/ws/deltaspike/modules/security/api/target/deltaspike-security-module-api-1.5.5-SNAPSHOT-tests.jar>
to org.apache.deltaspike.modules/deltaspike-security-module-api/1.5.5-SNAPSHOT/deltaspike-security-module-api-1.5.5-SNAPSHOT-tests.jar
[JENKINS] Archiving <https://builds.apache.org/job/DeltaSpike_TomEE_7.0.0-M3/ws/deltaspike/modules/security/api/target/deltaspike-security-module-api-1.5.5-SNAPSHOT-sources.jar>
to org.apache.deltaspike.modules/deltaspike-security-module-api/1.5.5-SNAPSHOT/deltaspike-security-module-api-1.5.5-SNAPSHOT-sources.jar
Sending e-mails to: commits@deltaspike.apache.org
Sending e-mails to: commits@deltaspike.apache.org
channel stopped

Mime
View raw message