deltaspike-commits mailing list archives

Site index · List index
Message view « Date » · « Thread »
Top « Date » · « Thread »
From Apache Jenkins Server <jenk...@builds.apache.org>
Subject Build failed in Jenkins: DeltaSpike_TomEE_7.0.0-M3 #131
Date Thu, 31 Mar 2016 16:15:01 GMT
See <https://builds.apache.org/job/DeltaSpike_TomEE_7.0.0-M3/131/changes>

Changes:

[gpetracek] DELTASPIKE-1106 updated version number

------------------------------------------
[...truncated 6541 lines...]
[INFO] Copying 1 resource
[INFO] Copying 3 resources
[INFO] 
[INFO] --- maven-compiler-plugin:2.5:compile (default-compile) @ deltaspike-cdictrl-tck ---
[INFO] Compiling 8 source files to <https://builds.apache.org/job/DeltaSpike_TomEE_7.0.0-M3/ws/deltaspike/cdictrl/tck/target/classes>
[INFO] 
[INFO] --- maven-resources-plugin:2.6:testResources (default-testResources) @ deltaspike-cdictrl-tck
---
[INFO] Using 'UTF-8' encoding to copy filtered resources.
[INFO] skip non existing resourceDirectory <https://builds.apache.org/job/DeltaSpike_TomEE_7.0.0-M3/ws/deltaspike/cdictrl/tck/src/test/resources>
[INFO] Copying 3 resources
[INFO] 
[INFO] --- maven-compiler-plugin:2.5:testCompile (default-testCompile) @ deltaspike-cdictrl-tck
---
[INFO] No sources to compile
[INFO] 
[INFO] --- maven-surefire-plugin:2.11:test (default-test) @ deltaspike-cdictrl-tck ---
[INFO] Surefire report directory: <https://builds.apache.org/job/DeltaSpike_TomEE_7.0.0-M3/ws/deltaspike/cdictrl/tck/target/surefire-reports>
[INFO] Using configured provider org.apache.maven.surefire.junitcore.JUnitCoreProvider

-------------------------------------------------------
 T E S T S
-------------------------------------------------------
Concurrency config is parallel='none', perCoreThreadCount=true, threadCount=2, useUnlimitedThreads=false

Results :

Tests run: 0, Failures: 0, Errors: 0, Skipped: 0

[JENKINS] Recording test results
[INFO] 
[INFO] --- maven-jar-plugin:2.4:jar (default-jar) @ deltaspike-cdictrl-tck ---
[INFO] Building jar: <https://builds.apache.org/job/DeltaSpike_TomEE_7.0.0-M3/ws/deltaspike/cdictrl/tck/target/deltaspike-cdictrl-tck-1.6.0-SNAPSHOT.jar>
[INFO] 
[INFO] --- maven-site-plugin:3.3:attach-descriptor (attach-descriptor) @ deltaspike-cdictrl-tck
---
[INFO] 
[INFO] --- maven-bundle-plugin:2.3.7:cleanVersions (versions) @ deltaspike-cdictrl-tck ---
[INFO] 
[INFO] --- maven-antrun-plugin:1.7:run (javadoc.resources) @ deltaspike-cdictrl-tck ---
[WARNING] Parameter tasks is deprecated, use target instead
[INFO] Executing tasks

main:
[INFO] Executed tasks
[WARNING] Failed to getClass for org.apache.maven.plugin.source.SourceJarMojo
[INFO] 
[INFO] --- maven-source-plugin:2.2.1:jar (attach-sources) @ deltaspike-cdictrl-tck ---
[INFO] Building jar: <https://builds.apache.org/job/DeltaSpike_TomEE_7.0.0-M3/ws/deltaspike/cdictrl/tck/target/deltaspike-cdictrl-tck-1.6.0-SNAPSHOT-sources.jar>
[INFO] 
[INFO] --- maven-checkstyle-plugin:2.9.1:check (verify-style) @ deltaspike-cdictrl-tck ---
[INFO] Starting audit...
<https://builds.apache.org/job/DeltaSpike_TomEE_7.0.0-M3/ws/deltaspike/cdictrl/tck/src/main/java/org/apache/deltaspike/cdise/tck/ContainerCtrlTckTest.java>:56:31:
warning: Variable 'versionControlRule' must be private and have accessor methods.
Audit done.

[INFO] 
[INFO] --- maven-install-plugin:2.5.1:install (default-install) @ deltaspike-cdictrl-tck ---
[INFO] Installing <https://builds.apache.org/job/DeltaSpike_TomEE_7.0.0-M3/ws/deltaspike/cdictrl/tck/target/deltaspike-cdictrl-tck-1.6.0-SNAPSHOT.jar>
to /home/jenkins/jenkins-slave/maven-repositories/1/org/apache/deltaspike/test/deltaspike-cdictrl-tck/1.6.0-SNAPSHOT/deltaspike-cdictrl-tck-1.6.0-SNAPSHOT.jar
[INFO] Installing <https://builds.apache.org/job/DeltaSpike_TomEE_7.0.0-M3/ws/deltaspike/cdictrl/tck/pom.xml>
to /home/jenkins/jenkins-slave/maven-repositories/1/org/apache/deltaspike/test/deltaspike-cdictrl-tck/1.6.0-SNAPSHOT/deltaspike-cdictrl-tck-1.6.0-SNAPSHOT.pom
[INFO] Installing <https://builds.apache.org/job/DeltaSpike_TomEE_7.0.0-M3/ws/deltaspike/cdictrl/tck/target/deltaspike-cdictrl-tck-1.6.0-SNAPSHOT-sources.jar>
to /home/jenkins/jenkins-slave/maven-repositories/1/org/apache/deltaspike/test/deltaspike-cdictrl-tck/1.6.0-SNAPSHOT/deltaspike-cdictrl-tck-1.6.0-SNAPSHOT-sources.jar
[INFO]                                                                         
[INFO] ------------------------------------------------------------------------
[INFO] Building Apache DeltaSpike CDI OpenEJB-ContainerControl 1.6.0-SNAPSHOT
[INFO] ------------------------------------------------------------------------
[INFO] 
[INFO] --- maven-clean-plugin:2.5:clean (default-clean) @ deltaspike-cdictrl-openejb ---
[INFO] Deleting <https://builds.apache.org/job/DeltaSpike_TomEE_7.0.0-M3/ws/deltaspike/cdictrl/impl-openejb/target>
[INFO] 
[INFO] --- maven-bundle-plugin:2.3.7:cleanVersions (versions) @ deltaspike-cdictrl-openejb
---
[INFO] 
[INFO] --- maven-antrun-plugin:1.7:run (javadoc.resources) @ deltaspike-cdictrl-openejb ---
[WARNING] Parameter tasks is deprecated, use target instead
[INFO] Executing tasks

main:
[INFO] Executed tasks
[INFO] 
[INFO] --- maven-dependency-plugin:2.4:unpack (unpack-context) @ deltaspike-cdictrl-openejb
---
[INFO] Configured Artifact: org.apache.deltaspike.cdictrl:deltaspike-cdictrl-owb:1.6.0-SNAPSHOT:jar
Downloading: http://repository.apache.org/snapshots/org/apache/deltaspike/cdictrl/deltaspike-cdictrl-owb/1.6.0-SNAPSHOT/maven-metadata.xml
Downloading: https://repository.apache.org/content/repositories/releases/org/apache/deltaspike/cdictrl/deltaspike-cdictrl-owb/1.6.0-SNAPSHOT/maven-metadata.xml
Downloading: https://repository.apache.org/content/repositories/snapshots/org/apache/deltaspike/cdictrl/deltaspike-cdictrl-owb/1.6.0-SNAPSHOT/maven-metadata.xml
Downloading: https://repository.apache.org/content/repositories/releases/org/apache/deltaspike/cdictrl/deltaspike-cdictrl-owb/1.6.0-SNAPSHOT/deltaspike-cdictrl-owb-1.6.0-SNAPSHOT.jar
Downloading: https://repository.apache.org/content/repositories/snapshots/org/apache/deltaspike/cdictrl/deltaspike-cdictrl-owb/1.6.0-SNAPSHOT/deltaspike-cdictrl-owb-1.6.0-SNAPSHOT.jar
Downloading: http://repository.apache.org/snapshots/org/apache/deltaspike/cdictrl/deltaspike-cdictrl-owb/1.6.0-SNAPSHOT/deltaspike-cdictrl-owb-1.6.0-SNAPSHOT.jar
[INFO] ------------------------------------------------------------------------
[INFO] Reactor Summary:
[INFO] 
[INFO] Apache DeltaSpike ................................. SUCCESS [5.331s]
[INFO] Apache DeltaSpike Sources ......................... SUCCESS [0.461s]
[INFO] Apache DeltaSpike CheckStyle-rules ................ SUCCESS [2.898s]
[INFO] Apache DeltaSpike Parent .......................... SUCCESS [3.933s]
[INFO] Apache DeltaSpike Test-Utils ...................... SUCCESS [5.312s]
[INFO] Apache DeltaSpike Code Parent ..................... SUCCESS [4.747s]
[INFO] Apache DeltaSpike Core ............................ SUCCESS [5.289s]
[INFO] Apache DeltaSpike Core-API ........................ SUCCESS [10.470s]
[INFO] Apache DeltaSpike Core-Implementation ............. SUCCESS [1:59.117s]
[INFO] Apache DeltaSpike ContainerControl parent ......... SUCCESS [1.593s]
[INFO] Apache DeltaSpike CDI ContainerControl API ........ SUCCESS [1.751s]
[INFO] Apache DeltaSpike CDI ContainerControl TCK ........ SUCCESS [1.827s]
[INFO] Apache DeltaSpike CDI OpenEJB-ContainerControl .... FAILURE [2.505s]
[INFO] Apache DeltaSpike Modules ......................... SKIPPED
[INFO] Apache DeltaSpike Proxy-Module .................... SKIPPED
[INFO] Apache DeltaSpike Proxy-Module API ................ SKIPPED
[INFO] Apache DeltaSpike Proxy-Module Impl ASM5 .......... SKIPPED
[INFO] Apache DeltaSpike Security-Module ................. SKIPPED
[INFO] Apache DeltaSpike Security-Module API ............. SKIPPED
[INFO] Apache DeltaSpike Security-Module Impl ............ SKIPPED
[INFO] Apache DeltaSpike JPA-Module ...................... SKIPPED
[INFO] Apache DeltaSpike JPA-Module API .................. SKIPPED
[INFO] Apache DeltaSpike JPA-Module Impl ................. SKIPPED
[INFO] Apache DeltaSpike Servlet-Module .................. SKIPPED
[INFO] Apache DeltaSpike Servlet-Module API .............. SKIPPED
[INFO] Apache DeltaSpike Servlet-Module Impl ............. SKIPPED
[INFO] Apache DeltaSpike JSF-Module ...................... SKIPPED
[INFO] Apache DeltaSpike JSF-Module API .................. SKIPPED
[INFO] Apache DeltaSpike JSF-Module Impl ................. SKIPPED
[INFO] Apache DeltaSpike JSF-Module Impl (EE6 only) ...... SKIPPED
[INFO] Apache DeltaSpike Partial-Bean-Module ............. SKIPPED
[INFO] Apache DeltaSpike Partial-Bean-Module API ......... SKIPPED
[INFO] Apache DeltaSpike Partial-Bean-Module Impl ........ SKIPPED
[INFO] Apache DeltaSpike BeanValidation-Module ........... SKIPPED
[INFO] Apache DeltaSpike BeanValidation-Module API ....... SKIPPED
[INFO] Apache DeltaSpike BeanValidation-Module Impl ...... SKIPPED
[INFO] Apache DeltaSpike Data-Module ..................... SKIPPED
[INFO] Apache DeltaSpike Data-Module API ................. SKIPPED
[INFO] Apache DeltaSpike Data-Module Impl ................ SKIPPED
[INFO] Apache DeltaSpike Data-Module Tests on Java EE 7 .. SKIPPED
[INFO] Apache DeltaSpike Scheduler-Module ................ SKIPPED
[INFO] Apache DeltaSpike Scheduler-Module API ............ SKIPPED
[INFO] Apache DeltaSpike Scheduler-Module Impl ........... SKIPPED
[INFO] Apache DeltaSpike Test-Control-Module ............. SKIPPED
[INFO] Apache DeltaSpike Test-Control-Module API ......... SKIPPED
[INFO] Apache DeltaSpike Test-Control-Module Impl ........ SKIPPED
[INFO] Apache DeltaSpike Examples ........................ SKIPPED
[INFO] Apache DeltaSpike Java-SE Examples ................ SKIPPED
[INFO] Apache DeltaSpike JSF Examples .................... SKIPPED
[INFO] Apache DeltaSpike JSF Playground .................. SKIPPED
[INFO] Apache DeltaSpike Security Example CDI ............ SKIPPED
[INFO] Apache DeltaSpike Security Example PicketLink ..... SKIPPED
[INFO] Apache DeltaSpike Java-SE Scheduler Examples ...... SKIPPED
[INFO] Apache DeltaSpike Documentation ................... SKIPPED
[INFO] Apache DeltaSpike Site ............................ SKIPPED
[INFO] ------------------------------------------------------------------------
[INFO] BUILD FAILURE
[INFO] ------------------------------------------------------------------------
[INFO] Total time: 2:54.157s
[INFO] Finished at: Thu Mar 31 16:14:48 UTC 2016
[INFO] Final Memory: 64M/521M
[INFO] ------------------------------------------------------------------------
Waiting for Jenkins to finish collecting data
[ERROR] Failed to execute goal org.apache.maven.plugins:maven-dependency-plugin:2.4:unpack
(unpack-context) on project deltaspike-cdictrl-openejb: Unable to find artifact. Could not
find artifact org.apache.deltaspike.cdictrl:deltaspike-cdictrl-owb:jar:1.6.0-SNAPSHOT in Apache
Repository (https://repository.apache.org/content/repositories/releases)
[ERROR] 
[ERROR] Try downloading the file manually from the project website.
[ERROR] 
[ERROR] Then, install it using the command:
[ERROR] mvn install:install-file -DgroupId=org.apache.deltaspike.cdictrl -DartifactId=deltaspike-cdictrl-owb
-Dversion=1.6.0-SNAPSHOT -Dpackaging=jar -Dfile=/path/to/file
[ERROR] 
[ERROR] Alternatively, if you host your own repository you can deploy the file there:
[ERROR] mvn deploy:deploy-file -DgroupId=org.apache.deltaspike.cdictrl -DartifactId=deltaspike-cdictrl-owb
-Dversion=1.6.0-SNAPSHOT -Dpackaging=jar -Dfile=/path/to/file -Durl=[url] -DrepositoryId=[id]
[ERROR] 
[ERROR] 
[ERROR] org.apache.deltaspike.cdictrl:deltaspike-cdictrl-owb:jar:1.6.0-SNAPSHOT
[ERROR] 
[ERROR] from the specified remote repositories:
[ERROR] Apache Repository (https://repository.apache.org/content/repositories/releases, releases=true,
snapshots=true),
[ERROR] Apache Snapshot Repository (https://repository.apache.org/content/repositories/snapshots,
releases=true, snapshots=true),
[ERROR] Nexus (http://repository.apache.org/snapshots, releases=false, snapshots=true),
[ERROR] central (http://repo.maven.apache.org/maven2, releases=true, snapshots=false)
[ERROR] -> [Help 1]
[ERROR] 
[ERROR] To see the full stack trace of the errors, re-run Maven with the -e switch.
[ERROR] Re-run Maven using the -X switch to enable full debug logging.
[ERROR] 
[ERROR] For more information about the errors and possible solutions, please read the following
articles:
[ERROR] [Help 1] http://cwiki.apache.org/confluence/display/MAVEN/MojoExecutionException
[ERROR] 
[ERROR] After correcting the problems, you can resume the build with the command
[ERROR]   mvn <goals> -rf :deltaspike-cdictrl-openejb
[JENKINS] Archiving <https://builds.apache.org/job/DeltaSpike_TomEE_7.0.0-M3/ws/deltaspike/examples/jse-examples/pom.xml>
to org.apache.deltaspike.examples/deltaspike-jse-example/1.6.0-SNAPSHOT/deltaspike-jse-example-1.6.0-SNAPSHOT.pom
[JENKINS] Archiving <https://builds.apache.org/job/DeltaSpike_TomEE_7.0.0-M3/ws/deltaspike/examples/security-requested-page-after-login-cdi/pom.xml>
to org.apache.deltaspike.examples/deltaspike-security-requested-page-after-login-cdi/1.6.0-SNAPSHOT/deltaspike-security-requested-page-after-login-cdi-1.6.0-SNAPSHOT.pom
[JENKINS] Archiving <https://builds.apache.org/job/DeltaSpike_TomEE_7.0.0-M3/ws/deltaspike/test-utils/pom.xml>
to org.apache.deltaspike.test/test-utils/1.6.0-SNAPSHOT/test-utils-1.6.0-SNAPSHOT.pom
[JENKINS] Archiving <https://builds.apache.org/job/DeltaSpike_TomEE_7.0.0-M3/ws/deltaspike/test-utils/target/test-utils-1.6.0-SNAPSHOT.jar>
to org.apache.deltaspike.test/test-utils/1.6.0-SNAPSHOT/test-utils-1.6.0-SNAPSHOT.jar
[JENKINS] Archiving <https://builds.apache.org/job/DeltaSpike_TomEE_7.0.0-M3/ws/deltaspike/test-utils/target/test-utils-1.6.0-SNAPSHOT-sources.jar>
to org.apache.deltaspike.test/test-utils/1.6.0-SNAPSHOT/test-utils-1.6.0-SNAPSHOT-sources.jar
[JENKINS] Archiving <https://builds.apache.org/job/DeltaSpike_TomEE_7.0.0-M3/ws/documentation/pom.xml>
to org.apache.deltaspike/deltaspike-documentation/1.6.0-SNAPSHOT/deltaspike-documentation-1.6.0-SNAPSHOT.pom
[JENKINS] Archiving <https://builds.apache.org/job/DeltaSpike_TomEE_7.0.0-M3/ws/deltaspike/modules/data/impl/pom.xml>
to org.apache.deltaspike.modules/deltaspike-data-module-impl/1.6.0-SNAPSHOT/deltaspike-data-module-impl-1.6.0-SNAPSHOT.pom
[JENKINS] Archiving <https://builds.apache.org/job/DeltaSpike_TomEE_7.0.0-M3/ws/deltaspike/modules/data/api/pom.xml>
to org.apache.deltaspike.modules/deltaspike-data-module-api/1.6.0-SNAPSHOT/deltaspike-data-module-api-1.6.0-SNAPSHOT.pom
[JENKINS] Archiving <https://builds.apache.org/job/DeltaSpike_TomEE_7.0.0-M3/ws/deltaspike/core/impl/pom.xml>
to org.apache.deltaspike.core/deltaspike-core-impl/1.6.0-SNAPSHOT/deltaspike-core-impl-1.6.0-SNAPSHOT.pom
[JENKINS] Archiving <https://builds.apache.org/job/DeltaSpike_TomEE_7.0.0-M3/ws/deltaspike/core/impl/target/deltaspike-core-impl-1.6.0-SNAPSHOT.jar>
to org.apache.deltaspike.core/deltaspike-core-impl/1.6.0-SNAPSHOT/deltaspike-core-impl-1.6.0-SNAPSHOT.jar
[JENKINS] Archiving <https://builds.apache.org/job/DeltaSpike_TomEE_7.0.0-M3/ws/deltaspike/core/impl/target/deltaspike-core-impl-1.6.0-SNAPSHOT-tests.jar>
to org.apache.deltaspike.core/deltaspike-core-impl/1.6.0-SNAPSHOT/deltaspike-core-impl-1.6.0-SNAPSHOT-tests.jar
[JENKINS] Archiving <https://builds.apache.org/job/DeltaSpike_TomEE_7.0.0-M3/ws/deltaspike/core/impl/target/deltaspike-core-impl-1.6.0-SNAPSHOT-sources.jar>
to org.apache.deltaspike.core/deltaspike-core-impl/1.6.0-SNAPSHOT/deltaspike-core-impl-1.6.0-SNAPSHOT-sources.jar
[JENKINS] Archiving <https://builds.apache.org/job/DeltaSpike_TomEE_7.0.0-M3/ws/deltaspike/modules/pom.xml>
to org.apache.deltaspike.modules/modules-project/1.6.0-SNAPSHOT/modules-project-1.6.0-SNAPSHOT.pom
[JENKINS] Archiving <https://builds.apache.org/job/DeltaSpike_TomEE_7.0.0-M3/ws/deltaspike/modules/test-control/pom.xml>
to org.apache.deltaspike.modules/test-control-module-project/1.6.0-SNAPSHOT/test-control-module-project-1.6.0-SNAPSHOT.pom
[JENKINS] Archiving <https://builds.apache.org/job/DeltaSpike_TomEE_7.0.0-M3/ws/deltaspike/examples/jsf-examples/pom.xml>
to org.apache.deltaspike.examples/deltaspike-jsf-example/1.6.0-SNAPSHOT/deltaspike-jsf-example-1.6.0-SNAPSHOT.pom
[JENKINS] Archiving <https://builds.apache.org/job/DeltaSpike_TomEE_7.0.0-M3/ws/deltaspike/cdictrl/api/pom.xml>
to org.apache.deltaspike.cdictrl/deltaspike-cdictrl-api/1.6.0-SNAPSHOT/deltaspike-cdictrl-api-1.6.0-SNAPSHOT.pom
[JENKINS] Archiving <https://builds.apache.org/job/DeltaSpike_TomEE_7.0.0-M3/ws/deltaspike/cdictrl/api/target/deltaspike-cdictrl-api-1.6.0-SNAPSHOT.jar>
to org.apache.deltaspike.cdictrl/deltaspike-cdictrl-api/1.6.0-SNAPSHOT/deltaspike-cdictrl-api-1.6.0-SNAPSHOT.jar
[JENKINS] Archiving <https://builds.apache.org/job/DeltaSpike_TomEE_7.0.0-M3/ws/deltaspike/cdictrl/api/target/deltaspike-cdictrl-api-1.6.0-SNAPSHOT-sources.jar>
to org.apache.deltaspike.cdictrl/deltaspike-cdictrl-api/1.6.0-SNAPSHOT/deltaspike-cdictrl-api-1.6.0-SNAPSHOT-sources.jar
[JENKINS] Archiving <https://builds.apache.org/job/DeltaSpike_TomEE_7.0.0-M3/ws/deltaspike/examples/scheduler-playground/pom.xml>
to org.apache.deltaspike.examples/deltaspike-scheduler-example/1.6.0-SNAPSHOT/deltaspike-scheduler-example-1.6.0-SNAPSHOT.pom
[JENKINS] Archiving <https://builds.apache.org/job/DeltaSpike_TomEE_7.0.0-M3/ws/deltaspike/checkstyle-rules/pom.xml>
to org.apache.deltaspike/checkstyle-rules/1.6.0-SNAPSHOT/checkstyle-rules-1.6.0-SNAPSHOT.pom
[JENKINS] Archiving <https://builds.apache.org/job/DeltaSpike_TomEE_7.0.0-M3/ws/deltaspike/checkstyle-rules/target/checkstyle-rules-1.6.0-SNAPSHOT.jar>
to org.apache.deltaspike/checkstyle-rules/1.6.0-SNAPSHOT/checkstyle-rules-1.6.0-SNAPSHOT.jar
[JENKINS] Archiving <https://builds.apache.org/job/DeltaSpike_TomEE_7.0.0-M3/ws/deltaspike/parent/code/pom.xml>
to org.apache.deltaspike/parent-code/1.6.0-SNAPSHOT/parent-code-1.6.0-SNAPSHOT.pom
[JENKINS] Archiving <https://builds.apache.org/job/DeltaSpike_TomEE_7.0.0-M3/ws/deltaspike/parent/code/target/parent-code-1.6.0-SNAPSHOT-tests.jar>
to org.apache.deltaspike/parent-code/1.6.0-SNAPSHOT/parent-code-1.6.0-SNAPSHOT-tests.jar
Compressed 79.64 KB of artifacts by 40.2% relative to #130
[JENKINS] Archiving <https://builds.apache.org/job/DeltaSpike_TomEE_7.0.0-M3/ws/deltaspike/modules/jsf/impl/pom.xml>
to org.apache.deltaspike.modules/deltaspike-jsf-module-impl/1.6.0-SNAPSHOT/deltaspike-jsf-module-impl-1.6.0-SNAPSHOT.pom
[JENKINS] Archiving <https://builds.apache.org/job/DeltaSpike_TomEE_7.0.0-M3/ws/deltaspike/modules/partial-bean/pom.xml>
to org.apache.deltaspike.modules/partial-bean-module-project/1.6.0-SNAPSHOT/partial-bean-module-project-1.6.0-SNAPSHOT.pom
[JENKINS] Archiving <https://builds.apache.org/job/DeltaSpike_TomEE_7.0.0-M3/ws/deltaspike/examples/pom.xml>
to org.apache.deltaspike.examples/examples-project/1.6.0-SNAPSHOT/examples-project-1.6.0-SNAPSHOT.pom
[JENKINS] Archiving <https://builds.apache.org/job/DeltaSpike_TomEE_7.0.0-M3/ws/deltaspike/cdictrl/impl-openejb/pom.xml>
to org.apache.deltaspike.cdictrl/deltaspike-cdictrl-openejb/1.6.0-SNAPSHOT/deltaspike-cdictrl-openejb-1.6.0-SNAPSHOT.pom
[JENKINS] Archiving <https://builds.apache.org/job/DeltaSpike_TomEE_7.0.0-M3/ws/deltaspike/modules/jsf/pom.xml>
to org.apache.deltaspike.modules/jsf-module-project/1.6.0-SNAPSHOT/jsf-module-project-1.6.0-SNAPSHOT.pom
[JENKINS] Archiving <https://builds.apache.org/job/DeltaSpike_TomEE_7.0.0-M3/ws/deltaspike/cdictrl/tck/pom.xml>
to org.apache.deltaspike.test/deltaspike-cdictrl-tck/1.6.0-SNAPSHOT/deltaspike-cdictrl-tck-1.6.0-SNAPSHOT.pom
[JENKINS] Archiving <https://builds.apache.org/job/DeltaSpike_TomEE_7.0.0-M3/ws/deltaspike/cdictrl/tck/target/deltaspike-cdictrl-tck-1.6.0-SNAPSHOT.jar>
to org.apache.deltaspike.test/deltaspike-cdictrl-tck/1.6.0-SNAPSHOT/deltaspike-cdictrl-tck-1.6.0-SNAPSHOT.jar
[JENKINS] Archiving <https://builds.apache.org/job/DeltaSpike_TomEE_7.0.0-M3/ws/deltaspike/cdictrl/tck/target/deltaspike-cdictrl-tck-1.6.0-SNAPSHOT-sources.jar>
to org.apache.deltaspike.test/deltaspike-cdictrl-tck/1.6.0-SNAPSHOT/deltaspike-cdictrl-tck-1.6.0-SNAPSHOT-sources.jar
[JENKINS] Archiving <https://builds.apache.org/job/DeltaSpike_TomEE_7.0.0-M3/ws/deltaspike/modules/jsf/api/pom.xml>
to org.apache.deltaspike.modules/deltaspike-jsf-module-api/1.6.0-SNAPSHOT/deltaspike-jsf-module-api-1.6.0-SNAPSHOT.pom
[JENKINS] Archiving <https://builds.apache.org/job/DeltaSpike_TomEE_7.0.0-M3/ws/deltaspike/modules/security/pom.xml>
to org.apache.deltaspike.modules/security-module-project/1.6.0-SNAPSHOT/security-module-project-1.6.0-SNAPSHOT.pom
[JENKINS] Archiving <https://builds.apache.org/job/DeltaSpike_TomEE_7.0.0-M3/ws/deltaspike/modules/bean-validation/pom.xml>
to org.apache.deltaspike.modules/bean-validation-module-project/1.6.0-SNAPSHOT/bean-validation-module-project-1.6.0-SNAPSHOT.pom
[JENKINS] Archiving <https://builds.apache.org/job/DeltaSpike_TomEE_7.0.0-M3/ws/deltaspike/modules/partial-bean/impl/pom.xml>
to org.apache.deltaspike.modules/deltaspike-partial-bean-module-impl/1.6.0-SNAPSHOT/deltaspike-partial-bean-module-impl-1.6.0-SNAPSHOT.pom
[JENKINS] Archiving <https://builds.apache.org/job/DeltaSpike_TomEE_7.0.0-M3/ws/deltaspike/modules/proxy/api/pom.xml>
to org.apache.deltaspike.modules/deltaspike-proxy-module-api/1.6.0-SNAPSHOT/deltaspike-proxy-module-api-1.6.0-SNAPSHOT.pom
[JENKINS] Archiving <https://builds.apache.org/job/DeltaSpike_TomEE_7.0.0-M3/ws/deltaspike/modules/jpa/api/pom.xml>
to org.apache.deltaspike.modules/deltaspike-jpa-module-api/1.6.0-SNAPSHOT/deltaspike-jpa-module-api-1.6.0-SNAPSHOT.pom
[JENKINS] Archiving <https://builds.apache.org/job/DeltaSpike_TomEE_7.0.0-M3/ws/deltaspike/modules/servlet/api/pom.xml>
to org.apache.deltaspike.modules/deltaspike-servlet-module-api/1.6.0-SNAPSHOT/deltaspike-servlet-module-api-1.6.0-SNAPSHOT.pom
[JENKINS] Archiving <https://builds.apache.org/job/DeltaSpike_TomEE_7.0.0-M3/ws/deltaspike/modules/jpa/pom.xml>
to org.apache.deltaspike.modules/jpa-module-project/1.6.0-SNAPSHOT/jpa-module-project-1.6.0-SNAPSHOT.pom
[JENKINS] Archiving <https://builds.apache.org/job/DeltaSpike_TomEE_7.0.0-M3/ws/deltaspike/cdictrl/pom.xml>
to org.apache.deltaspike.cdictrl/cdictrl-project/1.6.0-SNAPSHOT/cdictrl-project-1.6.0-SNAPSHOT.pom
[JENKINS] Archiving <https://builds.apache.org/job/DeltaSpike_TomEE_7.0.0-M3/ws/deltaspike/modules/scheduler/api/pom.xml>
to org.apache.deltaspike.modules/deltaspike-scheduler-module-api/1.6.0-SNAPSHOT/deltaspike-scheduler-module-api-1.6.0-SNAPSHOT.pom
[JENKINS] Archiving <https://builds.apache.org/job/DeltaSpike_TomEE_7.0.0-M3/ws/deltaspike/modules/test-control/impl/pom.xml>
to org.apache.deltaspike.modules/deltaspike-test-control-module-impl/1.6.0-SNAPSHOT/deltaspike-test-control-module-impl-1.6.0-SNAPSHOT.pom
[JENKINS] Archiving <https://builds.apache.org/job/DeltaSpike_TomEE_7.0.0-M3/ws/deltaspike/modules/servlet/pom.xml>
to org.apache.deltaspike.modules/servlet-module-project/1.6.0-SNAPSHOT/servlet-module-project-1.6.0-SNAPSHOT.pom
[JENKINS] Archiving <https://builds.apache.org/job/DeltaSpike_TomEE_7.0.0-M3/ws/deltaspike/modules/test-control/api/pom.xml>
to org.apache.deltaspike.modules/deltaspike-test-control-module-api/1.6.0-SNAPSHOT/deltaspike-test-control-module-api-1.6.0-SNAPSHOT.pom
[JENKINS] Archiving <https://builds.apache.org/job/DeltaSpike_TomEE_7.0.0-M3/ws/deltaspike/modules/jsf/impl-ee6/pom.xml>
to org.apache.deltaspike.modules/deltaspike-jsf-module-impl-ee6/1.6.0-SNAPSHOT/deltaspike-jsf-module-impl-ee6-1.6.0-SNAPSHOT.pom
[JENKINS] Archiving <https://builds.apache.org/job/DeltaSpike_TomEE_7.0.0-M3/ws/deltaspike/modules/proxy/pom.xml>
to org.apache.deltaspike.modules/proxy-module-project/1.6.0-SNAPSHOT/proxy-module-project-1.6.0-SNAPSHOT.pom
[JENKINS] Archiving <https://builds.apache.org/job/DeltaSpike_TomEE_7.0.0-M3/ws/deltaspike/modules/partial-bean/api/pom.xml>
to org.apache.deltaspike.modules/deltaspike-partial-bean-module-api/1.6.0-SNAPSHOT/deltaspike-partial-bean-module-api-1.6.0-SNAPSHOT.pom
[JENKINS] Archiving <https://builds.apache.org/job/DeltaSpike_TomEE_7.0.0-M3/ws/deltaspike/modules/scheduler/impl/pom.xml>
to org.apache.deltaspike.modules/deltaspike-scheduler-module-impl/1.6.0-SNAPSHOT/deltaspike-scheduler-module-impl-1.6.0-SNAPSHOT.pom
[JENKINS] Archiving <https://builds.apache.org/job/DeltaSpike_TomEE_7.0.0-M3/ws/deltaspike/parent/pom.xml>
to org.apache.deltaspike/parent/1.6.0-SNAPSHOT/parent-1.6.0-SNAPSHOT.pom
[JENKINS] Archiving <https://builds.apache.org/job/DeltaSpike_TomEE_7.0.0-M3/ws/deltaspike/core/pom.xml>
to org.apache.deltaspike.core/core-project/1.6.0-SNAPSHOT/core-project-1.6.0-SNAPSHOT.pom
[JENKINS] Archiving <https://builds.apache.org/job/DeltaSpike_TomEE_7.0.0-M3/ws/deltaspike/core/target/core-project-1.6.0-SNAPSHOT-tests.jar>
to org.apache.deltaspike.core/core-project/1.6.0-SNAPSHOT/core-project-1.6.0-SNAPSHOT-tests.jar
[JENKINS] Archiving <https://builds.apache.org/job/DeltaSpike_TomEE_7.0.0-M3/ws/deltaspike/modules/bean-validation/api/pom.xml>
to org.apache.deltaspike.modules/deltaspike-bean-validation-module-api/1.6.0-SNAPSHOT/deltaspike-bean-validation-module-api-1.6.0-SNAPSHOT.pom
[JENKINS] Archiving <https://builds.apache.org/job/DeltaSpike_TomEE_7.0.0-M3/ws/deltaspike/core/api/pom.xml>
to org.apache.deltaspike.core/deltaspike-core-api/1.6.0-SNAPSHOT/deltaspike-core-api-1.6.0-SNAPSHOT.pom
[JENKINS] Archiving <https://builds.apache.org/job/DeltaSpike_TomEE_7.0.0-M3/ws/deltaspike/core/api/target/deltaspike-core-api-1.6.0-SNAPSHOT.jar>
to org.apache.deltaspike.core/deltaspike-core-api/1.6.0-SNAPSHOT/deltaspike-core-api-1.6.0-SNAPSHOT.jar
[JENKINS] Archiving <https://builds.apache.org/job/DeltaSpike_TomEE_7.0.0-M3/ws/deltaspike/core/api/target/deltaspike-core-api-1.6.0-SNAPSHOT-tests.jar>
to org.apache.deltaspike.core/deltaspike-core-api/1.6.0-SNAPSHOT/deltaspike-core-api-1.6.0-SNAPSHOT-tests.jar
[JENKINS] Archiving <https://builds.apache.org/job/DeltaSpike_TomEE_7.0.0-M3/ws/deltaspike/core/api/target/deltaspike-core-api-1.6.0-SNAPSHOT-sources.jar>
to org.apache.deltaspike.core/deltaspike-core-api/1.6.0-SNAPSHOT/deltaspike-core-api-1.6.0-SNAPSHOT-sources.jar
[JENKINS] Archiving <https://builds.apache.org/job/DeltaSpike_TomEE_7.0.0-M3/ws/deltaspike/modules/security/impl/pom.xml>
to org.apache.deltaspike.modules/deltaspike-security-module-impl/1.6.0-SNAPSHOT/deltaspike-security-module-impl-1.6.0-SNAPSHOT.pom
[JENKINS] Archiving <https://builds.apache.org/job/DeltaSpike_TomEE_7.0.0-M3/ws/deltaspike/modules/scheduler/pom.xml>
to org.apache.deltaspike.modules/scheduler-module-project/1.6.0-SNAPSHOT/scheduler-module-project-1.6.0-SNAPSHOT.pom
[JENKINS] Archiving <https://builds.apache.org/job/DeltaSpike_TomEE_7.0.0-M3/ws/site/pom.xml>
to org.apache.deltaspike/deltaspike-site/1.6.0-SNAPSHOT/deltaspike-site-1.6.0-SNAPSHOT.pom
[JENKINS] Archiving <https://builds.apache.org/job/DeltaSpike_TomEE_7.0.0-M3/ws/deltaspike/modules/proxy/impl-asm5/pom.xml>
to org.apache.deltaspike.modules/deltaspike-proxy-module-impl-asm5/1.6.0-SNAPSHOT/deltaspike-proxy-module-impl-asm5-1.6.0-SNAPSHOT.pom
[JENKINS] Archiving <https://builds.apache.org/job/DeltaSpike_TomEE_7.0.0-M3/ws/deltaspike/examples/jsf-playground/pom.xml>
to org.apache.deltaspike.examples/deltaspike-jsf-playground/1.6.0-SNAPSHOT/deltaspike-jsf-playground-1.6.0-SNAPSHOT.pom
[JENKINS] Archiving <https://builds.apache.org/job/DeltaSpike_TomEE_7.0.0-M3/ws/deltaspike/modules/servlet/impl/pom.xml>
to org.apache.deltaspike.modules/deltaspike-servlet-module-impl/1.6.0-SNAPSHOT/deltaspike-servlet-module-impl-1.6.0-SNAPSHOT.pom
[JENKINS] Archiving <https://builds.apache.org/job/DeltaSpike_TomEE_7.0.0-M3/ws/deltaspike/modules/bean-validation/impl/pom.xml>
to org.apache.deltaspike.modules/deltaspike-bean-validation-module-impl/1.6.0-SNAPSHOT/deltaspike-bean-validation-module-impl-1.6.0-SNAPSHOT.pom
[JENKINS] Archiving <https://builds.apache.org/job/DeltaSpike_TomEE_7.0.0-M3/ws/deltaspike/modules/data/test-ee7/pom.xml>
to org.apache.deltaspike.modules/deltaspike-data-module-test-ee7/1.6.0-SNAPSHOT/deltaspike-data-module-test-ee7-1.6.0-SNAPSHOT.pom
[JENKINS] Archiving <https://builds.apache.org/job/DeltaSpike_TomEE_7.0.0-M3/ws/pom.xml>
to org.apache.deltaspike/deltaspike/1.6.0-SNAPSHOT/deltaspike-1.6.0-SNAPSHOT.pom
[JENKINS] Archiving <https://builds.apache.org/job/DeltaSpike_TomEE_7.0.0-M3/ws/deltaspike/modules/jpa/impl/pom.xml>
to org.apache.deltaspike.modules/deltaspike-jpa-module-impl/1.6.0-SNAPSHOT/deltaspike-jpa-module-impl-1.6.0-SNAPSHOT.pom
[JENKINS] Archiving <https://builds.apache.org/job/DeltaSpike_TomEE_7.0.0-M3/ws/deltaspike/modules/data/pom.xml>
to org.apache.deltaspike.modules/data-module-project/1.6.0-SNAPSHOT/data-module-project-1.6.0-SNAPSHOT.pom
[JENKINS] Archiving <https://builds.apache.org/job/DeltaSpike_TomEE_7.0.0-M3/ws/deltaspike/examples/security-requested-page-after-login-picketlink/pom.xml>
to org.apache.deltaspike.examples/deltaspike-security-requested-page-after-login-picketlink/1.6.0-SNAPSHOT/deltaspike-security-requested-page-after-login-picketlink-1.6.0-SNAPSHOT.pom
[JENKINS] Archiving <https://builds.apache.org/job/DeltaSpike_TomEE_7.0.0-M3/ws/deltaspike/pom.xml>
to org.apache.deltaspike/deltaspike-project/1.6.0-SNAPSHOT/deltaspike-project-1.6.0-SNAPSHOT.pom
[JENKINS] Archiving <https://builds.apache.org/job/DeltaSpike_TomEE_7.0.0-M3/ws/deltaspike/modules/security/api/pom.xml>
to org.apache.deltaspike.modules/deltaspike-security-module-api/1.6.0-SNAPSHOT/deltaspike-security-module-api-1.6.0-SNAPSHOT.pom
Sending e-mails to: commits@deltaspike.apache.org
channel stopped

Mime
View raw message