deltaspike-commits mailing list archives

Site index · List index
Message view « Date » · « Thread »
Top « Date » · « Thread »
From Apache Jenkins Server <jenk...@builds.apache.org>
Subject Build failed in Jenkins: DeltaSpike Deploy #1354
Date Sun, 21 Feb 2016 21:25:43 GMT
See <https://builds.apache.org/job/DeltaSpike%20Deploy/1354/changes>

Changes:

[gpetracek] DELTASPIKE-1081 support for configurable cron-expressions

------------------------------------------
[...truncated 833 lines...]
[INFO] Surefire report directory: <https://builds.apache.org/job/DeltaSpike%20Deploy/ws/deltaspike/core/impl/target/surefire-reports>
[INFO] Using configured provider org.apache.maven.surefire.junitcore.JUnitCoreProvider

-------------------------------------------------------
 T E S T S
-------------------------------------------------------
Concurrency config is parallel='none', perCoreThreadCount=true, threadCount=2, useUnlimitedThreads=false
Feb 21, 2016 9:23:45 PM org.apache.deltaspike.test.utils.ShrinkWrapArchiveUtil getArchives
INFO: Test org.apache.deltaspike.test.core.api.exclude.ExcludeWarFileTest Adding Java ClassPath
URL as JavaArchive <https://builds.apache.org/job/DeltaSpike%20Deploy/ws/deltaspike/core/impl/target/classes/META-INF/beans.xml>
Feb 21, 2016 9:23:45 PM org.apache.deltaspike.test.utils.ShrinkWrapArchiveUtil getArchives
INFO: Test org.apache.deltaspike.test.core.api.exclude.ExcludeWarFileTest Adding Java ClassPath
URL as JavaArchive jar:<https://builds.apache.org/job/DeltaSpike%20Deploy/ws/deltaspike/core/api/target/deltaspike-core-api-1.5.5-SNAPSHOT.jar!/META-INF/beans.xml>
Feb 21, 2016 9:23:45 PM org.apache.webbeans.lifecycle.AbstractLifeCycle bootstrapApplication
INFO: OpenWebBeans Container is starting...
Feb 21, 2016 9:23:46 PM org.apache.deltaspike.core.impl.config.EnvironmentPropertyConfigSourceProvider
<init>
INFO: Custom config found by DeltaSpike. Name: 'META-INF/apache-deltaspike.properties', URL:
'<https://builds.apache.org/job/DeltaSpike%20Deploy/ws/deltaspike/core/impl/target/test-classes/META-INF/apache-deltaspike.properties'>
Feb 21, 2016 9:23:46 PM org.apache.deltaspike.core.impl.config.EnvironmentPropertyConfigSourceProvider
<init>
INFO: Custom config found by DeltaSpike. Name: 'myboottimeconfig.properties', URL: '<https://builds.apache.org/job/DeltaSpike%20Deploy/ws/deltaspike/core/impl/target/test-classes/myboottimeconfig.properties'>
Feb 21, 2016 9:23:46 PM org.apache.deltaspike.core.util.ProjectStageProducer initProjectStage
INFO: Computed the following DeltaSpike ProjectStage: Production
Feb 21, 2016 9:23:46 PM org.apache.webbeans.config.BeansDeployer validateInjectionPoints
INFO: All injection points were validated successfully.
Feb 21, 2016 9:23:46 PM org.apache.webbeans.lifecycle.AbstractLifeCycle bootstrapApplication
INFO: OpenWebBeans Container has started, it took [892] ms.
Feb 21, 2016 9:23:47 PM org.apache.deltaspike.test.utils.ShrinkWrapArchiveUtil getArchives
INFO: Test org.apache.deltaspike.test.core.api.exclude.uc001.EntityExcludeTest Adding Java
ClassPath URL as JavaArchive <https://builds.apache.org/job/DeltaSpike%20Deploy/ws/deltaspike/core/impl/target/classes/META-INF/beans.xml>
Feb 21, 2016 9:23:47 PM org.apache.deltaspike.test.utils.ShrinkWrapArchiveUtil getArchives
INFO: Test org.apache.deltaspike.test.core.api.exclude.uc001.EntityExcludeTest Adding Java
ClassPath URL as JavaArchive jar:<https://builds.apache.org/job/DeltaSpike%20Deploy/ws/deltaspike/core/api/target/deltaspike-core-api-1.5.5-SNAPSHOT.jar!/META-INF/beans.xml>
Feb 21, 2016 9:23:47 PM org.apache.webbeans.lifecycle.AbstractLifeCycle bootstrapApplication
INFO: OpenWebBeans Container is starting...
Feb 21, 2016 9:23:47 PM org.apache.deltaspike.core.impl.config.EnvironmentPropertyConfigSourceProvider
<init>
INFO: Custom config found by DeltaSpike. Name: 'META-INF/apache-deltaspike.properties', URL:
'<https://builds.apache.org/job/DeltaSpike%20Deploy/ws/deltaspike/core/impl/target/test-classes/META-INF/apache-deltaspike.properties'>
Feb 21, 2016 9:23:47 PM org.apache.deltaspike.core.impl.config.EnvironmentPropertyConfigSourceProvider
<init>
INFO: Custom config found by DeltaSpike. Name: 'myboottimeconfig.properties', URL: '<https://builds.apache.org/job/DeltaSpike%20Deploy/ws/deltaspike/core/impl/target/test-classes/myboottimeconfig.properties'>
Feb 21, 2016 9:23:47 PM org.apache.deltaspike.core.util.ProjectStageProducer initProjectStage
INFO: Computed the following DeltaSpike ProjectStage: Development
Feb 21, 2016 9:23:47 PM org.apache.webbeans.config.BeansDeployer validateInjectionPoints
INFO: All injection points were validated successfully.
Feb 21, 2016 9:23:47 PM org.apache.webbeans.lifecycle.AbstractLifeCycle bootstrapApplication
INFO: OpenWebBeans Container has started, it took [194] ms.
Running org.apache.deltaspike.test.core.api.exclude.ExcludeWarFileTest
Tests run: 7, Failures: 0, Errors: 0, Skipped: 0, Time elapsed: 0.093 sec
Running org.apache.deltaspike.test.core.api.exclude.uc001.EntityExcludeTest
Tests run: 3, Failures: 0, Errors: 0, Skipped: 0, Time elapsed: 0.026 sec
Running org.apache.deltaspike.test.core.api.projectstage.ProjectStageTest
Tests run: 1, Failures: 0, Errors: 0, Skipped: 0, Time elapsed: 0 sec
Feb 21, 2016 9:23:47 PM org.apache.deltaspike.test.utils.ShrinkWrapArchiveUtil getArchives
INFO: Test org.apache.deltaspike.test.core.api.config.injectable.InjectableConfigPropertyTest
Adding Java ClassPath URL as JavaArchive <https://builds.apache.org/job/DeltaSpike%20Deploy/ws/deltaspike/core/impl/target/classes/META-INF/beans.xml>
Feb 21, 2016 9:23:47 PM org.apache.deltaspike.test.utils.ShrinkWrapArchiveUtil getArchives
INFO: Test org.apache.deltaspike.test.core.api.config.injectable.InjectableConfigPropertyTest
Adding Java ClassPath URL as JavaArchive jar:<https://builds.apache.org/job/DeltaSpike%20Deploy/ws/deltaspike/core/api/target/deltaspike-core-api-1.5.5-SNAPSHOT.jar!/META-INF/beans.xml>
Feb 21, 2016 9:23:47 PM org.apache.webbeans.lifecycle.AbstractLifeCycle bootstrapApplication
INFO: OpenWebBeans Container is starting...
Feb 21, 2016 9:23:47 PM org.apache.deltaspike.core.impl.config.EnvironmentPropertyConfigSourceProvider
<init>
INFO: Custom config found by DeltaSpike. Name: 'META-INF/apache-deltaspike.properties', URL:
'<https://builds.apache.org/job/DeltaSpike%20Deploy/ws/deltaspike/core/impl/target/test-classes/META-INF/apache-deltaspike.properties'>
Feb 21, 2016 9:23:47 PM org.apache.deltaspike.core.impl.config.EnvironmentPropertyConfigSourceProvider
<init>
INFO: Custom config found by DeltaSpike. Name: 'myboottimeconfig.properties', URL: '<https://builds.apache.org/job/DeltaSpike%20Deploy/ws/deltaspike/core/impl/target/test-classes/myboottimeconfig.properties'>
Feb 21, 2016 9:23:47 PM org.apache.webbeans.config.BeansDeployer validateInjectionPoints
INFO: All injection points were validated successfully.
Feb 21, 2016 9:23:47 PM org.apache.webbeans.lifecycle.AbstractLifeCycle bootstrapApplication
INFO: OpenWebBeans Container has started, it took [267] ms.
Running org.apache.deltaspike.test.core.api.projectstage.ProjectStageProducerTest
Feb 21, 2016 9:23:47 PM org.apache.deltaspike.core.impl.config.EnvironmentPropertyConfigSourceProvider
<init>
INFO: Custom config found by DeltaSpike. Name: 'META-INF/apache-deltaspike.properties', URL:
'<https://builds.apache.org/job/DeltaSpike%20Deploy/ws/deltaspike/core/impl/target/test-classes/META-INF/apache-deltaspike.properties'>
Feb 21, 2016 9:23:47 PM org.apache.deltaspike.core.impl.config.EnvironmentPropertyConfigSourceProvider
<init>
INFO: Custom config found by DeltaSpike. Name: 'myboottimeconfig.properties', URL: '<https://builds.apache.org/job/DeltaSpike%20Deploy/ws/deltaspike/core/impl/target/test-classes/myboottimeconfig.properties'>
Feb 21, 2016 9:23:47 PM org.apache.deltaspike.core.util.ProjectStageProducer initProjectStage
INFO: Computed the following DeltaSpike ProjectStage: SystemTest
Feb 21, 2016 9:23:47 PM org.apache.deltaspike.core.util.ProjectStageProducer initProjectStage
INFO: Computed the following DeltaSpike ProjectStage: IntegrationTest
Feb 21, 2016 9:23:47 PM org.apache.deltaspike.core.util.ProjectStageProducer initProjectStage
INFO: Computed the following DeltaSpike ProjectStage: SystemTest
Feb 21, 2016 9:23:47 PM org.apache.deltaspike.core.util.ProjectStageProducer initProjectStage
INFO: Computed the following DeltaSpike ProjectStage: IntegrationTest
Feb 21, 2016 9:23:47 PM org.apache.deltaspike.core.util.ProjectStageProducer initProjectStage
INFO: Computed the following DeltaSpike ProjectStage: SystemTest
Feb 21, 2016 9:23:47 PM org.apache.deltaspike.core.util.ProjectStageProducer initProjectStage
INFO: Computed the following DeltaSpike ProjectStage: IntegrationTest
Tests run: 1, Failures: 0, Errors: 0, Skipped: 0, Time elapsed: 0.01 sec
Java HotSpot(TM) 64-Bit Server VM warning: INFO: os::commit_memory(0x00000007df000000, 139460608,
0) failed; error='Cannot allocate memory' (errno=12)
#
# There is insufficient memory for the Java Runtime Environment to continue.
# Native memory allocation (malloc) failed to allocate 139460608 bytes for committing reserved
memory.
# An error report file with more information is saved as:
# <https://builds.apache.org/job/DeltaSpike%20Deploy/ws/deltaspike/core/impl/hs_err_pid29989.log>

Results :

Tests run: 12, Failures: 0, Errors: 0, Skipped: 0

[JENKINS] Recording test results
[INFO] ------------------------------------------------------------------------
[INFO] Reactor Summary:
[INFO] 
[INFO] Apache DeltaSpike ................................. SUCCESS [17.839s]
[INFO] Apache DeltaSpike Sources ......................... SUCCESS [12.605s]
[INFO] Apache DeltaSpike CheckStyle-rules ................ SUCCESS [10.038s]
[INFO] Apache DeltaSpike Parent .......................... SUCCESS [22.067s]
[INFO] Apache DeltaSpike Test-Utils ...................... SUCCESS [18.317s]
[INFO] Apache DeltaSpike Code Parent ..................... SUCCESS [11.979s]
[INFO] Apache DeltaSpike Core ............................ SUCCESS [10.113s]
[INFO] Apache DeltaSpike Core-API ........................ SUCCESS [1:03.324s]
[INFO] Apache DeltaSpike Core-Implementation ............. FAILURE [11.098s]
[INFO] Apache DeltaSpike ContainerControl parent ......... SKIPPED
[INFO] Apache DeltaSpike CDI ContainerControl API ........ SKIPPED
[INFO] Apache DeltaSpike CDI ContainerControl TCK ........ SKIPPED
[INFO] Apache DeltaSpike CDI OWB-ContainerControl ........ SKIPPED
[INFO] Apache DeltaSpike CDI Weld-ContainerControl ....... SKIPPED
[INFO] Apache DeltaSpike CDI OpenEJB-ContainerControl .... SKIPPED
[INFO] Apache DeltaSpike CDI Servlet-ContainerControl .... SKIPPED
[INFO] Apache DeltaSpike Modules ......................... SKIPPED
[INFO] Apache DeltaSpike Proxy-Module .................... SKIPPED
[INFO] Apache DeltaSpike Proxy-Module API ................ SKIPPED
[INFO] Apache DeltaSpike Proxy-Module Impl ASM5 .......... SKIPPED
[INFO] Apache DeltaSpike Security-Module ................. SKIPPED
[INFO] Apache DeltaSpike Security-Module API ............. SKIPPED
[INFO] Apache DeltaSpike Security-Module Impl ............ SKIPPED
[INFO] Apache DeltaSpike JPA-Module ...................... SKIPPED
[INFO] Apache DeltaSpike JPA-Module API .................. SKIPPED
[INFO] Apache DeltaSpike JPA-Module Impl ................. SKIPPED
[INFO] Apache DeltaSpike Servlet-Module .................. SKIPPED
[INFO] Apache DeltaSpike Servlet-Module API .............. SKIPPED
[INFO] Apache DeltaSpike Servlet-Module Impl ............. SKIPPED
[INFO] Apache DeltaSpike JSF-Module ...................... SKIPPED
[INFO] Apache DeltaSpike JSF-Module API .................. SKIPPED
[INFO] Apache DeltaSpike JSF-Module Impl ................. SKIPPED
[INFO] Apache DeltaSpike JSF-Module Impl (EE6 only) ...... SKIPPED
[INFO] Apache DeltaSpike Partial-Bean-Module ............. SKIPPED
[INFO] Apache DeltaSpike Partial-Bean-Module API ......... SKIPPED
[INFO] Apache DeltaSpike Partial-Bean-Module Impl ........ SKIPPED
[INFO] Apache DeltaSpike BeanValidation-Module ........... SKIPPED
[INFO] Apache DeltaSpike BeanValidation-Module API ....... SKIPPED
[INFO] Apache DeltaSpike BeanValidation-Module Impl ...... SKIPPED
[INFO] Apache DeltaSpike Data-Module ..................... SKIPPED
[INFO] Apache DeltaSpike Data-Module API ................. SKIPPED
[INFO] Apache DeltaSpike Data-Module Impl ................ SKIPPED
[INFO] Apache DeltaSpike Data-Module Tests on Java EE 7 .. SKIPPED
[INFO] Apache DeltaSpike Scheduler-Module ................ SKIPPED
[INFO] Apache DeltaSpike Scheduler-Module API ............ SKIPPED
[INFO] Apache DeltaSpike Scheduler-Module Impl ........... SKIPPED
[INFO] Apache DeltaSpike Test-Control-Module ............. SKIPPED
[INFO] Apache DeltaSpike Test-Control-Module API ......... SKIPPED
[INFO] Apache DeltaSpike Test-Control-Module Impl ........ SKIPPED
[INFO] Apache DeltaSpike Examples ........................ SKIPPED
[INFO] Apache DeltaSpike Java-SE Examples ................ SKIPPED
[INFO] Apache DeltaSpike JSF Examples .................... SKIPPED
[INFO] Apache DeltaSpike JSF Playground .................. SKIPPED
[INFO] Apache DeltaSpike Security Example CDI ............ SKIPPED
[INFO] Apache DeltaSpike Security Example PicketLink ..... SKIPPED
[INFO] Apache DeltaSpike Java-SE Scheduler Examples ...... SKIPPED
[INFO] Apache DeltaSpike Distribution .................... SKIPPED
[INFO] Apache DeltaSpike Distribution Bill of Materials .. SKIPPED
[INFO] Apache DeltaSpike Full Distribution ............... SKIPPED
[INFO] Apache DeltaSpike Documentation ................... SKIPPED
[INFO] Apache DeltaSpike Site ............................ SKIPPED
[INFO] ------------------------------------------------------------------------
[INFO] BUILD FAILURE
[INFO] ------------------------------------------------------------------------
[INFO] Total time: 3:12.975s
[INFO] Finished at: Sun Feb 21 21:23:50 UTC 2016
[INFO] Final Memory: 65M/626M
[INFO] ------------------------------------------------------------------------
Waiting for Jenkins to finish collecting data
[ERROR] Failed to execute goal org.apache.maven.plugins:maven-surefire-plugin:2.11:test (default-test)
on project deltaspike-core-impl: Error occured in starting fork, check output in log ->
[Help 1]
[ERROR] 
[ERROR] To see the full stack trace of the errors, re-run Maven with the -e switch.
[ERROR] Re-run Maven using the -X switch to enable full debug logging.
[ERROR] 
[ERROR] For more information about the errors and possible solutions, please read the following
articles:
[ERROR] [Help 1] http://cwiki.apache.org/confluence/display/MAVEN/MojoExecutionException
[ERROR] 
[ERROR] After correcting the problems, you can resume the build with the command
[ERROR]   mvn <goals> -rf :deltaspike-core-impl
[JENKINS] Archiving <https://builds.apache.org/job/DeltaSpike%20Deploy/ws/deltaspike/examples/jse-examples/pom.xml>
to org.apache.deltaspike.examples/deltaspike-jse-example/1.5.5-SNAPSHOT/deltaspike-jse-example-1.5.5-SNAPSHOT.pom
[JENKINS] Archiving <https://builds.apache.org/job/DeltaSpike%20Deploy/ws/deltaspike/examples/security-requested-page-after-login-cdi/pom.xml>
to org.apache.deltaspike.examples/deltaspike-security-requested-page-after-login-cdi/1.5.5-SNAPSHOT/deltaspike-security-requested-page-after-login-cdi-1.5.5-SNAPSHOT.pom
[JENKINS] Archiving <https://builds.apache.org/job/DeltaSpike%20Deploy/ws/deltaspike/test-utils/pom.xml>
to org.apache.deltaspike.test/test-utils/1.5.5-SNAPSHOT/test-utils-1.5.5-SNAPSHOT.pom
[JENKINS] Archiving <https://builds.apache.org/job/DeltaSpike%20Deploy/ws/deltaspike/test-utils/target/test-utils-1.5.5-SNAPSHOT.jar>
to org.apache.deltaspike.test/test-utils/1.5.5-20160221.212200-2/test-utils-1.5.5-20160221.212200-2.jar
[JENKINS] Archiving <https://builds.apache.org/job/DeltaSpike%20Deploy/ws/deltaspike/test-utils/target/test-utils-1.5.5-SNAPSHOT-sources.jar>
to org.apache.deltaspike.test/test-utils/1.5.5-20160221.212200-2/test-utils-1.5.5-20160221.212200-2-sources.jar
No artifacts from DeltaSpike Deploy » Apache DeltaSpike Test-Utils #1353 to compare, so performing
full copy of artifacts
[JENKINS] Archiving <https://builds.apache.org/job/DeltaSpike%20Deploy/ws/documentation/pom.xml>
to org.apache.deltaspike/deltaspike-documentation/1.5.5-SNAPSHOT/deltaspike-documentation-1.5.5-SNAPSHOT.pom
[JENKINS] Archiving <https://builds.apache.org/job/DeltaSpike%20Deploy/ws/deltaspike/modules/data/impl/pom.xml>
to org.apache.deltaspike.modules/deltaspike-data-module-impl/1.5.5-SNAPSHOT/deltaspike-data-module-impl-1.5.5-SNAPSHOT.pom
[JENKINS] Archiving <https://builds.apache.org/job/DeltaSpike%20Deploy/ws/deltaspike/modules/data/api/pom.xml>
to org.apache.deltaspike.modules/deltaspike-data-module-api/1.5.5-SNAPSHOT/deltaspike-data-module-api-1.5.5-SNAPSHOT.pom
[JENKINS] Archiving <https://builds.apache.org/job/DeltaSpike%20Deploy/ws/deltaspike/core/impl/pom.xml>
to org.apache.deltaspike.core/deltaspike-core-impl/1.5.5-SNAPSHOT/deltaspike-core-impl-1.5.5-SNAPSHOT.pom
[JENKINS] Archiving <https://builds.apache.org/job/DeltaSpike%20Deploy/ws/deltaspike/modules/pom.xml>
to org.apache.deltaspike.modules/modules-project/1.5.5-SNAPSHOT/modules-project-1.5.5-SNAPSHOT.pom
[JENKINS] Archiving <https://builds.apache.org/job/DeltaSpike%20Deploy/ws/deltaspike/modules/test-control/pom.xml>
to org.apache.deltaspike.modules/test-control-module-project/1.5.5-SNAPSHOT/test-control-module-project-1.5.5-SNAPSHOT.pom
[JENKINS] Archiving <https://builds.apache.org/job/DeltaSpike%20Deploy/ws/deltaspike/examples/jsf-examples/pom.xml>
to org.apache.deltaspike.examples/deltaspike-jsf-example/1.5.5-SNAPSHOT/deltaspike-jsf-example-1.5.5-SNAPSHOT.pom
[JENKINS] Archiving <https://builds.apache.org/job/DeltaSpike%20Deploy/ws/deltaspike/cdictrl/servlet/pom.xml>
to org.apache.deltaspike.cdictrl/deltaspike-cdictrl-servlet/1.5.5-SNAPSHOT/deltaspike-cdictrl-servlet-1.5.5-SNAPSHOT.pom
[JENKINS] Archiving <https://builds.apache.org/job/DeltaSpike%20Deploy/ws/deltaspike/cdictrl/api/pom.xml>
to org.apache.deltaspike.cdictrl/deltaspike-cdictrl-api/1.5.5-SNAPSHOT/deltaspike-cdictrl-api-1.5.5-SNAPSHOT.pom
[JENKINS] Archiving <https://builds.apache.org/job/DeltaSpike%20Deploy/ws/deltaspike/examples/scheduler-playground/pom.xml>
to org.apache.deltaspike.examples/deltaspike-scheduler-example/1.5.5-SNAPSHOT/deltaspike-scheduler-example-1.5.5-SNAPSHOT.pom
[JENKINS] Archiving <https://builds.apache.org/job/DeltaSpike%20Deploy/ws/deltaspike/checkstyle-rules/pom.xml>
to org.apache.deltaspike/checkstyle-rules/1.5.5-SNAPSHOT/checkstyle-rules-1.5.5-SNAPSHOT.pom
[JENKINS] Archiving <https://builds.apache.org/job/DeltaSpike%20Deploy/ws/deltaspike/checkstyle-rules/target/checkstyle-rules-1.5.5-SNAPSHOT.jar>
to org.apache.deltaspike/checkstyle-rules/1.5.5-20160221.212120-2/checkstyle-rules-1.5.5-20160221.212120-2.jar
[JENKINS] Archiving <https://builds.apache.org/job/DeltaSpike%20Deploy/ws/deltaspike/checkstyle-rules/target/checkstyle-rules-1.5.5-SNAPSHOT-sources.jar>
to org.apache.deltaspike/checkstyle-rules/1.5.5-20160221.212120-2/checkstyle-rules-1.5.5-20160221.212120-2-sources.jar
No artifacts from DeltaSpike Deploy » Apache DeltaSpike CheckStyle-rules #1353 to compare,
so performing full copy of artifacts
[JENKINS] Archiving <https://builds.apache.org/job/DeltaSpike%20Deploy/ws/deltaspike/parent/code/pom.xml>
to org.apache.deltaspike/parent-code/1.5.5-SNAPSHOT/parent-code-1.5.5-SNAPSHOT.pom
[JENKINS] Archiving <https://builds.apache.org/job/DeltaSpike%20Deploy/ws/deltaspike/parent/code/target/parent-code-1.5.5-SNAPSHOT-tests.jar>
to org.apache.deltaspike/parent-code/1.5.5-20160221.212213-2/parent-code-1.5.5-20160221.212213-2-tests.jar
No artifacts from DeltaSpike Deploy » Apache DeltaSpike Code Parent #1353 to compare, so
performing full copy of artifacts
[JENKINS] Archiving <https://builds.apache.org/job/DeltaSpike%20Deploy/ws/deltaspike/modules/jsf/impl/pom.xml>
to org.apache.deltaspike.modules/deltaspike-jsf-module-impl/1.5.5-SNAPSHOT/deltaspike-jsf-module-impl-1.5.5-SNAPSHOT.pom
[JENKINS] Archiving <https://builds.apache.org/job/DeltaSpike%20Deploy/ws/deltaspike/modules/partial-bean/pom.xml>
to org.apache.deltaspike.modules/partial-bean-module-project/1.5.5-SNAPSHOT/partial-bean-module-project-1.5.5-SNAPSHOT.pom
[JENKINS] Archiving <https://builds.apache.org/job/DeltaSpike%20Deploy/ws/deltaspike/examples/pom.xml>
to org.apache.deltaspike.examples/examples-project/1.5.5-SNAPSHOT/examples-project-1.5.5-SNAPSHOT.pom
[JENKINS] Archiving <https://builds.apache.org/job/DeltaSpike%20Deploy/ws/deltaspike/cdictrl/impl-openejb/pom.xml>
to org.apache.deltaspike.cdictrl/deltaspike-cdictrl-openejb/1.5.5-SNAPSHOT/deltaspike-cdictrl-openejb-1.5.5-SNAPSHOT.pom
[JENKINS] Archiving <https://builds.apache.org/job/DeltaSpike%20Deploy/ws/deltaspike/modules/jsf/pom.xml>
to org.apache.deltaspike.modules/jsf-module-project/1.5.5-SNAPSHOT/jsf-module-project-1.5.5-SNAPSHOT.pom
[JENKINS] Archiving <https://builds.apache.org/job/DeltaSpike%20Deploy/ws/deltaspike/cdictrl/tck/pom.xml>
to org.apache.deltaspike.test/deltaspike-cdictrl-tck/1.5.5-SNAPSHOT/deltaspike-cdictrl-tck-1.5.5-SNAPSHOT.pom
[JENKINS] Archiving <https://builds.apache.org/job/DeltaSpike%20Deploy/ws/deltaspike/modules/jsf/api/pom.xml>
to org.apache.deltaspike.modules/deltaspike-jsf-module-api/1.5.5-SNAPSHOT/deltaspike-jsf-module-api-1.5.5-SNAPSHOT.pom
[JENKINS] Archiving <https://builds.apache.org/job/DeltaSpike%20Deploy/ws/deltaspike/modules/security/pom.xml>
to org.apache.deltaspike.modules/security-module-project/1.5.5-SNAPSHOT/security-module-project-1.5.5-SNAPSHOT.pom
[JENKINS] Archiving <https://builds.apache.org/job/DeltaSpike%20Deploy/ws/deltaspike/modules/bean-validation/pom.xml>
to org.apache.deltaspike.modules/bean-validation-module-project/1.5.5-SNAPSHOT/bean-validation-module-project-1.5.5-SNAPSHOT.pom
[JENKINS] Archiving <https://builds.apache.org/job/DeltaSpike%20Deploy/ws/deltaspike/modules/partial-bean/impl/pom.xml>
to org.apache.deltaspike.modules/deltaspike-partial-bean-module-impl/1.5.5-SNAPSHOT/deltaspike-partial-bean-module-impl-1.5.5-SNAPSHOT.pom
[JENKINS] Archiving <https://builds.apache.org/job/DeltaSpike%20Deploy/ws/deltaspike/modules/proxy/api/pom.xml>
to org.apache.deltaspike.modules/deltaspike-proxy-module-api/1.5.5-SNAPSHOT/deltaspike-proxy-module-api-1.5.5-SNAPSHOT.pom
[JENKINS] Archiving <https://builds.apache.org/job/DeltaSpike%20Deploy/ws/deltaspike/cdictrl/impl-weld/pom.xml>
to org.apache.deltaspike.cdictrl/deltaspike-cdictrl-weld/1.5.5-SNAPSHOT/deltaspike-cdictrl-weld-1.5.5-SNAPSHOT.pom
[JENKINS] Archiving <https://builds.apache.org/job/DeltaSpike%20Deploy/ws/deltaspike/modules/jpa/api/pom.xml>
to org.apache.deltaspike.modules/deltaspike-jpa-module-api/1.5.5-SNAPSHOT/deltaspike-jpa-module-api-1.5.5-SNAPSHOT.pom
[JENKINS] Archiving <https://builds.apache.org/job/DeltaSpike%20Deploy/ws/deltaspike/dist/full/pom.xml>
to org.apache.deltaspike.distribution/distribution-full/1.5.5-SNAPSHOT/distribution-full-1.5.5-SNAPSHOT.pom
[JENKINS] Archiving <https://builds.apache.org/job/DeltaSpike%20Deploy/ws/deltaspike/modules/servlet/api/pom.xml>
to org.apache.deltaspike.modules/deltaspike-servlet-module-api/1.5.5-SNAPSHOT/deltaspike-servlet-module-api-1.5.5-SNAPSHOT.pom
[JENKINS] Archiving <https://builds.apache.org/job/DeltaSpike%20Deploy/ws/deltaspike/modules/jpa/pom.xml>
to org.apache.deltaspike.modules/jpa-module-project/1.5.5-SNAPSHOT/jpa-module-project-1.5.5-SNAPSHOT.pom
[JENKINS] Archiving <https://builds.apache.org/job/DeltaSpike%20Deploy/ws/deltaspike/cdictrl/pom.xml>
to org.apache.deltaspike.cdictrl/cdictrl-project/1.5.5-SNAPSHOT/cdictrl-project-1.5.5-SNAPSHOT.pom
[JENKINS] Archiving <https://builds.apache.org/job/DeltaSpike%20Deploy/ws/deltaspike/modules/scheduler/api/pom.xml>
to org.apache.deltaspike.modules/deltaspike-scheduler-module-api/1.5.5-SNAPSHOT/deltaspike-scheduler-module-api-1.5.5-SNAPSHOT.pom
[JENKINS] Archiving <https://builds.apache.org/job/DeltaSpike%20Deploy/ws/deltaspike/modules/test-control/impl/pom.xml>
to org.apache.deltaspike.modules/deltaspike-test-control-module-impl/1.5.5-SNAPSHOT/deltaspike-test-control-module-impl-1.5.5-SNAPSHOT.pom
[JENKINS] Archiving <https://builds.apache.org/job/DeltaSpike%20Deploy/ws/deltaspike/dist/bom/pom.xml>
to org.apache.deltaspike.distribution/distributions-bom/1.5.5-SNAPSHOT/distributions-bom-1.5.5-SNAPSHOT.pom
[JENKINS] Archiving <https://builds.apache.org/job/DeltaSpike%20Deploy/ws/deltaspike/modules/servlet/pom.xml>
to org.apache.deltaspike.modules/servlet-module-project/1.5.5-SNAPSHOT/servlet-module-project-1.5.5-SNAPSHOT.pom
[JENKINS] Archiving <https://builds.apache.org/job/DeltaSpike%20Deploy/ws/deltaspike/modules/test-control/api/pom.xml>
to org.apache.deltaspike.modules/deltaspike-test-control-module-api/1.5.5-SNAPSHOT/deltaspike-test-control-module-api-1.5.5-SNAPSHOT.pom
[JENKINS] Archiving <https://builds.apache.org/job/DeltaSpike%20Deploy/ws/deltaspike/modules/jsf/impl-ee6/pom.xml>
to org.apache.deltaspike.modules/deltaspike-jsf-module-impl-ee6/1.5.5-SNAPSHOT/deltaspike-jsf-module-impl-ee6-1.5.5-SNAPSHOT.pom
[JENKINS] Archiving <https://builds.apache.org/job/DeltaSpike%20Deploy/ws/deltaspike/modules/proxy/pom.xml>
to org.apache.deltaspike.modules/proxy-module-project/1.5.5-SNAPSHOT/proxy-module-project-1.5.5-SNAPSHOT.pom
[JENKINS] Archiving <https://builds.apache.org/job/DeltaSpike%20Deploy/ws/deltaspike/dist/pom.xml>
to org.apache.deltaspike.distribution/distributions-project/1.5.5-SNAPSHOT/distributions-project-1.5.5-SNAPSHOT.pom
[JENKINS] Archiving <https://builds.apache.org/job/DeltaSpike%20Deploy/ws/deltaspike/modules/partial-bean/api/pom.xml>
to org.apache.deltaspike.modules/deltaspike-partial-bean-module-api/1.5.5-SNAPSHOT/deltaspike-partial-bean-module-api-1.5.5-SNAPSHOT.pom
[JENKINS] Archiving <https://builds.apache.org/job/DeltaSpike%20Deploy/ws/deltaspike/modules/scheduler/impl/pom.xml>
to org.apache.deltaspike.modules/deltaspike-scheduler-module-impl/1.5.5-SNAPSHOT/deltaspike-scheduler-module-impl-1.5.5-SNAPSHOT.pom
[JENKINS] Archiving <https://builds.apache.org/job/DeltaSpike%20Deploy/ws/deltaspike/parent/pom.xml>
to org.apache.deltaspike/parent/1.5.5-SNAPSHOT/parent-1.5.5-SNAPSHOT.pom
No artifacts from DeltaSpike Deploy » Apache DeltaSpike Parent #1353 to compare, so performing
full copy of artifacts
[JENKINS] Archiving <https://builds.apache.org/job/DeltaSpike%20Deploy/ws/deltaspike/core/pom.xml>
to org.apache.deltaspike.core/core-project/1.5.5-SNAPSHOT/core-project-1.5.5-SNAPSHOT.pom
[JENKINS] Archiving <https://builds.apache.org/job/DeltaSpike%20Deploy/ws/deltaspike/core/target/core-project-1.5.5-SNAPSHOT-tests.jar>
to org.apache.deltaspike.core/core-project/1.5.5-20160221.212226-1/core-project-1.5.5-20160221.212226-1-tests.jar
[JENKINS] Archiving <https://builds.apache.org/job/DeltaSpike%20Deploy/ws/deltaspike/modules/bean-validation/api/pom.xml>
to org.apache.deltaspike.modules/deltaspike-bean-validation-module-api/1.5.5-SNAPSHOT/deltaspike-bean-validation-module-api-1.5.5-SNAPSHOT.pom
[JENKINS] Archiving <https://builds.apache.org/job/DeltaSpike%20Deploy/ws/deltaspike/core/api/pom.xml>
to org.apache.deltaspike.core/deltaspike-core-api/1.5.5-SNAPSHOT/deltaspike-core-api-1.5.5-SNAPSHOT.pom
[JENKINS] Archiving <https://builds.apache.org/job/DeltaSpike%20Deploy/ws/deltaspike/core/api/target/deltaspike-core-api-1.5.5-SNAPSHOT.jar>
to org.apache.deltaspike.core/deltaspike-core-api/1.5.5-20160221.212317-1/deltaspike-core-api-1.5.5-20160221.212317-1.jar
[JENKINS] Archiving <https://builds.apache.org/job/DeltaSpike%20Deploy/ws/deltaspike/core/api/target/deltaspike-core-api-1.5.5-SNAPSHOT-tests.jar>
to org.apache.deltaspike.core/deltaspike-core-api/1.5.5-20160221.212317-1/deltaspike-core-api-1.5.5-20160221.212317-1-tests.jar
[JENKINS] Archiving <https://builds.apache.org/job/DeltaSpike%20Deploy/ws/deltaspike/core/api/target/deltaspike-core-api-1.5.5-SNAPSHOT-sources.jar>
to org.apache.deltaspike.core/deltaspike-core-api/1.5.5-20160221.212317-1/deltaspike-core-api-1.5.5-20160221.212317-1-sources.jar
[JENKINS] Archiving <https://builds.apache.org/job/DeltaSpike%20Deploy/ws/deltaspike/modules/security/impl/pom.xml>
to org.apache.deltaspike.modules/deltaspike-security-module-impl/1.5.5-SNAPSHOT/deltaspike-security-module-impl-1.5.5-SNAPSHOT.pom
[JENKINS] Archiving <https://builds.apache.org/job/DeltaSpike%20Deploy/ws/deltaspike/modules/scheduler/pom.xml>
to org.apache.deltaspike.modules/scheduler-module-project/1.5.5-SNAPSHOT/scheduler-module-project-1.5.5-SNAPSHOT.pom
[JENKINS] Archiving <https://builds.apache.org/job/DeltaSpike%20Deploy/ws/site/pom.xml>
to org.apache.deltaspike/deltaspike-site/1.5.5-SNAPSHOT/deltaspike-site-1.5.5-SNAPSHOT.pom
[JENKINS] Archiving <https://builds.apache.org/job/DeltaSpike%20Deploy/ws/deltaspike/modules/proxy/impl-asm5/pom.xml>
to org.apache.deltaspike.modules/deltaspike-proxy-module-impl-asm5/1.5.5-SNAPSHOT/deltaspike-proxy-module-impl-asm5-1.5.5-SNAPSHOT.pom
[JENKINS] Archiving <https://builds.apache.org/job/DeltaSpike%20Deploy/ws/deltaspike/examples/jsf-playground/pom.xml>
to org.apache.deltaspike.examples/deltaspike-jsf-playground/1.5.5-SNAPSHOT/deltaspike-jsf-playground-1.5.5-SNAPSHOT.pom
[JENKINS] Archiving <https://builds.apache.org/job/DeltaSpike%20Deploy/ws/deltaspike/modules/servlet/impl/pom.xml>
to org.apache.deltaspike.modules/deltaspike-servlet-module-impl/1.5.5-SNAPSHOT/deltaspike-servlet-module-impl-1.5.5-SNAPSHOT.pom
[JENKINS] Archiving <https://builds.apache.org/job/DeltaSpike%20Deploy/ws/deltaspike/modules/bean-validation/impl/pom.xml>
to org.apache.deltaspike.modules/deltaspike-bean-validation-module-impl/1.5.5-SNAPSHOT/deltaspike-bean-validation-module-impl-1.5.5-SNAPSHOT.pom
[JENKINS] Archiving <https://builds.apache.org/job/DeltaSpike%20Deploy/ws/deltaspike/modules/data/test-ee7/pom.xml>
to org.apache.deltaspike.modules/deltaspike-data-module-test-ee7/1.5.5-SNAPSHOT/deltaspike-data-module-test-ee7-1.5.5-SNAPSHOT.pom
[JENKINS] Archiving <https://builds.apache.org/job/DeltaSpike%20Deploy/ws/deltaspike/cdictrl/impl-owb/pom.xml>
to org.apache.deltaspike.cdictrl/deltaspike-cdictrl-owb/1.5.5-SNAPSHOT/deltaspike-cdictrl-owb-1.5.5-SNAPSHOT.pom
[JENKINS] Archiving <https://builds.apache.org/job/DeltaSpike%20Deploy/ws/pom.xml> to
org.apache.deltaspike/deltaspike/1.5.5-SNAPSHOT/deltaspike-1.5.5-SNAPSHOT.pom
No artifacts from DeltaSpike Deploy » Apache DeltaSpike #1353 to compare, so performing full
copy of artifacts
[JENKINS] Archiving <https://builds.apache.org/job/DeltaSpike%20Deploy/ws/deltaspike/modules/jpa/impl/pom.xml>
to org.apache.deltaspike.modules/deltaspike-jpa-module-impl/1.5.5-SNAPSHOT/deltaspike-jpa-module-impl-1.5.5-SNAPSHOT.pom
[JENKINS] Archiving <https://builds.apache.org/job/DeltaSpike%20Deploy/ws/deltaspike/modules/data/pom.xml>
to org.apache.deltaspike.modules/data-module-project/1.5.5-SNAPSHOT/data-module-project-1.5.5-SNAPSHOT.pom
[JENKINS] Archiving <https://builds.apache.org/job/DeltaSpike%20Deploy/ws/deltaspike/examples/security-requested-page-after-login-picketlink/pom.xml>
to org.apache.deltaspike.examples/deltaspike-security-requested-page-after-login-picketlink/1.5.5-SNAPSHOT/deltaspike-security-requested-page-after-login-picketlink-1.5.5-SNAPSHOT.pom
[JENKINS] Archiving <https://builds.apache.org/job/DeltaSpike%20Deploy/ws/deltaspike/pom.xml>
to org.apache.deltaspike/deltaspike-project/1.5.5-SNAPSHOT/deltaspike-project-1.5.5-SNAPSHOT.pom
No artifacts from DeltaSpike Deploy » Apache DeltaSpike Sources #1353 to compare, so performing
full copy of artifacts
[JENKINS] Archiving <https://builds.apache.org/job/DeltaSpike%20Deploy/ws/deltaspike/modules/security/api/pom.xml>
to org.apache.deltaspike.modules/deltaspike-security-module-api/1.5.5-SNAPSHOT/deltaspike-security-module-api-1.5.5-SNAPSHOT.pom
Sending e-mails to: commits@deltaspike.apache.org
channel stopped

Mime
View raw message