deltaspike-commits mailing list archives

Site index · List index
Message view « Date » · « Thread »
Top « Date » · « Thread »
From Apache Jenkins Server <jenk...@builds.apache.org>
Subject Build failed in Jenkins: DeltaSpike Weld 1.1.9 #870
Date Fri, 12 Feb 2016 08:30:05 GMT
See <https://builds.apache.org/job/DeltaSpike%20Weld%201.1.9/870/changes>

Changes:

[gpetracek] [maven-release-plugin] prepare release deltaspike-1.5.3

[gpetracek] [maven-release-plugin] prepare for next development iteration

[gpetracek] DELTASPIKE-1075 information about v1.5.3

------------------------------------------
[...truncated 1668 lines...]
[INFO] Using configured provider org.apache.maven.surefire.junitcore.JUnitCoreProvider

-------------------------------------------------------
 T E S T S
-------------------------------------------------------

-------------------------------------------------------
 T E S T S
-------------------------------------------------------

Results :

Tests run: 0, Failures: 0, Errors: 0, Skipped: 0

[JENKINS] Recording test results
[INFO] 
[INFO] --- maven-jar-plugin:2.4:jar (default-jar) @ deltaspike-cdictrl-api ---
[INFO] Building jar: <https://builds.apache.org/job/DeltaSpike%20Weld%201.1.9/ws/deltaspike/cdictrl/api/target/deltaspike-cdictrl-api-1.5.4-SNAPSHOT.jar>
[INFO] 
[INFO] --- maven-site-plugin:3.3:attach-descriptor (attach-descriptor) @ deltaspike-cdictrl-api
---
[INFO] 
[INFO] --- maven-bundle-plugin:2.3.7:cleanVersions (versions) @ deltaspike-cdictrl-api ---
[INFO] 
[INFO] --- maven-antrun-plugin:1.7:run (javadoc.resources) @ deltaspike-cdictrl-api ---
[WARNING] Parameter tasks is deprecated, use target instead
[INFO] Executing tasks

main:
[INFO] Executed tasks
[WARNING] Failed to getClass for org.apache.maven.plugin.source.SourceJarMojo
[INFO] 
[INFO] --- maven-source-plugin:2.2.1:jar (attach-sources) @ deltaspike-cdictrl-api ---
[INFO] Building jar: <https://builds.apache.org/job/DeltaSpike%20Weld%201.1.9/ws/deltaspike/cdictrl/api/target/deltaspike-cdictrl-api-1.5.4-SNAPSHOT-sources.jar>
[INFO] 
[INFO] --- maven-checkstyle-plugin:2.9.1:check (verify-style) @ deltaspike-cdictrl-api ---
[INFO] Starting audit...
Audit done.

[INFO] 
[INFO] --- maven-install-plugin:2.5.1:install (default-install) @ deltaspike-cdictrl-api ---
[INFO] Installing <https://builds.apache.org/job/DeltaSpike%20Weld%201.1.9/ws/deltaspike/cdictrl/api/target/deltaspike-cdictrl-api-1.5.4-SNAPSHOT.jar>
to /jenkins/maven-repositories/0/org/apache/deltaspike/cdictrl/deltaspike-cdictrl-api/1.5.4-SNAPSHOT/deltaspike-cdictrl-api-1.5.4-SNAPSHOT.jar
[INFO] Installing <https://builds.apache.org/job/DeltaSpike%20Weld%201.1.9/ws/deltaspike/cdictrl/api/pom.xml>
to /jenkins/maven-repositories/0/org/apache/deltaspike/cdictrl/deltaspike-cdictrl-api/1.5.4-SNAPSHOT/deltaspike-cdictrl-api-1.5.4-SNAPSHOT.pom
[INFO] Installing <https://builds.apache.org/job/DeltaSpike%20Weld%201.1.9/ws/deltaspike/cdictrl/api/target/deltaspike-cdictrl-api-1.5.4-SNAPSHOT-sources.jar>
to /jenkins/maven-repositories/0/org/apache/deltaspike/cdictrl/deltaspike-cdictrl-api/1.5.4-SNAPSHOT/deltaspike-cdictrl-api-1.5.4-SNAPSHOT-sources.jar
[INFO]                                                                         
[INFO] ------------------------------------------------------------------------
[INFO] Building Apache DeltaSpike CDI Weld-ContainerControl 1.5.4-SNAPSHOT
[INFO] ------------------------------------------------------------------------
Downloading: https://repository.apache.org/content/repositories/releases/org/jboss/weld/se/weld-se-core/1.1.9.Final/weld-se-core-1.1.9.Final.jar
Downloading: https://repository.apache.org/content/repositories/snapshots/org/jboss/weld/se/weld-se-core/1.1.9.Final/weld-se-core-1.1.9.Final.jar
Downloading: http://repo.maven.apache.org/maven2/org/jboss/weld/se/weld-se-core/1.1.9.Final/weld-se-core-1.1.9.Final.jar
Downloaded: http://repo.maven.apache.org/maven2/org/jboss/weld/se/weld-se-core/1.1.9.Final/weld-se-core-1.1.9.Final.jar
(32 KB at 20.2 KB/sec)
[INFO] 
[INFO] --- maven-clean-plugin:2.5:clean (default-clean) @ deltaspike-cdictrl-weld ---
[INFO] 
[INFO] --- maven-bundle-plugin:2.3.7:cleanVersions (versions) @ deltaspike-cdictrl-weld ---
[INFO] 
[INFO] --- maven-antrun-plugin:1.7:run (javadoc.resources) @ deltaspike-cdictrl-weld ---
[WARNING] Parameter tasks is deprecated, use target instead
[INFO] Executing tasks

main:
[INFO] Executed tasks
[INFO] 
[INFO] --- maven-remote-resources-plugin:1.5:process (default) @ deltaspike-cdictrl-weld ---
Downloading: https://repository.apache.org/content/repositories/releases/org/jboss/weld/weld-core-parent/1.1.9.Final/weld-core-parent-1.1.9.Final.pom
Downloading: https://repository.apache.org/content/repositories/snapshots/org/jboss/weld/weld-core-parent/1.1.9.Final/weld-core-parent-1.1.9.Final.pom
Downloading: http://repo.maven.apache.org/maven2/org/jboss/weld/weld-core-parent/1.1.9.Final/weld-core-parent-1.1.9.Final.pom
Downloaded: http://repo.maven.apache.org/maven2/org/jboss/weld/weld-core-parent/1.1.9.Final/weld-core-parent-1.1.9.Final.pom
(0 B at 0.0 KB/sec)
[INFO] 
[INFO] --- maven-resources-plugin:2.6:resources (default-resources) @ deltaspike-cdictrl-weld
---
[INFO] Using 'UTF-8' encoding to copy filtered resources.
[INFO] Copying 2 resources
[INFO] Copying 3 resources
[INFO] 
[INFO] --- maven-compiler-plugin:2.5:compile (default-compile) @ deltaspike-cdictrl-weld ---
[INFO] Compiling 2 source files to <https://builds.apache.org/job/DeltaSpike%20Weld%201.1.9/ws/deltaspike/cdictrl/impl-weld/target/classes>
[INFO] 
[INFO] --- maven-resources-plugin:2.6:testResources (default-testResources) @ deltaspike-cdictrl-weld
---
[INFO] Using 'UTF-8' encoding to copy filtered resources.
[INFO] skip non existing resourceDirectory <https://builds.apache.org/job/DeltaSpike%20Weld%201.1.9/ws/deltaspike/cdictrl/impl-weld/src/test/resources>
[INFO] Copying 3 resources
[INFO] 
[INFO] --- maven-compiler-plugin:2.5:testCompile (default-testCompile) @ deltaspike-cdictrl-weld
---
[INFO] No sources to compile
[INFO] 
[INFO] --- maven-dependency-plugin:2.4:unpack (unpack) @ deltaspike-cdictrl-weld ---
[INFO] Configured Artifact: org.apache.deltaspike.test:deltaspike-cdictrl-tck:1.5.4-SNAPSHOT:jar
[INFO] Unpacking /jenkins/maven-repositories/0/org/apache/deltaspike/test/deltaspike-cdictrl-tck/1.5.4-SNAPSHOT/deltaspike-cdictrl-tck-1.5.4-SNAPSHOT.jar
to <https://builds.apache.org/job/DeltaSpike%20Weld%201.1.9/ws/deltaspike/cdictrl/impl-weld/target/test-classes>
with includes "" and excludes ""
[INFO] 
[INFO] --- maven-surefire-plugin:2.11:test (default-test) @ deltaspike-cdictrl-weld ---
[INFO] Surefire report directory: <https://builds.apache.org/job/DeltaSpike%20Weld%201.1.9/ws/deltaspike/cdictrl/impl-weld/target/surefire-reports>
[INFO] Using configured provider org.apache.maven.surefire.junitcore.JUnitCoreProvider

-------------------------------------------------------
 T E S T S
-------------------------------------------------------

-------------------------------------------------------
 T E S T S
-------------------------------------------------------

Results :

Tests run: 0, Failures: 0, Errors: 0, Skipped: 0

[JENKINS] Recording test results
[INFO] ------------------------------------------------------------------------
[INFO] Reactor Summary:
[INFO] 
[INFO] Apache DeltaSpike Sources ......................... SUCCESS [4.783s]
[INFO] Apache DeltaSpike CheckStyle-rules ................ SUCCESS [2.449s]
[INFO] Apache DeltaSpike Parent .......................... SUCCESS [5.428s]
[INFO] Apache DeltaSpike Test-Utils ...................... SUCCESS [6.160s]
[INFO] Apache DeltaSpike Code Parent ..................... SUCCESS [11.590s]
[INFO] Apache DeltaSpike Core ............................ SUCCESS [3.443s]
[INFO] Apache DeltaSpike Core-API ........................ SUCCESS [47.130s]
[INFO] Apache DeltaSpike Core-Implementation ............. SUCCESS [2:21.087s]
[INFO] Apache DeltaSpike ContainerControl parent ......... SUCCESS [3.832s]
[INFO] Apache DeltaSpike CDI ContainerControl API ........ SUCCESS [5.157s]
[INFO] Apache DeltaSpike CDI Weld-ContainerControl ....... FAILURE [5.102s]
[INFO] Apache DeltaSpike CDI Servlet-ContainerControl .... SKIPPED
[INFO] Apache DeltaSpike CDI ContainerControl TCK ........ SKIPPED
[INFO] Apache DeltaSpike Modules ......................... SKIPPED
[INFO] Apache DeltaSpike Proxy-Module .................... SKIPPED
[INFO] Apache DeltaSpike Proxy-Module API ................ SKIPPED
[INFO] Apache DeltaSpike Proxy-Module Impl ASM5 .......... SKIPPED
[INFO] Apache DeltaSpike Security-Module ................. SKIPPED
[INFO] Apache DeltaSpike Security-Module API ............. SKIPPED
[INFO] Apache DeltaSpike Security-Module Impl ............ SKIPPED
[INFO] Apache DeltaSpike JPA-Module ...................... SKIPPED
[INFO] Apache DeltaSpike JPA-Module API .................. SKIPPED
[INFO] Apache DeltaSpike JPA-Module Impl ................. SKIPPED
[INFO] Apache DeltaSpike Servlet-Module .................. SKIPPED
[INFO] Apache DeltaSpike Servlet-Module API .............. SKIPPED
[INFO] Apache DeltaSpike Servlet-Module Impl ............. SKIPPED
[INFO] Apache DeltaSpike JSF-Module ...................... SKIPPED
[INFO] Apache DeltaSpike JSF-Module API .................. SKIPPED
[INFO] Apache DeltaSpike JSF-Module Impl ................. SKIPPED
[INFO] Apache DeltaSpike JSF-Module Impl (EE6 only) ...... SKIPPED
[INFO] Apache DeltaSpike Partial-Bean-Module ............. SKIPPED
[INFO] Apache DeltaSpike Partial-Bean-Module API ......... SKIPPED
[INFO] Apache DeltaSpike Partial-Bean-Module Impl ........ SKIPPED
[INFO] Apache DeltaSpike BeanValidation-Module ........... SKIPPED
[INFO] Apache DeltaSpike BeanValidation-Module API ....... SKIPPED
[INFO] Apache DeltaSpike BeanValidation-Module Impl ...... SKIPPED
[INFO] Apache DeltaSpike Data-Module ..................... SKIPPED
[INFO] Apache DeltaSpike Data-Module API ................. SKIPPED
[INFO] Apache DeltaSpike Data-Module Impl ................ SKIPPED
[INFO] Apache DeltaSpike Data-Module Tests on Java EE 7 .. SKIPPED
[INFO] Apache DeltaSpike Scheduler-Module ................ SKIPPED
[INFO] Apache DeltaSpike Scheduler-Module API ............ SKIPPED
[INFO] Apache DeltaSpike Scheduler-Module Impl ........... SKIPPED
[INFO] Apache DeltaSpike Test-Control-Module ............. SKIPPED
[INFO] Apache DeltaSpike Test-Control-Module API ......... SKIPPED
[INFO] Apache DeltaSpike Test-Control-Module Impl ........ SKIPPED
[INFO] Apache DeltaSpike Examples ........................ SKIPPED
[INFO] Apache DeltaSpike Java-SE Examples ................ SKIPPED
[INFO] Apache DeltaSpike JSF Examples .................... SKIPPED
[INFO] Apache DeltaSpike JSF Playground .................. SKIPPED
[INFO] Apache DeltaSpike Security Example CDI ............ SKIPPED
[INFO] Apache DeltaSpike Security Example PicketLink ..... SKIPPED
[INFO] Apache DeltaSpike Java-SE Scheduler Examples ...... SKIPPED
[INFO] ------------------------------------------------------------------------
[INFO] BUILD FAILURE
[INFO] ------------------------------------------------------------------------
[INFO] Total time: 4:33.717s
[INFO] Finished at: Fri Feb 12 08:22:53 UTC 2016
[INFO] Final Memory: 55M/621M
[INFO] ------------------------------------------------------------------------
Waiting for Jenkins to finish collecting data
[ERROR] Failed to execute goal org.apache.maven.plugins:maven-surefire-plugin:2.11:test (default-test)
on project deltaspike-cdictrl-weld: Execution default-test of goal org.apache.maven.plugins:maven-surefire-plugin:2.11:test
failed: java.lang.reflect.InvocationTargetException; nested exception is java.lang.reflect.InvocationTargetException:
null: org/apache/deltaspike/cdise/tck/ContainerCtrlTckTest : Unsupported major.minor version
52.0 -> [Help 1]
[ERROR] 
[ERROR] To see the full stack trace of the errors, re-run Maven with the -e switch.
[ERROR] Re-run Maven using the -X switch to enable full debug logging.
[ERROR] 
[ERROR] For more information about the errors and possible solutions, please read the following
articles:
[ERROR] [Help 1] http://cwiki.apache.org/confluence/display/MAVEN/PluginExecutionException
[ERROR] 
[ERROR] After correcting the problems, you can resume the build with the command
[ERROR]   mvn <goals> -rf :deltaspike-cdictrl-weld
[JENKINS] Archiving <https://builds.apache.org/job/DeltaSpike%20Weld%201.1.9/ws/deltaspike/examples/jse-examples/pom.xml>
to org.apache.deltaspike.examples/deltaspike-jse-example/1.5.4-SNAPSHOT/deltaspike-jse-example-1.5.4-SNAPSHOT.pom
[JENKINS] Archiving <https://builds.apache.org/job/DeltaSpike%20Weld%201.1.9/ws/deltaspike/examples/security-requested-page-after-login-cdi/pom.xml>
to org.apache.deltaspike.examples/deltaspike-security-requested-page-after-login-cdi/1.5.4-SNAPSHOT/deltaspike-security-requested-page-after-login-cdi-1.5.4-SNAPSHOT.pom
[JENKINS] Archiving <https://builds.apache.org/job/DeltaSpike%20Weld%201.1.9/ws/deltaspike/test-utils/pom.xml>
to org.apache.deltaspike.test/test-utils/1.5.4-SNAPSHOT/test-utils-1.5.4-SNAPSHOT.pom
[JENKINS] Archiving <https://builds.apache.org/job/DeltaSpike%20Weld%201.1.9/ws/deltaspike/test-utils/target/test-utils-1.5.4-SNAPSHOT.jar>
to org.apache.deltaspike.test/test-utils/1.5.4-SNAPSHOT/test-utils-1.5.4-SNAPSHOT.jar
[JENKINS] Archiving <https://builds.apache.org/job/DeltaSpike%20Weld%201.1.9/ws/deltaspike/test-utils/target/test-utils-1.5.4-SNAPSHOT-sources.jar>
to org.apache.deltaspike.test/test-utils/1.5.4-SNAPSHOT/test-utils-1.5.4-SNAPSHOT-sources.jar
[JENKINS] Archiving <https://builds.apache.org/job/DeltaSpike%20Weld%201.1.9/ws/deltaspike/modules/data/impl/pom.xml>
to org.apache.deltaspike.modules/deltaspike-data-module-impl/1.5.4-SNAPSHOT/deltaspike-data-module-impl-1.5.4-SNAPSHOT.pom
[JENKINS] Archiving <https://builds.apache.org/job/DeltaSpike%20Weld%201.1.9/ws/deltaspike/modules/data/api/pom.xml>
to org.apache.deltaspike.modules/deltaspike-data-module-api/1.5.4-SNAPSHOT/deltaspike-data-module-api-1.5.4-SNAPSHOT.pom
[JENKINS] Archiving <https://builds.apache.org/job/DeltaSpike%20Weld%201.1.9/ws/deltaspike/core/impl/pom.xml>
to org.apache.deltaspike.core/deltaspike-core-impl/1.5.4-SNAPSHOT/deltaspike-core-impl-1.5.4-SNAPSHOT.pom
[JENKINS] Archiving <https://builds.apache.org/job/DeltaSpike%20Weld%201.1.9/ws/deltaspike/core/impl/target/deltaspike-core-impl-1.5.4-SNAPSHOT.jar>
to org.apache.deltaspike.core/deltaspike-core-impl/1.5.4-SNAPSHOT/deltaspike-core-impl-1.5.4-SNAPSHOT.jar
[JENKINS] Archiving <https://builds.apache.org/job/DeltaSpike%20Weld%201.1.9/ws/deltaspike/core/impl/target/deltaspike-core-impl-1.5.4-SNAPSHOT-tests.jar>
to org.apache.deltaspike.core/deltaspike-core-impl/1.5.4-SNAPSHOT/deltaspike-core-impl-1.5.4-SNAPSHOT-tests.jar
[JENKINS] Archiving <https://builds.apache.org/job/DeltaSpike%20Weld%201.1.9/ws/deltaspike/core/impl/target/deltaspike-core-impl-1.5.4-SNAPSHOT-sources.jar>
to org.apache.deltaspike.core/deltaspike-core-impl/1.5.4-SNAPSHOT/deltaspike-core-impl-1.5.4-SNAPSHOT-sources.jar
[JENKINS] Archiving <https://builds.apache.org/job/DeltaSpike%20Weld%201.1.9/ws/deltaspike/modules/pom.xml>
to org.apache.deltaspike.modules/modules-project/1.5.4-SNAPSHOT/modules-project-1.5.4-SNAPSHOT.pom
[JENKINS] Archiving <https://builds.apache.org/job/DeltaSpike%20Weld%201.1.9/ws/deltaspike/modules/test-control/pom.xml>
to org.apache.deltaspike.modules/test-control-module-project/1.5.4-SNAPSHOT/test-control-module-project-1.5.4-SNAPSHOT.pom
[JENKINS] Archiving <https://builds.apache.org/job/DeltaSpike%20Weld%201.1.9/ws/deltaspike/examples/jsf-examples/pom.xml>
to org.apache.deltaspike.examples/deltaspike-jsf-example/1.5.4-SNAPSHOT/deltaspike-jsf-example-1.5.4-SNAPSHOT.pom
[JENKINS] Archiving <https://builds.apache.org/job/DeltaSpike%20Weld%201.1.9/ws/deltaspike/cdictrl/api/pom.xml>
to org.apache.deltaspike.cdictrl/deltaspike-cdictrl-api/1.5.4-SNAPSHOT/deltaspike-cdictrl-api-1.5.4-SNAPSHOT.pom
[JENKINS] Archiving <https://builds.apache.org/job/DeltaSpike%20Weld%201.1.9/ws/deltaspike/cdictrl/api/target/deltaspike-cdictrl-api-1.5.4-SNAPSHOT.jar>
to org.apache.deltaspike.cdictrl/deltaspike-cdictrl-api/1.5.4-SNAPSHOT/deltaspike-cdictrl-api-1.5.4-SNAPSHOT.jar
[JENKINS] Archiving <https://builds.apache.org/job/DeltaSpike%20Weld%201.1.9/ws/deltaspike/cdictrl/api/target/deltaspike-cdictrl-api-1.5.4-SNAPSHOT-sources.jar>
to org.apache.deltaspike.cdictrl/deltaspike-cdictrl-api/1.5.4-SNAPSHOT/deltaspike-cdictrl-api-1.5.4-SNAPSHOT-sources.jar
[JENKINS] Archiving <https://builds.apache.org/job/DeltaSpike%20Weld%201.1.9/ws/deltaspike/cdictrl/servlet/pom.xml>
to org.apache.deltaspike.cdictrl/deltaspike-cdictrl-servlet/1.5.4-SNAPSHOT/deltaspike-cdictrl-servlet-1.5.4-SNAPSHOT.pom
[JENKINS] Archiving <https://builds.apache.org/job/DeltaSpike%20Weld%201.1.9/ws/deltaspike/examples/scheduler-playground/pom.xml>
to org.apache.deltaspike.examples/deltaspike-scheduler-example/1.5.4-SNAPSHOT/deltaspike-scheduler-example-1.5.4-SNAPSHOT.pom
[JENKINS] Archiving <https://builds.apache.org/job/DeltaSpike%20Weld%201.1.9/ws/deltaspike/checkstyle-rules/pom.xml>
to org.apache.deltaspike/checkstyle-rules/1.5.4-SNAPSHOT/checkstyle-rules-1.5.4-SNAPSHOT.pom
[JENKINS] Archiving <https://builds.apache.org/job/DeltaSpike%20Weld%201.1.9/ws/deltaspike/checkstyle-rules/target/checkstyle-rules-1.5.4-SNAPSHOT.jar>
to org.apache.deltaspike/checkstyle-rules/1.5.4-SNAPSHOT/checkstyle-rules-1.5.4-SNAPSHOT.jar
[JENKINS] Archiving <https://builds.apache.org/job/DeltaSpike%20Weld%201.1.9/ws/deltaspike/parent/code/pom.xml>
to org.apache.deltaspike/parent-code/1.5.4-SNAPSHOT/parent-code-1.5.4-SNAPSHOT.pom
[JENKINS] Archiving <https://builds.apache.org/job/DeltaSpike%20Weld%201.1.9/ws/deltaspike/parent/code/target/parent-code-1.5.4-SNAPSHOT-tests.jar>
to org.apache.deltaspike/parent-code/1.5.4-SNAPSHOT/parent-code-1.5.4-SNAPSHOT-tests.jar
Compressed 79.64 KB of artifacts by 40.2% relative to #869
[JENKINS] Archiving <https://builds.apache.org/job/DeltaSpike%20Weld%201.1.9/ws/deltaspike/modules/jsf/impl/pom.xml>
to org.apache.deltaspike.modules/deltaspike-jsf-module-impl/1.5.4-SNAPSHOT/deltaspike-jsf-module-impl-1.5.4-SNAPSHOT.pom
[JENKINS] Archiving <https://builds.apache.org/job/DeltaSpike%20Weld%201.1.9/ws/deltaspike/modules/partial-bean/pom.xml>
to org.apache.deltaspike.modules/partial-bean-module-project/1.5.4-SNAPSHOT/partial-bean-module-project-1.5.4-SNAPSHOT.pom
[JENKINS] Archiving <https://builds.apache.org/job/DeltaSpike%20Weld%201.1.9/ws/deltaspike/examples/pom.xml>
to org.apache.deltaspike.examples/examples-project/1.5.4-SNAPSHOT/examples-project-1.5.4-SNAPSHOT.pom
[JENKINS] Archiving <https://builds.apache.org/job/DeltaSpike%20Weld%201.1.9/ws/deltaspike/modules/jsf/pom.xml>
to org.apache.deltaspike.modules/jsf-module-project/1.5.4-SNAPSHOT/jsf-module-project-1.5.4-SNAPSHOT.pom
[JENKINS] Archiving <https://builds.apache.org/job/DeltaSpike%20Weld%201.1.9/ws/deltaspike/cdictrl/tck/pom.xml>
to org.apache.deltaspike.test/deltaspike-cdictrl-tck/1.5.4-SNAPSHOT/deltaspike-cdictrl-tck-1.5.4-SNAPSHOT.pom
[JENKINS] Archiving <https://builds.apache.org/job/DeltaSpike%20Weld%201.1.9/ws/deltaspike/modules/jsf/api/pom.xml>
to org.apache.deltaspike.modules/deltaspike-jsf-module-api/1.5.4-SNAPSHOT/deltaspike-jsf-module-api-1.5.4-SNAPSHOT.pom
[JENKINS] Archiving <https://builds.apache.org/job/DeltaSpike%20Weld%201.1.9/ws/deltaspike/modules/security/pom.xml>
to org.apache.deltaspike.modules/security-module-project/1.5.4-SNAPSHOT/security-module-project-1.5.4-SNAPSHOT.pom
[JENKINS] Archiving <https://builds.apache.org/job/DeltaSpike%20Weld%201.1.9/ws/deltaspike/modules/bean-validation/pom.xml>
to org.apache.deltaspike.modules/bean-validation-module-project/1.5.4-SNAPSHOT/bean-validation-module-project-1.5.4-SNAPSHOT.pom
[JENKINS] Archiving <https://builds.apache.org/job/DeltaSpike%20Weld%201.1.9/ws/deltaspike/modules/partial-bean/impl/pom.xml>
to org.apache.deltaspike.modules/deltaspike-partial-bean-module-impl/1.5.4-SNAPSHOT/deltaspike-partial-bean-module-impl-1.5.4-SNAPSHOT.pom
[JENKINS] Archiving <https://builds.apache.org/job/DeltaSpike%20Weld%201.1.9/ws/deltaspike/modules/proxy/api/pom.xml>
to org.apache.deltaspike.modules/deltaspike-proxy-module-api/1.5.4-SNAPSHOT/deltaspike-proxy-module-api-1.5.4-SNAPSHOT.pom
[JENKINS] Archiving <https://builds.apache.org/job/DeltaSpike%20Weld%201.1.9/ws/deltaspike/cdictrl/impl-weld/pom.xml>
to org.apache.deltaspike.cdictrl/deltaspike-cdictrl-weld/1.5.4-SNAPSHOT/deltaspike-cdictrl-weld-1.5.4-SNAPSHOT.pom
[JENKINS] Archiving <https://builds.apache.org/job/DeltaSpike%20Weld%201.1.9/ws/deltaspike/modules/jpa/api/pom.xml>
to org.apache.deltaspike.modules/deltaspike-jpa-module-api/1.5.4-SNAPSHOT/deltaspike-jpa-module-api-1.5.4-SNAPSHOT.pom
[JENKINS] Archiving <https://builds.apache.org/job/DeltaSpike%20Weld%201.1.9/ws/deltaspike/modules/servlet/api/pom.xml>
to org.apache.deltaspike.modules/deltaspike-servlet-module-api/1.5.4-SNAPSHOT/deltaspike-servlet-module-api-1.5.4-SNAPSHOT.pom
[JENKINS] Archiving <https://builds.apache.org/job/DeltaSpike%20Weld%201.1.9/ws/deltaspike/modules/jpa/pom.xml>
to org.apache.deltaspike.modules/jpa-module-project/1.5.4-SNAPSHOT/jpa-module-project-1.5.4-SNAPSHOT.pom
[JENKINS] Archiving <https://builds.apache.org/job/DeltaSpike%20Weld%201.1.9/ws/deltaspike/cdictrl/pom.xml>
to org.apache.deltaspike.cdictrl/cdictrl-project/1.5.4-SNAPSHOT/cdictrl-project-1.5.4-SNAPSHOT.pom
[JENKINS] Archiving <https://builds.apache.org/job/DeltaSpike%20Weld%201.1.9/ws/deltaspike/modules/scheduler/api/pom.xml>
to org.apache.deltaspike.modules/deltaspike-scheduler-module-api/1.5.4-SNAPSHOT/deltaspike-scheduler-module-api-1.5.4-SNAPSHOT.pom
[JENKINS] Archiving <https://builds.apache.org/job/DeltaSpike%20Weld%201.1.9/ws/deltaspike/modules/test-control/impl/pom.xml>
to org.apache.deltaspike.modules/deltaspike-test-control-module-impl/1.5.4-SNAPSHOT/deltaspike-test-control-module-impl-1.5.4-SNAPSHOT.pom
[JENKINS] Archiving <https://builds.apache.org/job/DeltaSpike%20Weld%201.1.9/ws/deltaspike/modules/servlet/pom.xml>
to org.apache.deltaspike.modules/servlet-module-project/1.5.4-SNAPSHOT/servlet-module-project-1.5.4-SNAPSHOT.pom
[JENKINS] Archiving <https://builds.apache.org/job/DeltaSpike%20Weld%201.1.9/ws/deltaspike/modules/test-control/api/pom.xml>
to org.apache.deltaspike.modules/deltaspike-test-control-module-api/1.5.4-SNAPSHOT/deltaspike-test-control-module-api-1.5.4-SNAPSHOT.pom
[JENKINS] Archiving <https://builds.apache.org/job/DeltaSpike%20Weld%201.1.9/ws/deltaspike/modules/jsf/impl-ee6/pom.xml>
to org.apache.deltaspike.modules/deltaspike-jsf-module-impl-ee6/1.5.4-SNAPSHOT/deltaspike-jsf-module-impl-ee6-1.5.4-SNAPSHOT.pom
[JENKINS] Archiving <https://builds.apache.org/job/DeltaSpike%20Weld%201.1.9/ws/deltaspike/modules/proxy/pom.xml>
to org.apache.deltaspike.modules/proxy-module-project/1.5.4-SNAPSHOT/proxy-module-project-1.5.4-SNAPSHOT.pom
[JENKINS] Archiving <https://builds.apache.org/job/DeltaSpike%20Weld%201.1.9/ws/deltaspike/modules/partial-bean/api/pom.xml>
to org.apache.deltaspike.modules/deltaspike-partial-bean-module-api/1.5.4-SNAPSHOT/deltaspike-partial-bean-module-api-1.5.4-SNAPSHOT.pom
[JENKINS] Archiving <https://builds.apache.org/job/DeltaSpike%20Weld%201.1.9/ws/deltaspike/modules/scheduler/impl/pom.xml>
to org.apache.deltaspike.modules/deltaspike-scheduler-module-impl/1.5.4-SNAPSHOT/deltaspike-scheduler-module-impl-1.5.4-SNAPSHOT.pom
[JENKINS] Archiving <https://builds.apache.org/job/DeltaSpike%20Weld%201.1.9/ws/deltaspike/parent/pom.xml>
to org.apache.deltaspike/parent/1.5.4-SNAPSHOT/parent-1.5.4-SNAPSHOT.pom
[JENKINS] Archiving <https://builds.apache.org/job/DeltaSpike%20Weld%201.1.9/ws/deltaspike/core/pom.xml>
to org.apache.deltaspike.core/core-project/1.5.4-SNAPSHOT/core-project-1.5.4-SNAPSHOT.pom
[JENKINS] Archiving <https://builds.apache.org/job/DeltaSpike%20Weld%201.1.9/ws/deltaspike/core/target/core-project-1.5.4-SNAPSHOT-tests.jar>
to org.apache.deltaspike.core/core-project/1.5.4-SNAPSHOT/core-project-1.5.4-SNAPSHOT-tests.jar
[JENKINS] Archiving <https://builds.apache.org/job/DeltaSpike%20Weld%201.1.9/ws/deltaspike/modules/bean-validation/api/pom.xml>
to org.apache.deltaspike.modules/deltaspike-bean-validation-module-api/1.5.4-SNAPSHOT/deltaspike-bean-validation-module-api-1.5.4-SNAPSHOT.pom
[JENKINS] Archiving <https://builds.apache.org/job/DeltaSpike%20Weld%201.1.9/ws/deltaspike/core/api/pom.xml>
to org.apache.deltaspike.core/deltaspike-core-api/1.5.4-SNAPSHOT/deltaspike-core-api-1.5.4-SNAPSHOT.pom
[JENKINS] Archiving <https://builds.apache.org/job/DeltaSpike%20Weld%201.1.9/ws/deltaspike/core/api/target/deltaspike-core-api-1.5.4-SNAPSHOT.jar>
to org.apache.deltaspike.core/deltaspike-core-api/1.5.4-SNAPSHOT/deltaspike-core-api-1.5.4-SNAPSHOT.jar
[JENKINS] Archiving <https://builds.apache.org/job/DeltaSpike%20Weld%201.1.9/ws/deltaspike/core/api/target/deltaspike-core-api-1.5.4-SNAPSHOT-tests.jar>
to org.apache.deltaspike.core/deltaspike-core-api/1.5.4-SNAPSHOT/deltaspike-core-api-1.5.4-SNAPSHOT-tests.jar
[JENKINS] Archiving <https://builds.apache.org/job/DeltaSpike%20Weld%201.1.9/ws/deltaspike/core/api/target/deltaspike-core-api-1.5.4-SNAPSHOT-sources.jar>
to org.apache.deltaspike.core/deltaspike-core-api/1.5.4-SNAPSHOT/deltaspike-core-api-1.5.4-SNAPSHOT-sources.jar
[JENKINS] Archiving <https://builds.apache.org/job/DeltaSpike%20Weld%201.1.9/ws/deltaspike/modules/security/impl/pom.xml>
to org.apache.deltaspike.modules/deltaspike-security-module-impl/1.5.4-SNAPSHOT/deltaspike-security-module-impl-1.5.4-SNAPSHOT.pom
[JENKINS] Archiving <https://builds.apache.org/job/DeltaSpike%20Weld%201.1.9/ws/deltaspike/modules/scheduler/pom.xml>
to org.apache.deltaspike.modules/scheduler-module-project/1.5.4-SNAPSHOT/scheduler-module-project-1.5.4-SNAPSHOT.pom
[JENKINS] Archiving <https://builds.apache.org/job/DeltaSpike%20Weld%201.1.9/ws/deltaspike/modules/proxy/impl-asm5/pom.xml>
to org.apache.deltaspike.modules/deltaspike-proxy-module-impl-asm5/1.5.4-SNAPSHOT/deltaspike-proxy-module-impl-asm5-1.5.4-SNAPSHOT.pom
[JENKINS] Archiving <https://builds.apache.org/job/DeltaSpike%20Weld%201.1.9/ws/deltaspike/examples/jsf-playground/pom.xml>
to org.apache.deltaspike.examples/deltaspike-jsf-playground/1.5.4-SNAPSHOT/deltaspike-jsf-playground-1.5.4-SNAPSHOT.pom
[JENKINS] Archiving <https://builds.apache.org/job/DeltaSpike%20Weld%201.1.9/ws/deltaspike/modules/servlet/impl/pom.xml>
to org.apache.deltaspike.modules/deltaspike-servlet-module-impl/1.5.4-SNAPSHOT/deltaspike-servlet-module-impl-1.5.4-SNAPSHOT.pom
[JENKINS] Archiving <https://builds.apache.org/job/DeltaSpike%20Weld%201.1.9/ws/deltaspike/modules/bean-validation/impl/pom.xml>
to org.apache.deltaspike.modules/deltaspike-bean-validation-module-impl/1.5.4-SNAPSHOT/deltaspike-bean-validation-module-impl-1.5.4-SNAPSHOT.pom
[JENKINS] Archiving <https://builds.apache.org/job/DeltaSpike%20Weld%201.1.9/ws/deltaspike/modules/data/test-ee7/pom.xml>
to org.apache.deltaspike.modules/deltaspike-data-module-test-ee7/1.5.4-SNAPSHOT/deltaspike-data-module-test-ee7-1.5.4-SNAPSHOT.pom
[JENKINS] Archiving <https://builds.apache.org/job/DeltaSpike%20Weld%201.1.9/ws/deltaspike/modules/jpa/impl/pom.xml>
to org.apache.deltaspike.modules/deltaspike-jpa-module-impl/1.5.4-SNAPSHOT/deltaspike-jpa-module-impl-1.5.4-SNAPSHOT.pom
[JENKINS] Archiving <https://builds.apache.org/job/DeltaSpike%20Weld%201.1.9/ws/deltaspike/modules/data/pom.xml>
to org.apache.deltaspike.modules/data-module-project/1.5.4-SNAPSHOT/data-module-project-1.5.4-SNAPSHOT.pom
[JENKINS] Archiving <https://builds.apache.org/job/DeltaSpike%20Weld%201.1.9/ws/deltaspike/examples/security-requested-page-after-login-picketlink/pom.xml>
to org.apache.deltaspike.examples/deltaspike-security-requested-page-after-login-picketlink/1.5.4-SNAPSHOT/deltaspike-security-requested-page-after-login-picketlink-1.5.4-SNAPSHOT.pom
[JENKINS] Archiving <https://builds.apache.org/job/DeltaSpike%20Weld%201.1.9/ws/deltaspike/pom.xml>
to org.apache.deltaspike/deltaspike-project/1.5.4-SNAPSHOT/deltaspike-project-1.5.4-SNAPSHOT.pom
[JENKINS] Archiving <https://builds.apache.org/job/DeltaSpike%20Weld%201.1.9/ws/deltaspike/modules/security/api/pom.xml>
to org.apache.deltaspike.modules/deltaspike-security-module-api/1.5.4-SNAPSHOT/deltaspike-security-module-api-1.5.4-SNAPSHOT.pom
Sending e-mails to: commits@deltaspike.apache.org
channel stopped

Mime
View raw message