deltaspike-commits mailing list archives

Site index · List index
Message view « Date » · « Thread »
Top « Date » · « Thread »
From Apache Jenkins Server <jenk...@builds.apache.org>
Subject Build failed in Jenkins: DeltaSpike OWB 1.1.6 (JDK 1.7) #868
Date Fri, 05 Feb 2016 07:29:26 GMT
See <https://builds.apache.org/job/DeltaSpike%20OWB%201.1.6%20(JDK%201.7)/868/changes>

Changes:

[tandraschko] DELTASPIKE-1050 EntityManagerLookup isn't thread-safe

[tandraschko] DELTASPIKE-1050 refactored

[tandraschko] DELTASPIKE-1067 Data module should use utils from core

[gpetracek] DELTASPIKE-1072 improved build-config

[gpetracek] DELTASPIKE-1072 improved build-config

[tandraschko] DELTASPIKE-1071 URLs like ?&dswid=XYZ leads to window cloning

------------------------------------------
[...truncated 2082 lines...]
jdk1.7.0_80/man/man1/java.1
jdk1.7.0_80/man/man1/jarsigner.1
jdk1.7.0_80/man/man1/keytool.1
jdk1.7.0_80/man/man1/jconsole.1
jdk1.7.0_80/man/man1/extcheck.1
jdk1.7.0_80/man/man1/wsimport.1
jdk1.7.0_80/man/man1/pack200.1
jdk1.7.0_80/man/man1/schemagen.1
jdk1.7.0_80/man/man1/javadoc.1
jdk1.7.0_80/man/man1/rmic.1
jdk1.7.0_80/man/man1/serialver.1
jdk1.7.0_80/man/man1/apt.1
jdk1.7.0_80/man/man1/javah.1
jdk1.7.0_80/man/man1/wsgen.1
jdk1.7.0_80/man/man1/jvisualvm.1
jdk1.7.0_80/man/man1/appletviewer.1
jdk1.7.0_80/man/man1/jsadebugd.1
jdk1.7.0_80/man/man1/orbd.1
jdk1.7.0_80/man/man1/javaws.1
jdk1.7.0_80/man/man1/jdb.1
jdk1.7.0_80/man/man1/jstatd.1
jdk1.7.0_80/man/man1/javap.1
jdk1.7.0_80/man/man1/jhat.1
jdk1.7.0_80/man/man1/xjc.1
jdk1.7.0_80/man/man1/jar.1
jdk1.7.0_80/man/man1/policytool.1
jdk1.7.0_80/man/man1/rmiregistry.1
jdk1.7.0_80/man/man1/idlj.1
jdk1.7.0_80/man/man1/jps.1
jdk1.7.0_80/man/man1/unpack200.1
jdk1.7.0_80/man/man1/tnameserv.1
jdk1.7.0_80/man/man1/jrunscript.1
jdk1.7.0_80/man/man1/jmap.1
jdk1.7.0_80/man/man1/jstack.1
jdk1.7.0_80/man/man1/servertool.1
jdk1.7.0_80/man/man1/javafxpackager.1
jdk1.7.0_80/man/man1/jstat.1
jdk1.7.0_80/man/man1/jmc.1
jdk1.7.0_80/man/man1/javac.1
jdk1.7.0_80/man/ja
jdk1.7.0_80/man/ja_JP.UTF-8/
jdk1.7.0_80/man/ja_JP.UTF-8/man1/
jdk1.7.0_80/man/ja_JP.UTF-8/man1/jinfo.1
jdk1.7.0_80/man/ja_JP.UTF-8/man1/rmid.1
jdk1.7.0_80/man/ja_JP.UTF-8/man1/native2ascii.1
jdk1.7.0_80/man/ja_JP.UTF-8/man1/jcmd.1
jdk1.7.0_80/man/ja_JP.UTF-8/man1/java.1
jdk1.7.0_80/man/ja_JP.UTF-8/man1/jarsigner.1
jdk1.7.0_80/man/ja_JP.UTF-8/man1/keytool.1
jdk1.7.0_80/man/ja_JP.UTF-8/man1/jconsole.1
jdk1.7.0_80/man/ja_JP.UTF-8/man1/extcheck.1
jdk1.7.0_80/man/ja_JP.UTF-8/man1/wsimport.1
jdk1.7.0_80/man/ja_JP.UTF-8/man1/pack200.1
jdk1.7.0_80/man/ja_JP.UTF-8/man1/schemagen.1
jdk1.7.0_80/man/ja_JP.UTF-8/man1/javadoc.1
jdk1.7.0_80/man/ja_JP.UTF-8/man1/rmic.1
jdk1.7.0_80/man/ja_JP.UTF-8/man1/serialver.1
jdk1.7.0_80/man/ja_JP.UTF-8/man1/apt.1
jdk1.7.0_80/man/ja_JP.UTF-8/man1/javah.1
jdk1.7.0_80/man/ja_JP.UTF-8/man1/wsgen.1
jdk1.7.0_80/man/ja_JP.UTF-8/man1/jvisualvm.1
jdk1.7.0_80/man/ja_JP.UTF-8/man1/appletviewer.1
jdk1.7.0_80/man/ja_JP.UTF-8/man1/jsadebugd.1
jdk1.7.0_80/man/ja_JP.UTF-8/man1/orbd.1
jdk1.7.0_80/man/ja_JP.UTF-8/man1/javaws.1
jdk1.7.0_80/man/ja_JP.UTF-8/man1/jdb.1
jdk1.7.0_80/man/ja_JP.UTF-8/man1/jstatd.1
jdk1.7.0_80/man/ja_JP.UTF-8/man1/javap.1
jdk1.7.0_80/man/ja_JP.UTF-8/man1/jhat.1
jdk1.7.0_80/man/ja_JP.UTF-8/man1/xjc.1
jdk1.7.0_80/man/ja_JP.UTF-8/man1/jar.1
jdk1.7.0_80/man/ja_JP.UTF-8/man1/policytool.1
jdk1.7.0_80/man/ja_JP.UTF-8/man1/rmiregistry.1
jdk1.7.0_80/man/ja_JP.UTF-8/man1/idlj.1
jdk1.7.0_80/man/ja_JP.UTF-8/man1/jps.1
jdk1.7.0_80/man/ja_JP.UTF-8/man1/unpack200.1
jdk1.7.0_80/man/ja_JP.UTF-8/man1/tnameserv.1
jdk1.7.0_80/man/ja_JP.UTF-8/man1/jrunscript.1
jdk1.7.0_80/man/ja_JP.UTF-8/man1/jmap.1
jdk1.7.0_80/man/ja_JP.UTF-8/man1/jstack.1
jdk1.7.0_80/man/ja_JP.UTF-8/man1/servertool.1
jdk1.7.0_80/man/ja_JP.UTF-8/man1/javafxpackager.1
jdk1.7.0_80/man/ja_JP.UTF-8/man1/jstat.1
jdk1.7.0_80/man/ja_JP.UTF-8/man1/jmc.1
jdk1.7.0_80/man/ja_JP.UTF-8/man1/javac.1
jdk1.7.0_80/include/
jdk1.7.0_80/include/jvmti.h
jdk1.7.0_80/include/classfile_constants.h
jdk1.7.0_80/include/jdwpTransport.h
jdk1.7.0_80/include/jvmticmlr.h
jdk1.7.0_80/include/jni.h
jdk1.7.0_80/include/linux/
jdk1.7.0_80/include/linux/jni_md.h
jdk1.7.0_80/include/linux/jawt_md.h
jdk1.7.0_80/include/jawt.h
jdk1.7.0_80/src.zip
jdk1.7.0_80/THIRDPARTYLICENSEREADME-JAVAFX.txt
jdk1.7.0_80/COPYRIGHT
jdk1.7.0_80/db/
jdk1.7.0_80/db/LICENSE
jdk1.7.0_80/db/RELEASE-NOTES.html
jdk1.7.0_80/db/lib/
jdk1.7.0_80/db/lib/derbyLocale_zh_CN.jar
jdk1.7.0_80/db/lib/derbynet.jar
jdk1.7.0_80/db/lib/derbyLocale_ja_JP.jar
jdk1.7.0_80/db/lib/derbyLocale_ru.jar
jdk1.7.0_80/db/lib/derbyLocale_es.jar
jdk1.7.0_80/db/lib/derbyLocale_it.jar
jdk1.7.0_80/db/lib/derby.jar
jdk1.7.0_80/db/lib/derbytools.jar
jdk1.7.0_80/db/lib/derbyLocale_hu.jar
jdk1.7.0_80/db/lib/derby.war
jdk1.7.0_80/db/lib/derbyrun.jar
jdk1.7.0_80/db/lib/derbyLocale_zh_TW.jar
jdk1.7.0_80/db/lib/derbyLocale_fr.jar
jdk1.7.0_80/db/lib/derbyclient.jar
jdk1.7.0_80/db/lib/derbyLocale_cs.jar
jdk1.7.0_80/db/lib/derbyLocale_pl.jar
jdk1.7.0_80/db/lib/derbyLocale_de_DE.jar
jdk1.7.0_80/db/lib/derbyLocale_ko_KR.jar
jdk1.7.0_80/db/lib/derbyLocale_pt_BR.jar
jdk1.7.0_80/db/3RDPARTY
jdk1.7.0_80/db/bin/
jdk1.7.0_80/db/bin/setNetworkClientCP.bat
jdk1.7.0_80/db/bin/dblook
jdk1.7.0_80/db/bin/NetworkServerControl
jdk1.7.0_80/db/bin/setEmbeddedCP
jdk1.7.0_80/db/bin/stopNetworkServer.bat
jdk1.7.0_80/db/bin/NetworkServerControl.bat
jdk1.7.0_80/db/bin/sysinfo
jdk1.7.0_80/db/bin/ij
jdk1.7.0_80/db/bin/setNetworkServerCP
jdk1.7.0_80/db/bin/setEmbeddedCP.bat
jdk1.7.0_80/db/bin/ij.bat
jdk1.7.0_80/db/bin/dblook.bat
jdk1.7.0_80/db/bin/sysinfo.bat
jdk1.7.0_80/db/bin/setNetworkClientCP
jdk1.7.0_80/db/bin/derby_common.bat
jdk1.7.0_80/db/bin/startNetworkServer.bat
jdk1.7.0_80/db/bin/startNetworkServer
jdk1.7.0_80/db/bin/setNetworkServerCP.bat
jdk1.7.0_80/db/bin/stopNetworkServer
jdk1.7.0_80/db/README-JDK.html
jdk1.7.0_80/db/NOTICE
jdk1.7.0_80/README.html
jdk1.7.0_80/THIRDPARTYLICENSEREADME.txt
Building remotely on jenkins-ubuntu-1404-4gb-f96 (jenkins-cloud-4GB cloud-slave Ubuntu ubuntu)
in workspace <https://builds.apache.org/job/DeltaSpike%20OWB%201.1.6%20(JDK%201.7)/ws/>
Cloning the remote Git repository
Cloning repository https://git-wip-us.apache.org/repos/asf/deltaspike.git
 > git init <https://builds.apache.org/job/DeltaSpike%20OWB%201.1.6%20(JDK%201.7)/ws/>
# timeout=10
Fetching upstream changes from https://git-wip-us.apache.org/repos/asf/deltaspike.git
 > git --version # timeout=10
 > git -c core.askpass=true fetch --tags --progress https://git-wip-us.apache.org/repos/asf/deltaspike.git
+refs/heads/*:refs/remotes/origin/*
 > git config remote.origin.url https://git-wip-us.apache.org/repos/asf/deltaspike.git
# timeout=10
 > git config --add remote.origin.fetch +refs/heads/*:refs/remotes/origin/* # timeout=10
 > git config remote.origin.url https://git-wip-us.apache.org/repos/asf/deltaspike.git
# timeout=10
Fetching upstream changes from https://git-wip-us.apache.org/repos/asf/deltaspike.git
 > git -c core.askpass=true fetch --tags --progress https://git-wip-us.apache.org/repos/asf/deltaspike.git
+refs/heads/*:refs/remotes/origin/*
Seen branch in repository origin/deltaspike-0.1-incubating
Seen branch in repository origin/deltaspike-0.2-incubating
Seen branch in repository origin/deltaspike-0.3-incubating
Seen branch in repository origin/deltaspike-0.4
Seen branch in repository origin/deltaspike-0.5
Seen branch in repository origin/deltaspike-0.6
Seen branch in repository origin/deltaspike-0.7
Seen branch in repository origin/deltaspike-1.0.0
Seen branch in repository origin/deltaspike-1.0.1
Seen branch in repository origin/deltaspike-1.0.2
Seen branch in repository origin/deltaspike-1.0.3
Seen branch in repository origin/deltaspike-1.1.0
Seen branch in repository origin/deltaspike-1.2.0
Seen branch in repository origin/deltaspike-1.2.1
Seen branch in repository origin/ds-1.4.0
Seen branch in repository origin/ds-1.4.1
Seen branch in repository origin/ds-1.4.2
Seen branch in repository origin/ds-1.5.0
Seen branch in repository origin/ds-1.5.1
Seen branch in repository origin/ds-1.5.2
Seen branch in repository origin/master
Seen 21 remote branches
Checking out Revision 323c7d38e9d949385eb9d90c47e8971548ab5ed4 (origin/master)
 > git config core.sparsecheckout # timeout=10
 > git checkout -f 323c7d38e9d949385eb9d90c47e8971548ab5ed4
 > git rev-list 5158834308171d1e01aa55b6b7d5a7cd1697ca3d # timeout=10
Parsing POMs
ERROR: Failed to parse POMs
java.io.IOException: remote file operation failed: <https://builds.apache.org/job/DeltaSpike%20OWB%201.1.6%20(JDK%201.7)/ws/>
at hudson.remoting.Channel@518bb8c7:jenkins-ubuntu-1404-4gb-f96: hudson.remoting.ProxyException:
hudson.maven.MavenModuleSetBuild$MavenExecutionException: hudson.maven.MavenEmbedderException:
1 problem was encountered while building the effective settings
[FATAL] Non-readable settings /home/jenkins/.m2/settings.xml: input contained no data @ /home/jenkins/.m2/settings.xml

	at hudson.FilePath.act(FilePath.java:985)
	at hudson.FilePath.act(FilePath.java:967)
	at hudson.maven.MavenModuleSetBuild$MavenModuleSetBuildExecution.parsePoms(MavenModuleSetBuild.java:960)
	at hudson.maven.MavenModuleSetBuild$MavenModuleSetBuildExecution.doRun(MavenModuleSetBuild.java:679)
	at hudson.model.AbstractBuild$AbstractBuildExecution.run(AbstractBuild.java:536)
	at hudson.model.Run.execute(Run.java:1738)
	at hudson.maven.MavenModuleSetBuild.run(MavenModuleSetBuild.java:531)
	at hudson.model.ResourceController.execute(ResourceController.java:98)
	at hudson.model.Executor.run(Executor.java:381)
Caused by: hudson.remoting.ProxyException: hudson.maven.MavenModuleSetBuild$MavenExecutionException:
hudson.maven.MavenEmbedderException: 1 problem was encountered while building the effective
settings
[FATAL] Non-readable settings /home/jenkins/.m2/settings.xml: input contained no data @ /home/jenkins/.m2/settings.xml

	at hudson.maven.MavenModuleSetBuild$PomParser.invoke(MavenModuleSetBuild.java:1362)
	at hudson.maven.MavenModuleSetBuild$PomParser.invoke(MavenModuleSetBuild.java:1098)
	at hudson.FilePath$FileCallableWrapper.call(FilePath.java:2688)
	at hudson.remoting.UserRequest.perform(UserRequest.java:121)
	at hudson.remoting.UserRequest.perform(UserRequest.java:49)
	at hudson.remoting.Request$2.run(Request.java:326)
	at hudson.remoting.InterceptingExecutorService$1.call(InterceptingExecutorService.java:68)
	at java.util.concurrent.FutureTask.run(FutureTask.java:262)
	at java.util.concurrent.ThreadPoolExecutor.runWorker(ThreadPoolExecutor.java:1145)
	at java.util.concurrent.ThreadPoolExecutor$Worker.run(ThreadPoolExecutor.java:615)
	at java.lang.Thread.run(Thread.java:745)
	at ......remote call to jenkins-ubuntu-1404-4gb-f96(Native Method)
	at hudson.remoting.Channel.attachCallSiteStackTrace(Channel.java:1413)
	at hudson.remoting.UserResponse.retrieve(UserRequest.java:221)
	at hudson.remoting.Channel.call(Channel.java:778)
	at hudson.FilePath.act(FilePath.java:978)
	... 8 more
Caused by: hudson.remoting.ProxyException: hudson.maven.MavenEmbedderException: 1 problem
was encountered while building the effective settings
[FATAL] Non-readable settings /home/jenkins/.m2/settings.xml: input contained no data @ /home/jenkins/.m2/settings.xml

	at hudson.maven.MavenEmbedder.<init>(MavenEmbedder.java:128)
	at hudson.maven.MavenEmbedder.<init>(MavenEmbedder.java:109)
	at hudson.maven.MavenEmbedder.<init>(MavenEmbedder.java:136)
	at hudson.maven.MavenUtil.createEmbedder(MavenUtil.java:212)
	at hudson.maven.MavenModuleSetBuild$PomParser.invoke(MavenModuleSetBuild.java:1295)
	at hudson.maven.MavenModuleSetBuild$PomParser.invoke(MavenModuleSetBuild.java:1098)
	at hudson.FilePath$FileCallableWrapper.call(FilePath.java:2688)
	at hudson.remoting.UserRequest.perform(UserRequest.java:121)
	at hudson.remoting.UserRequest.perform(UserRequest.java:49)
	at hudson.remoting.Request$2.run(Request.java:326)
	at hudson.remoting.InterceptingExecutorService$1.call(InterceptingExecutorService.java:68)
	at java.util.concurrent.FutureTask.run(FutureTask.java:262)
	at java.util.concurrent.ThreadPoolExecutor.runWorker(ThreadPoolExecutor.java:1145)
	at java.util.concurrent.ThreadPoolExecutor$Worker.run(ThreadPoolExecutor.java:615)
	at java.lang.Thread.run(Thread.java:745)
Caused by: hudson.remoting.ProxyException: hudson.maven.MavenEmbedderException: 1 problem
was encountered while building the effective settings
[FATAL] Non-readable settings /home/jenkins/.m2/settings.xml: input contained no data @ /home/jenkins/.m2/settings.xml

	at hudson.maven.MavenEmbedder.getSettings(MavenEmbedder.java:261)
	at hudson.maven.MavenEmbedder.buildMavenExecutionRequest(MavenEmbedder.java:157)
	at hudson.maven.MavenEmbedder.<init>(MavenEmbedder.java:120)
	... 14 more
Caused by: hudson.remoting.ProxyException: org.apache.maven.settings.building.SettingsBuildingException:
1 problem was encountered while building the effective settings
[FATAL] Non-readable settings /home/jenkins/.m2/settings.xml: input contained no data @ /home/jenkins/.m2/settings.xml

	at org.apache.maven.settings.building.DefaultSettingsBuilder.build(DefaultSettingsBuilder.java:116)
	at hudson.maven.MavenEmbedder.getSettings(MavenEmbedder.java:259)
	... 16 more

Mime
View raw message