deltaspike-commits mailing list archives

Site index · List index
Message view « Date » · « Thread »
Top « Date » · « Thread »
From Apache Jenkins Server <jenk...@builds.apache.org>
Subject Build failed in Jenkins: DeltaSpike_TomEE_1.7.0 #329
Date Thu, 04 Feb 2016 07:44:30 GMT
See <https://builds.apache.org/job/DeltaSpike_TomEE_1.7.0/329/changes>

Changes:

[gpetracek] DELTASPIKE-1072 improved build-config

[gpetracek] DELTASPIKE-1072 improved build-config

------------------------------------------
[...truncated 1180 lines...]
Downloaded: http://repo.maven.apache.org/maven2/org/apache/maven/plugins/maven-checkstyle-plugin/2.9.1/maven-checkstyle-plugin-2.9.1.jar
(85 KB at 1806.4 KB/sec)
Downloading: https://repository.apache.org/content/repositories/releases/junit/junit/4.10/junit-4.10.pom
Downloading: https://repository.apache.org/content/repositories/snapshots/junit/junit/4.10/junit-4.10.pom
Downloading: http://repo.maven.apache.org/maven2/junit/junit/4.10/junit-4.10.pom
Downloaded: http://repo.maven.apache.org/maven2/junit/junit/4.10/junit-4.10.pom (3 KB at 63.6
KB/sec)
Downloading: https://repository.apache.org/content/repositories/releases/org/hamcrest/hamcrest-core/1.1/hamcrest-core-1.1.pom
Downloading: https://repository.apache.org/content/repositories/snapshots/org/hamcrest/hamcrest-core/1.1/hamcrest-core-1.1.pom
Downloading: http://repo.maven.apache.org/maven2/org/hamcrest/hamcrest-core/1.1/hamcrest-core-1.1.pom
Downloaded: http://repo.maven.apache.org/maven2/org/hamcrest/hamcrest-core/1.1/hamcrest-core-1.1.pom
(481 B at 13.4 KB/sec)
Downloading: https://repository.apache.org/content/repositories/releases/org/hamcrest/hamcrest-parent/1.1/hamcrest-parent-1.1.pom
Downloading: https://repository.apache.org/content/repositories/snapshots/org/hamcrest/hamcrest-parent/1.1/hamcrest-parent-1.1.pom
Downloading: http://repo.maven.apache.org/maven2/org/hamcrest/hamcrest-parent/1.1/hamcrest-parent-1.1.pom
Downloaded: http://repo.maven.apache.org/maven2/org/hamcrest/hamcrest-parent/1.1/hamcrest-parent-1.1.pom
(6 KB at 164.0 KB/sec)
Downloading: https://repository.apache.org/content/repositories/releases/org/jboss/arquillian/junit/arquillian-junit-container/1.1.8.Final/arquillian-junit-container-1.1.8.Final.pom
Downloading: https://repository.apache.org/content/repositories/snapshots/org/jboss/arquillian/junit/arquillian-junit-container/1.1.8.Final/arquillian-junit-container-1.1.8.Final.pom
Downloading: http://repo.maven.apache.org/maven2/org/jboss/arquillian/junit/arquillian-junit-container/1.1.8.Final/arquillian-junit-container-1.1.8.Final.pom
Downloaded: http://repo.maven.apache.org/maven2/org/jboss/arquillian/junit/arquillian-junit-container/1.1.8.Final/arquillian-junit-container-1.1.8.Final.pom
(4 KB at 4.4 KB/sec)
Downloading: https://repository.apache.org/content/repositories/releases/org/jboss/arquillian/arquillian-build/1.1.8.Final/arquillian-build-1.1.8.Final.pom
Downloading: https://repository.apache.org/content/repositories/snapshots/org/jboss/arquillian/arquillian-build/1.1.8.Final/arquillian-build-1.1.8.Final.pom
Downloading: http://repo.maven.apache.org/maven2/org/jboss/arquillian/arquillian-build/1.1.8.Final/arquillian-build-1.1.8.Final.pom
Downloaded: http://repo.maven.apache.org/maven2/org/jboss/arquillian/arquillian-build/1.1.8.Final/arquillian-build-1.1.8.Final.pom
(4 KB at 98.4 KB/sec)
Downloading: https://repository.apache.org/content/repositories/releases/org/jboss/arquillian/arquillian-parent/1.1.8.Final/arquillian-parent-1.1.8.Final.pom
Downloading: https://repository.apache.org/content/repositories/snapshots/org/jboss/arquillian/arquillian-parent/1.1.8.Final/arquillian-parent-1.1.8.Final.pom
Downloading: http://repo.maven.apache.org/maven2/org/jboss/arquillian/arquillian-parent/1.1.8.Final/arquillian-parent-1.1.8.Final.pom
Downloaded: http://repo.maven.apache.org/maven2/org/jboss/arquillian/arquillian-parent/1.1.8.Final/arquillian-parent-1.1.8.Final.pom
(6 KB at 107.7 KB/sec)
Downloading: https://repository.apache.org/content/repositories/releases/org/jboss/jboss-parent/14/jboss-parent-14.pom
Downloading: https://repository.apache.org/content/repositories/snapshots/org/jboss/jboss-parent/14/jboss-parent-14.pom
Downloading: http://repo.maven.apache.org/maven2/org/jboss/jboss-parent/14/jboss-parent-14.pom
Downloaded: http://repo.maven.apache.org/maven2/org/jboss/jboss-parent/14/jboss-parent-14.pom
(32 KB at 935.5 KB/sec)
Downloading: https://repository.apache.org/content/repositories/releases/org/jboss/arquillian/junit/arquillian-junit-core/1.1.8.Final/arquillian-junit-core-1.1.8.Final.pom
Downloading: https://repository.apache.org/content/repositories/snapshots/org/jboss/arquillian/junit/arquillian-junit-core/1.1.8.Final/arquillian-junit-core-1.1.8.Final.pom
Downloading: http://repo.maven.apache.org/maven2/org/jboss/arquillian/junit/arquillian-junit-core/1.1.8.Final/arquillian-junit-core-1.1.8.Final.pom
Downloaded: http://repo.maven.apache.org/maven2/org/jboss/arquillian/junit/arquillian-junit-core/1.1.8.Final/arquillian-junit-core-1.1.8.Final.pom
(3 KB at 74.0 KB/sec)
Downloading: https://repository.apache.org/content/repositories/releases/org/jboss/arquillian/test/arquillian-test-spi/1.1.8.Final/arquillian-test-spi-1.1.8.Final.pom
Downloading: https://repository.apache.org/content/repositories/snapshots/org/jboss/arquillian/test/arquillian-test-spi/1.1.8.Final/arquillian-test-spi-1.1.8.Final.pom
Downloading: http://repo.maven.apache.org/maven2/org/jboss/arquillian/test/arquillian-test-spi/1.1.8.Final/arquillian-test-spi-1.1.8.Final.pom
Downloading: https://repository.apache.org/content/repositories/releases/org/jboss/arquillian/test/arquillian-test-api/1.1.8.Final/arquillian-test-api-1.1.8.Final.pom
Downloading: https://repository.apache.org/content/repositories/snapshots/org/jboss/arquillian/test/arquillian-test-api/1.1.8.Final/arquillian-test-api-1.1.8.Final.pom
Downloading: http://repo.maven.apache.org/maven2/org/jboss/arquillian/test/arquillian-test-api/1.1.8.Final/arquillian-test-api-1.1.8.Final.pom
Downloaded: http://repo.maven.apache.org/maven2/org/jboss/arquillian/test/arquillian-test-api/1.1.8.Final/arquillian-test-api-1.1.8.Final.pom
(2 KB at 34.8 KB/sec)
Downloading: https://repository.apache.org/content/repositories/releases/org/jboss/arquillian/core/arquillian-core-api/1.1.8.Final/arquillian-core-api-1.1.8.Final.pom
Downloading: https://repository.apache.org/content/repositories/snapshots/org/jboss/arquillian/core/arquillian-core-api/1.1.8.Final/arquillian-core-api-1.1.8.Final.pom
Downloading: http://repo.maven.apache.org/maven2/org/jboss/arquillian/core/arquillian-core-api/1.1.8.Final/arquillian-core-api-1.1.8.Final.pom
Downloaded: http://repo.maven.apache.org/maven2/org/jboss/arquillian/core/arquillian-core-api/1.1.8.Final/arquillian-core-api-1.1.8.Final.pom
(2 KB at 29.2 KB/sec)
Downloading: https://repository.apache.org/content/repositories/releases/org/jboss/arquillian/container/arquillian-container-test-api/1.1.8.Final/arquillian-container-test-api-1.1.8.Final.pom
Downloading: https://repository.apache.org/content/repositories/snapshots/org/jboss/arquillian/container/arquillian-container-test-api/1.1.8.Final/arquillian-container-test-api-1.1.8.Final.pom
Downloading: http://repo.maven.apache.org/maven2/org/jboss/arquillian/container/arquillian-container-test-api/1.1.8.Final/arquillian-container-test-api-1.1.8.Final.pom
Downloaded: http://repo.maven.apache.org/maven2/org/jboss/arquillian/container/arquillian-container-test-api/1.1.8.Final/arquillian-container-test-api-1.1.8.Final.pom
(2 KB at 34.8 KB/sec)
Downloading: https://repository.apache.org/content/repositories/releases/org/jboss/shrinkwrap/shrinkwrap-api/1.2.2/shrinkwrap-api-1.2.2.pom
Downloading: https://repository.apache.org/content/repositories/snapshots/org/jboss/shrinkwrap/shrinkwrap-api/1.2.2/shrinkwrap-api-1.2.2.pom
Downloading: http://repo.maven.apache.org/maven2/org/jboss/shrinkwrap/shrinkwrap-api/1.2.2/shrinkwrap-api-1.2.2.pom
Downloaded: http://repo.maven.apache.org/maven2/org/jboss/shrinkwrap/shrinkwrap-api/1.2.2/shrinkwrap-api-1.2.2.pom
(4 KB at 79.6 KB/sec)
Downloading: https://repository.apache.org/content/repositories/releases/org/jboss/shrinkwrap/shrinkwrap-parent/1.2.2/shrinkwrap-parent-1.2.2.pom
Downloading: https://repository.apache.org/content/repositories/snapshots/org/jboss/shrinkwrap/shrinkwrap-parent/1.2.2/shrinkwrap-parent-1.2.2.pom
Downloading: http://repo.maven.apache.org/maven2/org/jboss/shrinkwrap/shrinkwrap-parent/1.2.2/shrinkwrap-parent-1.2.2.pom
Downloaded: http://repo.maven.apache.org/maven2/org/jboss/shrinkwrap/shrinkwrap-parent/1.2.2/shrinkwrap-parent-1.2.2.pom
(11 KB at 331.0 KB/sec)
Downloading: https://repository.apache.org/content/repositories/releases/org/jboss/jboss-parent/8/jboss-parent-8.pom
Downloading: https://repository.apache.org/content/repositories/snapshots/org/jboss/jboss-parent/8/jboss-parent-8.pom
Downloading: http://repo.maven.apache.org/maven2/org/jboss/jboss-parent/8/jboss-parent-8.pom
Downloaded: http://repo.maven.apache.org/maven2/org/jboss/jboss-parent/8/jboss-parent-8.pom
(22 KB at 546.4 KB/sec)
Downloading: https://repository.apache.org/content/repositories/releases/org/jboss/arquillian/container/arquillian-container-test-spi/1.1.8.Final/arquillian-container-test-spi-1.1.8.Final.pom
Downloading: https://repository.apache.org/content/repositories/snapshots/org/jboss/arquillian/container/arquillian-container-test-spi/1.1.8.Final/arquillian-container-test-spi-1.1.8.Final.pom
Downloading: http://repo.maven.apache.org/maven2/org/jboss/arquillian/container/arquillian-container-test-spi/1.1.8.Final/arquillian-container-test-spi-1.1.8.Final.pom
Downloaded: http://repo.maven.apache.org/maven2/org/jboss/arquillian/container/arquillian-container-test-spi/1.1.8.Final/arquillian-container-test-spi-1.1.8.Final.pom
(2 KB at 47.7 KB/sec)
Downloading: https://repository.apache.org/content/repositories/releases/org/jboss/arquillian/container/arquillian-container-spi/1.1.8.Final/arquillian-container-spi-1.1.8.Final.pom
Downloading: https://repository.apache.org/content/repositories/snapshots/org/jboss/arquillian/container/arquillian-container-spi/1.1.8.Final/arquillian-container-spi-1.1.8.Final.pom
Downloading: http://repo.maven.apache.org/maven2/org/jboss/arquillian/container/arquillian-container-spi/1.1.8.Final/arquillian-container-spi-1.1.8.Final.pom
Downloaded: http://repo.maven.apache.org/maven2/org/jboss/arquillian/container/arquillian-container-spi/1.1.8.Final/arquillian-container-spi-1.1.8.Final.pom
(3 KB at 80.2 KB/sec)
Downloading: https://repository.apache.org/content/repositories/releases/org/jboss/arquillian/core/arquillian-core-spi/1.1.8.Final/arquillian-core-spi-1.1.8.Final.pom
Downloading: https://repository.apache.org/content/repositories/snapshots/org/jboss/arquillian/core/arquillian-core-spi/1.1.8.Final/arquillian-core-spi-1.1.8.Final.pom
Downloading: http://repo.maven.apache.org/maven2/org/jboss/arquillian/core/arquillian-core-spi/1.1.8.Final/arquillian-core-spi-1.1.8.Final.pom
Downloaded: http://repo.maven.apache.org/maven2/org/jboss/arquillian/core/arquillian-core-spi/1.1.8.Final/arquillian-core-spi-1.1.8.Final.pom
(2 KB at 39.7 KB/sec)
Downloading: https://repository.apache.org/content/repositories/releases/org/jboss/arquillian/config/arquillian-config-api/1.1.8.Final/arquillian-config-api-1.1.8.Final.pom
Downloading: https://repository.apache.org/content/repositories/snapshots/org/jboss/arquillian/config/arquillian-config-api/1.1.8.Final/arquillian-config-api-1.1.8.Final.pom
Downloading: http://repo.maven.apache.org/maven2/org/jboss/arquillian/config/arquillian-config-api/1.1.8.Final/arquillian-config-api-1.1.8.Final.pom
Downloaded: http://repo.maven.apache.org/maven2/org/jboss/arquillian/config/arquillian-config-api/1.1.8.Final/arquillian-config-api-1.1.8.Final.pom
(2 KB at 29.5 KB/sec)
Downloading: https://repository.apache.org/content/repositories/releases/org/jboss/shrinkwrap/descriptors/shrinkwrap-descriptors-api-base/2.0.0-alpha-7/shrinkwrap-descriptors-api-base-2.0.0-alpha-7.pom
Downloading: https://repository.apache.org/content/repositories/snapshots/org/jboss/shrinkwrap/descriptors/shrinkwrap-descriptors-api-base/2.0.0-alpha-7/shrinkwrap-descriptors-api-base-2.0.0-alpha-7.pom
Downloading: http://repo.maven.apache.org/maven2/org/jboss/shrinkwrap/descriptors/shrinkwrap-descriptors-api-base/2.0.0-alpha-7/shrinkwrap-descriptors-api-base-2.0.0-alpha-7.pom
Downloaded: http://repo.maven.apache.org/maven2/org/jboss/shrinkwrap/descriptors/shrinkwrap-descriptors-api-base/2.0.0-alpha-7/shrinkwrap-descriptors-api-base-2.0.0-alpha-7.pom
(2 KB at 29.6 KB/sec)
Downloading: https://repository.apache.org/content/repositories/releases/org/jboss/shrinkwrap/descriptors/shrinkwrap-descriptors-parent/2.0.0-alpha-7/shrinkwrap-descriptors-parent-2.0.0-alpha-7.pom
Downloading: https://repository.apache.org/content/repositories/snapshots/org/jboss/shrinkwrap/descriptors/shrinkwrap-descriptors-parent/2.0.0-alpha-7/shrinkwrap-descriptors-parent-2.0.0-alpha-7.pom
Downloading: http://repo.maven.apache.org/maven2/org/jboss/shrinkwrap/descriptors/shrinkwrap-descriptors-parent/2.0.0-alpha-7/shrinkwrap-descriptors-parent-2.0.0-alpha-7.pom
Downloaded: http://repo.maven.apache.org/maven2/org/jboss/shrinkwrap/descriptors/shrinkwrap-descriptors-parent/2.0.0-alpha-7/shrinkwrap-descriptors-parent-2.0.0-alpha-7.pom
(13 KB at 318.7 KB/sec)
Downloading: https://repository.apache.org/content/repositories/releases/org/jboss/jboss-parent/16/jboss-parent-16.pom
Downloading: https://repository.apache.org/content/repositories/snapshots/org/jboss/jboss-parent/16/jboss-parent-16.pom
Downloading: http://repo.maven.apache.org/maven2/org/jboss/jboss-parent/16/jboss-parent-16.pom
Downloaded: http://repo.maven.apache.org/maven2/org/jboss/jboss-parent/16/jboss-parent-16.pom
(31 KB at 789.5 KB/sec)
Downloading: https://repository.apache.org/content/repositories/releases/org/jboss/arquillian/config/arquillian-config-impl-base/1.1.8.Final/arquillian-config-impl-base-1.1.8.Final.pom
Downloading: https://repository.apache.org/content/repositories/snapshots/org/jboss/arquillian/config/arquillian-config-impl-base/1.1.8.Final/arquillian-config-impl-base-1.1.8.Final.pom
Downloading: http://repo.maven.apache.org/maven2/org/jboss/arquillian/config/arquillian-config-impl-base/1.1.8.Final/arquillian-config-impl-base-1.1.8.Final.pom
Downloaded: http://repo.maven.apache.org/maven2/org/jboss/arquillian/config/arquillian-config-impl-base/1.1.8.Final/arquillian-config-impl-base-1.1.8.Final.pom
(3 KB at 63.8 KB/sec)
Downloading: https://repository.apache.org/content/repositories/releases/org/jboss/shrinkwrap/descriptors/shrinkwrap-descriptors-spi/2.0.0-alpha-7/shrinkwrap-descriptors-spi-2.0.0-alpha-7.pom
Downloading: https://repository.apache.org/content/repositories/snapshots/org/jboss/shrinkwrap/descriptors/shrinkwrap-descriptors-spi/2.0.0-alpha-7/shrinkwrap-descriptors-spi-2.0.0-alpha-7.pom
Downloading: http://repo.maven.apache.org/maven2/org/jboss/shrinkwrap/descriptors/shrinkwrap-descriptors-spi/2.0.0-alpha-7/shrinkwrap-descriptors-spi-2.0.0-alpha-7.pom
Downloaded: http://repo.maven.apache.org/maven2/org/jboss/shrinkwrap/descriptors/shrinkwrap-descriptors-spi/2.0.0-alpha-7/shrinkwrap-descriptors-spi-2.0.0-alpha-7.pom
(2 KB at 60.5 KB/sec)
Downloading: https://repository.apache.org/content/repositories/releases/org/jboss/arquillian/core/arquillian-core-impl-base/1.1.8.Final/arquillian-core-impl-base-1.1.8.Final.pom
Downloading: https://repository.apache.org/content/repositories/snapshots/org/jboss/arquillian/core/arquillian-core-impl-base/1.1.8.Final/arquillian-core-impl-base-1.1.8.Final.pom
Downloading: http://repo.maven.apache.org/maven2/org/jboss/arquillian/core/arquillian-core-impl-base/1.1.8.Final/arquillian-core-impl-base-1.1.8.Final.pom
Downloaded: http://repo.maven.apache.org/maven2/org/jboss/arquillian/core/arquillian-core-impl-base/1.1.8.Final/arquillian-core-impl-base-1.1.8.Final.pom
(2 KB at 44.2 KB/sec)
Downloading: https://repository.apache.org/content/repositories/releases/org/jboss/arquillian/test/arquillian-test-impl-base/1.1.8.Final/arquillian-test-impl-base-1.1.8.Final.pom
Downloading: https://repository.apache.org/content/repositories/snapshots/org/jboss/arquillian/test/arquillian-test-impl-base/1.1.8.Final/arquillian-test-impl-base-1.1.8.Final.pom
Downloading: http://repo.maven.apache.org/maven2/org/jboss/arquillian/test/arquillian-test-impl-base/1.1.8.Final/arquillian-test-impl-base-1.1.8.Final.pom
Downloaded: http://repo.maven.apache.org/maven2/org/jboss/arquillian/test/arquillian-test-impl-base/1.1.8.Final/arquillian-test-impl-base-1.1.8.Final.pom
(3 KB at 59.1 KB/sec)
Downloading: https://repository.apache.org/content/repositories/releases/org/jboss/arquillian/container/arquillian-container-impl-base/1.1.8.Final/arquillian-container-impl-base-1.1.8.Final.pom
Downloading: https://repository.apache.org/content/repositories/snapshots/org/jboss/arquillian/container/arquillian-container-impl-base/1.1.8.Final/arquillian-container-impl-base-1.1.8.Final.pom
Downloading: http://repo.maven.apache.org/maven2/org/jboss/arquillian/container/arquillian-container-impl-base/1.1.8.Final/arquillian-container-impl-base-1.1.8.Final.pom
Downloaded: http://repo.maven.apache.org/maven2/org/jboss/arquillian/container/arquillian-container-impl-base/1.1.8.Final/arquillian-container-impl-base-1.1.8.Final.pom
(4 KB at 100.7 KB/sec)
Downloading: https://repository.apache.org/content/repositories/releases/org/jboss/arquillian/container/arquillian-container-test-impl-base/1.1.8.Final/arquillian-container-test-impl-base-1.1.8.Final.pom
Downloading: https://repository.apache.org/content/repositories/snapshots/org/jboss/arquillian/container/arquillian-container-test-impl-base/1.1.8.Final/arquillian-container-test-impl-base-1.1.8.Final.pom
Downloading: http://repo.maven.apache.org/maven2/org/jboss/arquillian/container/arquillian-container-test-impl-base/1.1.8.Final/arquillian-container-test-impl-base-1.1.8.Final.pom
Downloaded: http://repo.maven.apache.org/maven2/org/jboss/arquillian/container/arquillian-container-test-impl-base/1.1.8.Final/arquillian-container-test-impl-base-1.1.8.Final.pom
(4 KB at 92.6 KB/sec)
Downloading: https://repository.apache.org/content/repositories/releases/org/jboss/shrinkwrap/shrinkwrap-impl-base/1.2.2/shrinkwrap-impl-base-1.2.2.pom
Downloading: https://repository.apache.org/content/repositories/snapshots/org/jboss/shrinkwrap/shrinkwrap-impl-base/1.2.2/shrinkwrap-impl-base-1.2.2.pom
Downloading: http://repo.maven.apache.org/maven2/org/jboss/shrinkwrap/shrinkwrap-impl-base/1.2.2/shrinkwrap-impl-base-1.2.2.pom
Downloaded: http://repo.maven.apache.org/maven2/org/jboss/shrinkwrap/shrinkwrap-impl-base/1.2.2/shrinkwrap-impl-base-1.2.2.pom
(4 KB at 97.6 KB/sec)
Downloading: https://repository.apache.org/content/repositories/releases/org/jboss/shrinkwrap/shrinkwrap-spi/1.2.2/shrinkwrap-spi-1.2.2.pom
Downloading: https://repository.apache.org/content/repositories/snapshots/org/jboss/shrinkwrap/shrinkwrap-spi/1.2.2/shrinkwrap-spi-1.2.2.pom
Downloading: http://repo.maven.apache.org/maven2/org/jboss/shrinkwrap/shrinkwrap-spi/1.2.2/shrinkwrap-spi-1.2.2.pom
Downloaded: http://repo.maven.apache.org/maven2/org/jboss/shrinkwrap/shrinkwrap-spi/1.2.2/shrinkwrap-spi-1.2.2.pom
(2 KB at 31.7 KB/sec)
[INFO] ------------------------------------------------------------------------
[INFO] Reactor Summary:
[INFO] 
[INFO] Apache DeltaSpike Sources ......................... SUCCESS [22.486s]
[INFO] Apache DeltaSpike CheckStyle-rules ................ SUCCESS [5.049s]
[INFO] Apache DeltaSpike Parent .......................... FAILURE [1:55.704s]
[INFO] Apache DeltaSpike Test-Utils ...................... SKIPPED
[INFO] Apache DeltaSpike Code Parent ..................... SKIPPED
[INFO] Apache DeltaSpike Core ............................ SKIPPED
[INFO] Apache DeltaSpike Core-API ........................ SKIPPED
[INFO] Apache DeltaSpike Core-Implementation ............. SKIPPED
[INFO] Apache DeltaSpike ContainerControl parent ......... SKIPPED
[INFO] Apache DeltaSpike CDI ContainerControl API ........ SKIPPED
[INFO] Apache DeltaSpike CDI ContainerControl TCK ........ SKIPPED
[INFO] Apache DeltaSpike CDI OpenEJB-ContainerControl .... SKIPPED
[INFO] Apache DeltaSpike Modules ......................... SKIPPED
[INFO] Apache DeltaSpike Proxy-Module .................... SKIPPED
[INFO] Apache DeltaSpike Proxy-Module API ................ SKIPPED
[INFO] Apache DeltaSpike Proxy-Module Impl ASM5 .......... SKIPPED
[INFO] Apache DeltaSpike Security-Module ................. SKIPPED
[INFO] Apache DeltaSpike Security-Module API ............. SKIPPED
[INFO] Apache DeltaSpike Security-Module Impl ............ SKIPPED
[INFO] Apache DeltaSpike JPA-Module ...................... SKIPPED
[INFO] Apache DeltaSpike JPA-Module API .................. SKIPPED
[INFO] Apache DeltaSpike JPA-Module Impl ................. SKIPPED
[INFO] Apache DeltaSpike Servlet-Module .................. SKIPPED
[INFO] Apache DeltaSpike Servlet-Module API .............. SKIPPED
[INFO] Apache DeltaSpike Servlet-Module Impl ............. SKIPPED
[INFO] Apache DeltaSpike JSF-Module ...................... SKIPPED
[INFO] Apache DeltaSpike JSF-Module API .................. SKIPPED
[INFO] Apache DeltaSpike JSF-Module Impl ................. SKIPPED
[INFO] Apache DeltaSpike JSF-Module Impl (EE6 only) ...... SKIPPED
[INFO] Apache DeltaSpike Partial-Bean-Module ............. SKIPPED
[INFO] Apache DeltaSpike Partial-Bean-Module API ......... SKIPPED
[INFO] Apache DeltaSpike Partial-Bean-Module Impl ........ SKIPPED
[INFO] Apache DeltaSpike BeanValidation-Module ........... SKIPPED
[INFO] Apache DeltaSpike BeanValidation-Module API ....... SKIPPED
[INFO] Apache DeltaSpike BeanValidation-Module Impl ...... SKIPPED
[INFO] Apache DeltaSpike Data-Module ..................... SKIPPED
[INFO] Apache DeltaSpike Data-Module API ................. SKIPPED
[INFO] Apache DeltaSpike Data-Module Impl ................ SKIPPED
[INFO] Apache DeltaSpike Data-Module Tests on Java EE 7 .. SKIPPED
[INFO] Apache DeltaSpike Scheduler-Module ................ SKIPPED
[INFO] Apache DeltaSpike Scheduler-Module API ............ SKIPPED
[INFO] Apache DeltaSpike Scheduler-Module Impl ........... SKIPPED
[INFO] Apache DeltaSpike Test-Control-Module ............. SKIPPED
[INFO] Apache DeltaSpike Test-Control-Module API ......... SKIPPED
[INFO] Apache DeltaSpike Test-Control-Module Impl ........ SKIPPED
[INFO] Apache DeltaSpike Examples ........................ SKIPPED
[INFO] Apache DeltaSpike Java-SE Examples ................ SKIPPED
[INFO] Apache DeltaSpike JSF Examples .................... SKIPPED
[INFO] Apache DeltaSpike JSF Playground .................. SKIPPED
[INFO] Apache DeltaSpike Security Example CDI ............ SKIPPED
[INFO] Apache DeltaSpike Security Example PicketLink ..... SKIPPED
[INFO] Apache DeltaSpike Java-SE Scheduler Examples ...... SKIPPED
[INFO] ------------------------------------------------------------------------
[INFO] BUILD FAILURE
[INFO] ------------------------------------------------------------------------
[INFO] Total time: 2:34.480s
[INFO] Finished at: Thu Feb 04 07:43:02 UTC 2016
[INFO] Final Memory: 32M/408M
[INFO] ------------------------------------------------------------------------
Waiting for Jenkins to finish collecting data
[ERROR] Failed to execute goal on project parent: Could not resolve dependencies for project
org.apache.deltaspike:parent:pom:1.5.3-SNAPSHOT: Failed to collect dependencies for [junit:junit:jar:4.10
(test), org.jboss.arquillian.junit:arquillian-junit-container:jar:1.1.8.Final (test)]: Failed
to read artifact descriptor for org.jboss.arquillian.test:arquillian-test-spi:jar:1.1.8.Final:
Could not transfer artifact org.jboss.arquillian.test:arquillian-test-spi:pom:1.1.8.Final
from/to Apache Repository (https://repository.apache.org/content/repositories/releases): java.lang.RuntimeException:
Could not generate DH keypair: Prime size must be multiple of 64, and can only range from
512 to 1024 (inclusive) -> [Help 1]
[ERROR] 
[ERROR] To see the full stack trace of the errors, re-run Maven with the -e switch.
[ERROR] Re-run Maven using the -X switch to enable full debug logging.
[ERROR] 
[ERROR] For more information about the errors and possible solutions, please read the following
articles:
[ERROR] [Help 1] http://cwiki.apache.org/confluence/display/MAVEN/DependencyResolutionException
[ERROR] 
[ERROR] After correcting the problems, you can resume the build with the command
[ERROR]   mvn <goals> -rf :parent
[JENKINS] Archiving <https://builds.apache.org/job/DeltaSpike_TomEE_1.7.0/ws/deltaspike/examples/jse-examples/pom.xml>
to org.apache.deltaspike.examples/deltaspike-jse-example/1.5.3-SNAPSHOT/deltaspike-jse-example-1.5.3-SNAPSHOT.pom
[JENKINS] Archiving <https://builds.apache.org/job/DeltaSpike_TomEE_1.7.0/ws/deltaspike/examples/security-requested-page-after-login-cdi/pom.xml>
to org.apache.deltaspike.examples/deltaspike-security-requested-page-after-login-cdi/1.5.3-SNAPSHOT/deltaspike-security-requested-page-after-login-cdi-1.5.3-SNAPSHOT.pom
[JENKINS] Archiving <https://builds.apache.org/job/DeltaSpike_TomEE_1.7.0/ws/deltaspike/test-utils/pom.xml>
to org.apache.deltaspike.test/test-utils/1.5.3-SNAPSHOT/test-utils-1.5.3-SNAPSHOT.pom
[JENKINS] Archiving <https://builds.apache.org/job/DeltaSpike_TomEE_1.7.0/ws/deltaspike/modules/data/impl/pom.xml>
to org.apache.deltaspike.modules/deltaspike-data-module-impl/1.5.3-SNAPSHOT/deltaspike-data-module-impl-1.5.3-SNAPSHOT.pom
[JENKINS] Archiving <https://builds.apache.org/job/DeltaSpike_TomEE_1.7.0/ws/deltaspike/modules/data/api/pom.xml>
to org.apache.deltaspike.modules/deltaspike-data-module-api/1.5.3-SNAPSHOT/deltaspike-data-module-api-1.5.3-SNAPSHOT.pom
[JENKINS] Archiving <https://builds.apache.org/job/DeltaSpike_TomEE_1.7.0/ws/deltaspike/core/impl/pom.xml>
to org.apache.deltaspike.core/deltaspike-core-impl/1.5.3-SNAPSHOT/deltaspike-core-impl-1.5.3-SNAPSHOT.pom
[JENKINS] Archiving <https://builds.apache.org/job/DeltaSpike_TomEE_1.7.0/ws/deltaspike/modules/pom.xml>
to org.apache.deltaspike.modules/modules-project/1.5.3-SNAPSHOT/modules-project-1.5.3-SNAPSHOT.pom
[JENKINS] Archiving <https://builds.apache.org/job/DeltaSpike_TomEE_1.7.0/ws/deltaspike/modules/test-control/pom.xml>
to org.apache.deltaspike.modules/test-control-module-project/1.5.3-SNAPSHOT/test-control-module-project-1.5.3-SNAPSHOT.pom
[JENKINS] Archiving <https://builds.apache.org/job/DeltaSpike_TomEE_1.7.0/ws/deltaspike/examples/jsf-examples/pom.xml>
to org.apache.deltaspike.examples/deltaspike-jsf-example/1.5.3-SNAPSHOT/deltaspike-jsf-example-1.5.3-SNAPSHOT.pom
[JENKINS] Archiving <https://builds.apache.org/job/DeltaSpike_TomEE_1.7.0/ws/deltaspike/cdictrl/api/pom.xml>
to org.apache.deltaspike.cdictrl/deltaspike-cdictrl-api/1.5.3-SNAPSHOT/deltaspike-cdictrl-api-1.5.3-SNAPSHOT.pom
[JENKINS] Archiving <https://builds.apache.org/job/DeltaSpike_TomEE_1.7.0/ws/deltaspike/examples/scheduler-playground/pom.xml>
to org.apache.deltaspike.examples/deltaspike-scheduler-example/1.5.3-SNAPSHOT/deltaspike-scheduler-example-1.5.3-SNAPSHOT.pom
[JENKINS] Archiving <https://builds.apache.org/job/DeltaSpike_TomEE_1.7.0/ws/deltaspike/checkstyle-rules/pom.xml>
to org.apache.deltaspike/checkstyle-rules/1.5.3-SNAPSHOT/checkstyle-rules-1.5.3-SNAPSHOT.pom
[JENKINS] Archiving <https://builds.apache.org/job/DeltaSpike_TomEE_1.7.0/ws/deltaspike/checkstyle-rules/target/checkstyle-rules-1.5.3-SNAPSHOT.jar>
to org.apache.deltaspike/checkstyle-rules/1.5.3-SNAPSHOT/checkstyle-rules-1.5.3-SNAPSHOT.jar
[JENKINS] Archiving <https://builds.apache.org/job/DeltaSpike_TomEE_1.7.0/ws/deltaspike/parent/code/pom.xml>
to org.apache.deltaspike/parent-code/1.5.3-SNAPSHOT/parent-code-1.5.3-SNAPSHOT.pom
[JENKINS] Archiving <https://builds.apache.org/job/DeltaSpike_TomEE_1.7.0/ws/deltaspike/modules/jsf/impl/pom.xml>
to org.apache.deltaspike.modules/deltaspike-jsf-module-impl/1.5.3-SNAPSHOT/deltaspike-jsf-module-impl-1.5.3-SNAPSHOT.pom
[JENKINS] Archiving <https://builds.apache.org/job/DeltaSpike_TomEE_1.7.0/ws/deltaspike/modules/partial-bean/pom.xml>
to org.apache.deltaspike.modules/partial-bean-module-project/1.5.3-SNAPSHOT/partial-bean-module-project-1.5.3-SNAPSHOT.pom
[JENKINS] Archiving <https://builds.apache.org/job/DeltaSpike_TomEE_1.7.0/ws/deltaspike/examples/pom.xml>
to org.apache.deltaspike.examples/examples-project/1.5.3-SNAPSHOT/examples-project-1.5.3-SNAPSHOT.pom
[JENKINS] Archiving <https://builds.apache.org/job/DeltaSpike_TomEE_1.7.0/ws/deltaspike/cdictrl/impl-openejb/pom.xml>
to org.apache.deltaspike.cdictrl/deltaspike-cdictrl-openejb/1.5.3-SNAPSHOT/deltaspike-cdictrl-openejb-1.5.3-SNAPSHOT.pom
[JENKINS] Archiving <https://builds.apache.org/job/DeltaSpike_TomEE_1.7.0/ws/deltaspike/modules/jsf/pom.xml>
to org.apache.deltaspike.modules/jsf-module-project/1.5.3-SNAPSHOT/jsf-module-project-1.5.3-SNAPSHOT.pom
[JENKINS] Archiving <https://builds.apache.org/job/DeltaSpike_TomEE_1.7.0/ws/deltaspike/cdictrl/tck/pom.xml>
to org.apache.deltaspike.test/deltaspike-cdictrl-tck/1.5.3-SNAPSHOT/deltaspike-cdictrl-tck-1.5.3-SNAPSHOT.pom
[JENKINS] Archiving <https://builds.apache.org/job/DeltaSpike_TomEE_1.7.0/ws/deltaspike/modules/jsf/api/pom.xml>
to org.apache.deltaspike.modules/deltaspike-jsf-module-api/1.5.3-SNAPSHOT/deltaspike-jsf-module-api-1.5.3-SNAPSHOT.pom
[JENKINS] Archiving <https://builds.apache.org/job/DeltaSpike_TomEE_1.7.0/ws/deltaspike/modules/security/pom.xml>
to org.apache.deltaspike.modules/security-module-project/1.5.3-SNAPSHOT/security-module-project-1.5.3-SNAPSHOT.pom
[JENKINS] Archiving <https://builds.apache.org/job/DeltaSpike_TomEE_1.7.0/ws/deltaspike/modules/bean-validation/pom.xml>
to org.apache.deltaspike.modules/bean-validation-module-project/1.5.3-SNAPSHOT/bean-validation-module-project-1.5.3-SNAPSHOT.pom
[JENKINS] Archiving <https://builds.apache.org/job/DeltaSpike_TomEE_1.7.0/ws/deltaspike/modules/partial-bean/impl/pom.xml>
to org.apache.deltaspike.modules/deltaspike-partial-bean-module-impl/1.5.3-SNAPSHOT/deltaspike-partial-bean-module-impl-1.5.3-SNAPSHOT.pom
[JENKINS] Archiving <https://builds.apache.org/job/DeltaSpike_TomEE_1.7.0/ws/deltaspike/modules/proxy/api/pom.xml>
to org.apache.deltaspike.modules/deltaspike-proxy-module-api/1.5.3-SNAPSHOT/deltaspike-proxy-module-api-1.5.3-SNAPSHOT.pom
[JENKINS] Archiving <https://builds.apache.org/job/DeltaSpike_TomEE_1.7.0/ws/deltaspike/modules/jpa/api/pom.xml>
to org.apache.deltaspike.modules/deltaspike-jpa-module-api/1.5.3-SNAPSHOT/deltaspike-jpa-module-api-1.5.3-SNAPSHOT.pom
[JENKINS] Archiving <https://builds.apache.org/job/DeltaSpike_TomEE_1.7.0/ws/deltaspike/modules/servlet/api/pom.xml>
to org.apache.deltaspike.modules/deltaspike-servlet-module-api/1.5.3-SNAPSHOT/deltaspike-servlet-module-api-1.5.3-SNAPSHOT.pom
[JENKINS] Archiving <https://builds.apache.org/job/DeltaSpike_TomEE_1.7.0/ws/deltaspike/modules/jpa/pom.xml>
to org.apache.deltaspike.modules/jpa-module-project/1.5.3-SNAPSHOT/jpa-module-project-1.5.3-SNAPSHOT.pom
[JENKINS] Archiving <https://builds.apache.org/job/DeltaSpike_TomEE_1.7.0/ws/deltaspike/cdictrl/pom.xml>
to org.apache.deltaspike.cdictrl/cdictrl-project/1.5.3-SNAPSHOT/cdictrl-project-1.5.3-SNAPSHOT.pom
[JENKINS] Archiving <https://builds.apache.org/job/DeltaSpike_TomEE_1.7.0/ws/deltaspike/modules/scheduler/api/pom.xml>
to org.apache.deltaspike.modules/deltaspike-scheduler-module-api/1.5.3-SNAPSHOT/deltaspike-scheduler-module-api-1.5.3-SNAPSHOT.pom
[JENKINS] Archiving <https://builds.apache.org/job/DeltaSpike_TomEE_1.7.0/ws/deltaspike/modules/test-control/impl/pom.xml>
to org.apache.deltaspike.modules/deltaspike-test-control-module-impl/1.5.3-SNAPSHOT/deltaspike-test-control-module-impl-1.5.3-SNAPSHOT.pom
[JENKINS] Archiving <https://builds.apache.org/job/DeltaSpike_TomEE_1.7.0/ws/deltaspike/modules/servlet/pom.xml>
to org.apache.deltaspike.modules/servlet-module-project/1.5.3-SNAPSHOT/servlet-module-project-1.5.3-SNAPSHOT.pom
[JENKINS] Archiving <https://builds.apache.org/job/DeltaSpike_TomEE_1.7.0/ws/deltaspike/modules/test-control/api/pom.xml>
to org.apache.deltaspike.modules/deltaspike-test-control-module-api/1.5.3-SNAPSHOT/deltaspike-test-control-module-api-1.5.3-SNAPSHOT.pom
[JENKINS] Archiving <https://builds.apache.org/job/DeltaSpike_TomEE_1.7.0/ws/deltaspike/modules/jsf/impl-ee6/pom.xml>
to org.apache.deltaspike.modules/deltaspike-jsf-module-impl-ee6/1.5.3-SNAPSHOT/deltaspike-jsf-module-impl-ee6-1.5.3-SNAPSHOT.pom
[JENKINS] Archiving <https://builds.apache.org/job/DeltaSpike_TomEE_1.7.0/ws/deltaspike/modules/proxy/pom.xml>
to org.apache.deltaspike.modules/proxy-module-project/1.5.3-SNAPSHOT/proxy-module-project-1.5.3-SNAPSHOT.pom
[JENKINS] Archiving <https://builds.apache.org/job/DeltaSpike_TomEE_1.7.0/ws/deltaspike/modules/partial-bean/api/pom.xml>
to org.apache.deltaspike.modules/deltaspike-partial-bean-module-api/1.5.3-SNAPSHOT/deltaspike-partial-bean-module-api-1.5.3-SNAPSHOT.pom
[JENKINS] Archiving <https://builds.apache.org/job/DeltaSpike_TomEE_1.7.0/ws/deltaspike/modules/scheduler/impl/pom.xml>
to org.apache.deltaspike.modules/deltaspike-scheduler-module-impl/1.5.3-SNAPSHOT/deltaspike-scheduler-module-impl-1.5.3-SNAPSHOT.pom
[JENKINS] Archiving <https://builds.apache.org/job/DeltaSpike_TomEE_1.7.0/ws/deltaspike/parent/pom.xml>
to org.apache.deltaspike/parent/1.5.3-SNAPSHOT/parent-1.5.3-SNAPSHOT.pom
Compressed 39.92 KB of artifacts by 80.2% relative to #328
[JENKINS] Archiving <https://builds.apache.org/job/DeltaSpike_TomEE_1.7.0/ws/deltaspike/core/pom.xml>
to org.apache.deltaspike.core/core-project/1.5.3-SNAPSHOT/core-project-1.5.3-SNAPSHOT.pom
[JENKINS] Archiving <https://builds.apache.org/job/DeltaSpike_TomEE_1.7.0/ws/deltaspike/modules/bean-validation/api/pom.xml>
to org.apache.deltaspike.modules/deltaspike-bean-validation-module-api/1.5.3-SNAPSHOT/deltaspike-bean-validation-module-api-1.5.3-SNAPSHOT.pom
[JENKINS] Archiving <https://builds.apache.org/job/DeltaSpike_TomEE_1.7.0/ws/deltaspike/core/api/pom.xml>
to org.apache.deltaspike.core/deltaspike-core-api/1.5.3-SNAPSHOT/deltaspike-core-api-1.5.3-SNAPSHOT.pom
[JENKINS] Archiving <https://builds.apache.org/job/DeltaSpike_TomEE_1.7.0/ws/deltaspike/modules/security/impl/pom.xml>
to org.apache.deltaspike.modules/deltaspike-security-module-impl/1.5.3-SNAPSHOT/deltaspike-security-module-impl-1.5.3-SNAPSHOT.pom
[JENKINS] Archiving <https://builds.apache.org/job/DeltaSpike_TomEE_1.7.0/ws/deltaspike/modules/scheduler/pom.xml>
to org.apache.deltaspike.modules/scheduler-module-project/1.5.3-SNAPSHOT/scheduler-module-project-1.5.3-SNAPSHOT.pom
[JENKINS] Archiving <https://builds.apache.org/job/DeltaSpike_TomEE_1.7.0/ws/deltaspike/modules/proxy/impl-asm5/pom.xml>
to org.apache.deltaspike.modules/deltaspike-proxy-module-impl-asm5/1.5.3-SNAPSHOT/deltaspike-proxy-module-impl-asm5-1.5.3-SNAPSHOT.pom
[JENKINS] Archiving <https://builds.apache.org/job/DeltaSpike_TomEE_1.7.0/ws/deltaspike/examples/jsf-playground/pom.xml>
to org.apache.deltaspike.examples/deltaspike-jsf-playground/1.5.3-SNAPSHOT/deltaspike-jsf-playground-1.5.3-SNAPSHOT.pom
[JENKINS] Archiving <https://builds.apache.org/job/DeltaSpike_TomEE_1.7.0/ws/deltaspike/modules/servlet/impl/pom.xml>
to org.apache.deltaspike.modules/deltaspike-servlet-module-impl/1.5.3-SNAPSHOT/deltaspike-servlet-module-impl-1.5.3-SNAPSHOT.pom
[JENKINS] Archiving <https://builds.apache.org/job/DeltaSpike_TomEE_1.7.0/ws/deltaspike/modules/bean-validation/impl/pom.xml>
to org.apache.deltaspike.modules/deltaspike-bean-validation-module-impl/1.5.3-SNAPSHOT/deltaspike-bean-validation-module-impl-1.5.3-SNAPSHOT.pom
[JENKINS] Archiving <https://builds.apache.org/job/DeltaSpike_TomEE_1.7.0/ws/deltaspike/modules/data/test-ee7/pom.xml>
to org.apache.deltaspike.modules/deltaspike-data-module-test-ee7/1.5.3-SNAPSHOT/deltaspike-data-module-test-ee7-1.5.3-SNAPSHOT.pom
[JENKINS] Archiving <https://builds.apache.org/job/DeltaSpike_TomEE_1.7.0/ws/deltaspike/modules/jpa/impl/pom.xml>
to org.apache.deltaspike.modules/deltaspike-jpa-module-impl/1.5.3-SNAPSHOT/deltaspike-jpa-module-impl-1.5.3-SNAPSHOT.pom
[JENKINS] Archiving <https://builds.apache.org/job/DeltaSpike_TomEE_1.7.0/ws/deltaspike/modules/data/pom.xml>
to org.apache.deltaspike.modules/data-module-project/1.5.3-SNAPSHOT/data-module-project-1.5.3-SNAPSHOT.pom
[JENKINS] Archiving <https://builds.apache.org/job/DeltaSpike_TomEE_1.7.0/ws/deltaspike/examples/security-requested-page-after-login-picketlink/pom.xml>
to org.apache.deltaspike.examples/deltaspike-security-requested-page-after-login-picketlink/1.5.3-SNAPSHOT/deltaspike-security-requested-page-after-login-picketlink-1.5.3-SNAPSHOT.pom
[JENKINS] Archiving <https://builds.apache.org/job/DeltaSpike_TomEE_1.7.0/ws/deltaspike/pom.xml>
to org.apache.deltaspike/deltaspike-project/1.5.3-SNAPSHOT/deltaspike-project-1.5.3-SNAPSHOT.pom
[JENKINS] Archiving <https://builds.apache.org/job/DeltaSpike_TomEE_1.7.0/ws/deltaspike/modules/security/api/pom.xml>
to org.apache.deltaspike.modules/deltaspike-security-module-api/1.5.3-SNAPSHOT/deltaspike-security-module-api-1.5.3-SNAPSHOT.pom
Sending e-mails to: commits@deltaspike.apache.org
channel stopped

Mime
View raw message