deltaspike-commits mailing list archives

Site index · List index
Message view « Date » · « Thread »
Top « Date » · « Thread »
From Apache Jenkins Server <jenk...@builds.apache.org>
Subject Build failed in Jenkins: DeltaSpike Weld 1.1.22 #225
Date Fri, 12 Feb 2016 08:15:48 GMT
See <https://builds.apache.org/job/DeltaSpike%20Weld%201.1.22/225/changes>

Changes:

[gpetracek] [maven-release-plugin] prepare release deltaspike-1.5.3

[gpetracek] [maven-release-plugin] prepare for next development iteration

[gpetracek] DELTASPIKE-1075 information about v1.5.3

------------------------------------------
[...truncated 1611 lines...]
[INFO] --- maven-install-plugin:2.5.1:install (default-install) @ deltaspike-cdictrl-api ---
[INFO] Installing <https://builds.apache.org/job/DeltaSpike%20Weld%201.1.22/ws/deltaspike/cdictrl/api/target/deltaspike-cdictrl-api-1.5.4-SNAPSHOT.jar>
to /jenkins/maven-repositories/0/org/apache/deltaspike/cdictrl/deltaspike-cdictrl-api/1.5.4-SNAPSHOT/deltaspike-cdictrl-api-1.5.4-SNAPSHOT.jar
[INFO] Installing <https://builds.apache.org/job/DeltaSpike%20Weld%201.1.22/ws/deltaspike/cdictrl/api/pom.xml>
to /jenkins/maven-repositories/0/org/apache/deltaspike/cdictrl/deltaspike-cdictrl-api/1.5.4-SNAPSHOT/deltaspike-cdictrl-api-1.5.4-SNAPSHOT.pom
[INFO] Installing <https://builds.apache.org/job/DeltaSpike%20Weld%201.1.22/ws/deltaspike/cdictrl/api/target/deltaspike-cdictrl-api-1.5.4-SNAPSHOT-sources.jar>
to /jenkins/maven-repositories/0/org/apache/deltaspike/cdictrl/deltaspike-cdictrl-api/1.5.4-SNAPSHOT/deltaspike-cdictrl-api-1.5.4-SNAPSHOT-sources.jar
[INFO]                                                                         
[INFO] ------------------------------------------------------------------------
[INFO] Building Apache DeltaSpike CDI Weld-ContainerControl 1.5.4-SNAPSHOT
[INFO] ------------------------------------------------------------------------
Downloading: https://repository.apache.org/content/repositories/releases/javax/enterprise/cdi-api/1.0-SP3/cdi-api-1.0-SP3.pom
Downloading: https://repository.apache.org/content/repositories/snapshots/javax/enterprise/cdi-api/1.0-SP3/cdi-api-1.0-SP3.pom
Downloading: http://repo.maven.apache.org/maven2/javax/enterprise/cdi-api/1.0-SP3/cdi-api-1.0-SP3.pom
Downloaded: http://repo.maven.apache.org/maven2/javax/enterprise/cdi-api/1.0-SP3/cdi-api-1.0-SP3.pom
(7 KB at 139.9 KB/sec)
Downloading: https://repository.apache.org/content/repositories/releases/ch/qos/cal10n/cal10n-api/0.7.4/cal10n-api-0.7.4.pom
Downloading: https://repository.apache.org/content/repositories/snapshots/ch/qos/cal10n/cal10n-api/0.7.4/cal10n-api-0.7.4.pom
Downloading: http://repo.maven.apache.org/maven2/ch/qos/cal10n/cal10n-api/0.7.4/cal10n-api-0.7.4.pom
Downloaded: http://repo.maven.apache.org/maven2/ch/qos/cal10n/cal10n-api/0.7.4/cal10n-api-0.7.4.pom
(2 KB at 44.5 KB/sec)
Downloading: https://repository.apache.org/content/repositories/releases/ch/qos/cal10n/cal10n-parent/0.7.4/cal10n-parent-0.7.4.pom
Downloading: https://repository.apache.org/content/repositories/snapshots/ch/qos/cal10n/cal10n-parent/0.7.4/cal10n-parent-0.7.4.pom
Downloading: http://repo.maven.apache.org/maven2/ch/qos/cal10n/cal10n-parent/0.7.4/cal10n-parent-0.7.4.pom
Downloaded: http://repo.maven.apache.org/maven2/ch/qos/cal10n/cal10n-parent/0.7.4/cal10n-parent-0.7.4.pom
(8 KB at 219.2 KB/sec)
Downloading: https://repository.apache.org/content/repositories/releases/org/jboss/weld/se/weld-se-core/1.1.22.Final/weld-se-core-1.1.22.Final.jar
Downloading: https://repository.apache.org/content/repositories/snapshots/org/jboss/weld/se/weld-se-core/1.1.22.Final/weld-se-core-1.1.22.Final.jar
Downloading: http://repo.maven.apache.org/maven2/org/jboss/weld/se/weld-se-core/1.1.22.Final/weld-se-core-1.1.22.Final.jar
Downloaded: http://repo.maven.apache.org/maven2/org/jboss/weld/se/weld-se-core/1.1.22.Final/weld-se-core-1.1.22.Final.jar
(33 KB at 243.4 KB/sec)
[INFO] 
[INFO] --- maven-clean-plugin:2.5:clean (default-clean) @ deltaspike-cdictrl-weld ---
[INFO] 
[INFO] --- maven-bundle-plugin:2.3.7:cleanVersions (versions) @ deltaspike-cdictrl-weld ---
[INFO] 
[INFO] --- maven-antrun-plugin:1.7:run (javadoc.resources) @ deltaspike-cdictrl-weld ---
[WARNING] Parameter tasks is deprecated, use target instead
[INFO] Executing tasks

main:
[INFO] Executed tasks
[INFO] 
[INFO] --- maven-remote-resources-plugin:1.5:process (default) @ deltaspike-cdictrl-weld ---
Downloading: https://repository.apache.org/content/repositories/releases/org/jboss/weld/weld-core-parent/1.1.22.Final/weld-core-parent-1.1.22.Final.pom
Downloading: https://repository.apache.org/content/repositories/snapshots/org/jboss/weld/weld-core-parent/1.1.22.Final/weld-core-parent-1.1.22.Final.pom
Downloading: http://repo.maven.apache.org/maven2/org/jboss/weld/weld-core-parent/1.1.22.Final/weld-core-parent-1.1.22.Final.pom
Downloaded: http://repo.maven.apache.org/maven2/org/jboss/weld/weld-core-parent/1.1.22.Final/weld-core-parent-1.1.22.Final.pom
(0 B at 0.0 KB/sec)
[INFO] 
[INFO] --- maven-resources-plugin:2.6:resources (default-resources) @ deltaspike-cdictrl-weld
---
[INFO] Using 'UTF-8' encoding to copy filtered resources.
[INFO] Copying 2 resources
[INFO] Copying 3 resources
[INFO] 
[INFO] --- maven-compiler-plugin:2.5:compile (default-compile) @ deltaspike-cdictrl-weld ---
[INFO] Compiling 2 source files to <https://builds.apache.org/job/DeltaSpike%20Weld%201.1.22/ws/deltaspike/cdictrl/impl-weld/target/classes>
[INFO] 
[INFO] --- maven-resources-plugin:2.6:testResources (default-testResources) @ deltaspike-cdictrl-weld
---
[INFO] Using 'UTF-8' encoding to copy filtered resources.
[INFO] skip non existing resourceDirectory <https://builds.apache.org/job/DeltaSpike%20Weld%201.1.22/ws/deltaspike/cdictrl/impl-weld/src/test/resources>
[INFO] Copying 3 resources
[INFO] 
[INFO] --- maven-compiler-plugin:2.5:testCompile (default-testCompile) @ deltaspike-cdictrl-weld
---
[INFO] No sources to compile
[INFO] 
[INFO] --- maven-dependency-plugin:2.4:unpack (unpack) @ deltaspike-cdictrl-weld ---
[INFO] Configured Artifact: org.apache.deltaspike.test:deltaspike-cdictrl-tck:1.5.4-SNAPSHOT:jar
[INFO] Unpacking /jenkins/maven-repositories/0/org/apache/deltaspike/test/deltaspike-cdictrl-tck/1.5.4-SNAPSHOT/deltaspike-cdictrl-tck-1.5.4-SNAPSHOT.jar
to <https://builds.apache.org/job/DeltaSpike%20Weld%201.1.22/ws/deltaspike/cdictrl/impl-weld/target/test-classes>
with includes "" and excludes ""
[INFO] 
[INFO] --- maven-surefire-plugin:2.11:test (default-test) @ deltaspike-cdictrl-weld ---
[INFO] Surefire report directory: <https://builds.apache.org/job/DeltaSpike%20Weld%201.1.22/ws/deltaspike/cdictrl/impl-weld/target/surefire-reports>
[INFO] Using configured provider org.apache.maven.surefire.junitcore.JUnitCoreProvider

-------------------------------------------------------
 T E S T S
-------------------------------------------------------
Concurrency config is parallel='none', perCoreThreadCount=true, threadCount=2, useUnlimitedThreads=false
org.apache.maven.surefire.util.SurefireReflectionException: java.lang.reflect.InvocationTargetException;
nested exception is java.lang.reflect.InvocationTargetException: null
java.lang.reflect.InvocationTargetException
	at sun.reflect.NativeMethodAccessorImpl.invoke0(Native Method)
	at sun.reflect.NativeMethodAccessorImpl.invoke(NativeMethodAccessorImpl.java:39)
	at sun.reflect.DelegatingMethodAccessorImpl.invoke(DelegatingMethodAccessorImpl.java:25)
	at java.lang.reflect.Method.invoke(Method.java:597)
	at org.apache.maven.surefire.util.ReflectionUtils.invokeMethodWithArray(ReflectionUtils.java:188)
	at org.apache.maven.surefire.booter.ProviderFactory$ProviderProxy.invoke(ProviderFactory.java:166)
	at org.apache.maven.surefire.booter.ProviderFactory.invokeProvider(ProviderFactory.java:86)
	at org.apache.maven.surefire.booter.ForkedBooter.runSuitesInProcess(ForkedBooter.java:101)
	at org.apache.maven.surefire.booter.ForkedBooter.main(ForkedBooter.java:74)
Caused by: java.lang.UnsupportedClassVersionError: org/apache/deltaspike/cdise/tck/ContainerCtrlTckTest
: Unsupported major.minor version 52.0
	at java.lang.ClassLoader.defineClass1(Native Method)
	at java.lang.ClassLoader.defineClassCond(ClassLoader.java:631)
	at java.lang.ClassLoader.defineClass(ClassLoader.java:615)
	at java.security.SecureClassLoader.defineClass(SecureClassLoader.java:141)
	at java.net.URLClassLoader.defineClass(URLClassLoader.java:283)
	at java.net.URLClassLoader.access$000(URLClassLoader.java:58)
	at java.net.URLClassLoader$1.run(URLClassLoader.java:197)
	at java.security.AccessController.doPrivileged(Native Method)
	at java.net.URLClassLoader.findClass(URLClassLoader.java:190)
	at java.lang.ClassLoader.loadClass(ClassLoader.java:306)
	at sun.misc.Launcher$AppClassLoader.loadClass(Launcher.java:301)
	at java.lang.ClassLoader.loadClass(ClassLoader.java:247)
	at org.apache.maven.surefire.util.DefaultDirectoryScanner.loadClass(DefaultDirectoryScanner.java:88)
	at org.apache.maven.surefire.util.DefaultDirectoryScanner.locateTestClasses(DefaultDirectoryScanner.java:69)
	at org.apache.maven.surefire.junitcore.JUnitCoreProvider.scanClassPath(JUnitCoreProvider.java:191)
	at org.apache.maven.surefire.junitcore.JUnitCoreProvider.getSuitesAsList(JUnitCoreProvider.java:148)
	at org.apache.maven.surefire.junitcore.JUnitCoreProvider.invoke(JUnitCoreProvider.java:120)
	... 9 more

Results :

Tests run: 0, Failures: 0, Errors: 0, Skipped: 0

[JENKINS] Recording test results
[INFO] ------------------------------------------------------------------------
[INFO] Reactor Summary:
[INFO] 
[INFO] Apache DeltaSpike Sources ......................... SUCCESS [5.727s]
[INFO] Apache DeltaSpike CheckStyle-rules ................ SUCCESS [9.932s]
[INFO] Apache DeltaSpike Parent .......................... SUCCESS [5.588s]
[INFO] Apache DeltaSpike Test-Utils ...................... SUCCESS [11.652s]
[INFO] Apache DeltaSpike Code Parent ..................... SUCCESS [27.079s]
[INFO] Apache DeltaSpike Core ............................ SUCCESS [5.120s]
[INFO] Apache DeltaSpike Core-API ........................ SUCCESS [41.831s]
[INFO] Apache DeltaSpike Core-Implementation ............. SUCCESS [32.516s]
[INFO] Apache DeltaSpike ContainerControl parent ......... SUCCESS [3.542s]
[INFO] Apache DeltaSpike CDI ContainerControl API ........ SUCCESS [7.172s]
[INFO] Apache DeltaSpike CDI Weld-ContainerControl ....... FAILURE [17.634s]
[INFO] Apache DeltaSpike CDI Servlet-ContainerControl .... SKIPPED
[INFO] Apache DeltaSpike CDI ContainerControl TCK ........ SKIPPED
[INFO] Apache DeltaSpike Modules ......................... SKIPPED
[INFO] Apache DeltaSpike Proxy-Module .................... SKIPPED
[INFO] Apache DeltaSpike Proxy-Module API ................ SKIPPED
[INFO] Apache DeltaSpike Proxy-Module Impl ASM5 .......... SKIPPED
[INFO] Apache DeltaSpike Security-Module ................. SKIPPED
[INFO] Apache DeltaSpike Security-Module API ............. SKIPPED
[INFO] Apache DeltaSpike Security-Module Impl ............ SKIPPED
[INFO] Apache DeltaSpike JPA-Module ...................... SKIPPED
[INFO] Apache DeltaSpike JPA-Module API .................. SKIPPED
[INFO] Apache DeltaSpike JPA-Module Impl ................. SKIPPED
[INFO] Apache DeltaSpike Servlet-Module .................. SKIPPED
[INFO] Apache DeltaSpike Servlet-Module API .............. SKIPPED
[INFO] Apache DeltaSpike Servlet-Module Impl ............. SKIPPED
[INFO] Apache DeltaSpike JSF-Module ...................... SKIPPED
[INFO] Apache DeltaSpike JSF-Module API .................. SKIPPED
[INFO] Apache DeltaSpike JSF-Module Impl ................. SKIPPED
[INFO] Apache DeltaSpike JSF-Module Impl (EE6 only) ...... SKIPPED
[INFO] Apache DeltaSpike Partial-Bean-Module ............. SKIPPED
[INFO] Apache DeltaSpike Partial-Bean-Module API ......... SKIPPED
[INFO] Apache DeltaSpike Partial-Bean-Module Impl ........ SKIPPED
[INFO] Apache DeltaSpike BeanValidation-Module ........... SKIPPED
[INFO] Apache DeltaSpike BeanValidation-Module API ....... SKIPPED
[INFO] Apache DeltaSpike BeanValidation-Module Impl ...... SKIPPED
[INFO] Apache DeltaSpike Data-Module ..................... SKIPPED
[INFO] Apache DeltaSpike Data-Module API ................. SKIPPED
[INFO] Apache DeltaSpike Data-Module Impl ................ SKIPPED
[INFO] Apache DeltaSpike Data-Module Tests on Java EE 7 .. SKIPPED
[INFO] Apache DeltaSpike Scheduler-Module ................ SKIPPED
[INFO] Apache DeltaSpike Scheduler-Module API ............ SKIPPED
[INFO] Apache DeltaSpike Scheduler-Module Impl ........... SKIPPED
[INFO] Apache DeltaSpike Test-Control-Module ............. SKIPPED
[INFO] Apache DeltaSpike Test-Control-Module API ......... SKIPPED
[INFO] Apache DeltaSpike Test-Control-Module Impl ........ SKIPPED
[INFO] Apache DeltaSpike Examples ........................ SKIPPED
[INFO] Apache DeltaSpike Java-SE Examples ................ SKIPPED
[INFO] Apache DeltaSpike JSF Examples .................... SKIPPED
[INFO] Apache DeltaSpike JSF Playground .................. SKIPPED
[INFO] Apache DeltaSpike Security Example CDI ............ SKIPPED
[INFO] Apache DeltaSpike Security Example PicketLink ..... SKIPPED
[INFO] Apache DeltaSpike Java-SE Scheduler Examples ...... SKIPPED
[INFO] ------------------------------------------------------------------------
[INFO] BUILD FAILURE
[INFO] ------------------------------------------------------------------------
[INFO] Total time: 3:36.185s
[INFO] Finished at: Fri Feb 12 08:03:29 UTC 2016
[INFO] Final Memory: 51M/376M
[INFO] ------------------------------------------------------------------------
Waiting for Jenkins to finish collecting data
[ERROR] Failed to execute goal org.apache.maven.plugins:maven-surefire-plugin:2.11:test (default-test)
on project deltaspike-cdictrl-weld: Error occured in starting fork, check output in log ->
[Help 1]
[ERROR] 
[ERROR] To see the full stack trace of the errors, re-run Maven with the -e switch.
[ERROR] Re-run Maven using the -X switch to enable full debug logging.
[ERROR] 
[ERROR] For more information about the errors and possible solutions, please read the following
articles:
[ERROR] [Help 1] http://cwiki.apache.org/confluence/display/MAVEN/MojoExecutionException
[ERROR] 
[ERROR] After correcting the problems, you can resume the build with the command
[ERROR]   mvn <goals> -rf :deltaspike-cdictrl-weld
[JENKINS] Archiving <https://builds.apache.org/job/DeltaSpike%20Weld%201.1.22/ws/deltaspike/examples/jse-examples/pom.xml>
to org.apache.deltaspike.examples/deltaspike-jse-example/1.5.4-SNAPSHOT/deltaspike-jse-example-1.5.4-SNAPSHOT.pom
[JENKINS] Archiving <https://builds.apache.org/job/DeltaSpike%20Weld%201.1.22/ws/deltaspike/examples/security-requested-page-after-login-cdi/pom.xml>
to org.apache.deltaspike.examples/deltaspike-security-requested-page-after-login-cdi/1.5.4-SNAPSHOT/deltaspike-security-requested-page-after-login-cdi-1.5.4-SNAPSHOT.pom
[JENKINS] Archiving <https://builds.apache.org/job/DeltaSpike%20Weld%201.1.22/ws/deltaspike/test-utils/pom.xml>
to org.apache.deltaspike.test/test-utils/1.5.4-SNAPSHOT/test-utils-1.5.4-SNAPSHOT.pom
[JENKINS] Archiving <https://builds.apache.org/job/DeltaSpike%20Weld%201.1.22/ws/deltaspike/test-utils/target/test-utils-1.5.4-SNAPSHOT.jar>
to org.apache.deltaspike.test/test-utils/1.5.4-SNAPSHOT/test-utils-1.5.4-SNAPSHOT.jar
[JENKINS] Archiving <https://builds.apache.org/job/DeltaSpike%20Weld%201.1.22/ws/deltaspike/test-utils/target/test-utils-1.5.4-SNAPSHOT-sources.jar>
to org.apache.deltaspike.test/test-utils/1.5.4-SNAPSHOT/test-utils-1.5.4-SNAPSHOT-sources.jar
[JENKINS] Archiving <https://builds.apache.org/job/DeltaSpike%20Weld%201.1.22/ws/deltaspike/modules/data/impl/pom.xml>
to org.apache.deltaspike.modules/deltaspike-data-module-impl/1.5.4-SNAPSHOT/deltaspike-data-module-impl-1.5.4-SNAPSHOT.pom
[JENKINS] Archiving <https://builds.apache.org/job/DeltaSpike%20Weld%201.1.22/ws/deltaspike/modules/data/api/pom.xml>
to org.apache.deltaspike.modules/deltaspike-data-module-api/1.5.4-SNAPSHOT/deltaspike-data-module-api-1.5.4-SNAPSHOT.pom
[JENKINS] Archiving <https://builds.apache.org/job/DeltaSpike%20Weld%201.1.22/ws/deltaspike/core/impl/pom.xml>
to org.apache.deltaspike.core/deltaspike-core-impl/1.5.4-SNAPSHOT/deltaspike-core-impl-1.5.4-SNAPSHOT.pom
[JENKINS] Archiving <https://builds.apache.org/job/DeltaSpike%20Weld%201.1.22/ws/deltaspike/core/impl/target/deltaspike-core-impl-1.5.4-SNAPSHOT.jar>
to org.apache.deltaspike.core/deltaspike-core-impl/1.5.4-SNAPSHOT/deltaspike-core-impl-1.5.4-SNAPSHOT.jar
[JENKINS] Archiving <https://builds.apache.org/job/DeltaSpike%20Weld%201.1.22/ws/deltaspike/core/impl/target/deltaspike-core-impl-1.5.4-SNAPSHOT-tests.jar>
to org.apache.deltaspike.core/deltaspike-core-impl/1.5.4-SNAPSHOT/deltaspike-core-impl-1.5.4-SNAPSHOT-tests.jar
[JENKINS] Archiving <https://builds.apache.org/job/DeltaSpike%20Weld%201.1.22/ws/deltaspike/core/impl/target/deltaspike-core-impl-1.5.4-SNAPSHOT-sources.jar>
to org.apache.deltaspike.core/deltaspike-core-impl/1.5.4-SNAPSHOT/deltaspike-core-impl-1.5.4-SNAPSHOT-sources.jar
[JENKINS] Archiving <https://builds.apache.org/job/DeltaSpike%20Weld%201.1.22/ws/deltaspike/modules/pom.xml>
to org.apache.deltaspike.modules/modules-project/1.5.4-SNAPSHOT/modules-project-1.5.4-SNAPSHOT.pom
[JENKINS] Archiving <https://builds.apache.org/job/DeltaSpike%20Weld%201.1.22/ws/deltaspike/modules/test-control/pom.xml>
to org.apache.deltaspike.modules/test-control-module-project/1.5.4-SNAPSHOT/test-control-module-project-1.5.4-SNAPSHOT.pom
[JENKINS] Archiving <https://builds.apache.org/job/DeltaSpike%20Weld%201.1.22/ws/deltaspike/examples/jsf-examples/pom.xml>
to org.apache.deltaspike.examples/deltaspike-jsf-example/1.5.4-SNAPSHOT/deltaspike-jsf-example-1.5.4-SNAPSHOT.pom
[JENKINS] Archiving <https://builds.apache.org/job/DeltaSpike%20Weld%201.1.22/ws/deltaspike/cdictrl/api/pom.xml>
to org.apache.deltaspike.cdictrl/deltaspike-cdictrl-api/1.5.4-SNAPSHOT/deltaspike-cdictrl-api-1.5.4-SNAPSHOT.pom
[JENKINS] Archiving <https://builds.apache.org/job/DeltaSpike%20Weld%201.1.22/ws/deltaspike/cdictrl/api/target/deltaspike-cdictrl-api-1.5.4-SNAPSHOT.jar>
to org.apache.deltaspike.cdictrl/deltaspike-cdictrl-api/1.5.4-SNAPSHOT/deltaspike-cdictrl-api-1.5.4-SNAPSHOT.jar
[JENKINS] Archiving <https://builds.apache.org/job/DeltaSpike%20Weld%201.1.22/ws/deltaspike/cdictrl/api/target/deltaspike-cdictrl-api-1.5.4-SNAPSHOT-sources.jar>
to org.apache.deltaspike.cdictrl/deltaspike-cdictrl-api/1.5.4-SNAPSHOT/deltaspike-cdictrl-api-1.5.4-SNAPSHOT-sources.jar
[JENKINS] Archiving <https://builds.apache.org/job/DeltaSpike%20Weld%201.1.22/ws/deltaspike/cdictrl/servlet/pom.xml>
to org.apache.deltaspike.cdictrl/deltaspike-cdictrl-servlet/1.5.4-SNAPSHOT/deltaspike-cdictrl-servlet-1.5.4-SNAPSHOT.pom
[JENKINS] Archiving <https://builds.apache.org/job/DeltaSpike%20Weld%201.1.22/ws/deltaspike/examples/scheduler-playground/pom.xml>
to org.apache.deltaspike.examples/deltaspike-scheduler-example/1.5.4-SNAPSHOT/deltaspike-scheduler-example-1.5.4-SNAPSHOT.pom
[JENKINS] Archiving <https://builds.apache.org/job/DeltaSpike%20Weld%201.1.22/ws/deltaspike/checkstyle-rules/pom.xml>
to org.apache.deltaspike/checkstyle-rules/1.5.4-SNAPSHOT/checkstyle-rules-1.5.4-SNAPSHOT.pom
[JENKINS] Archiving <https://builds.apache.org/job/DeltaSpike%20Weld%201.1.22/ws/deltaspike/checkstyle-rules/target/checkstyle-rules-1.5.4-SNAPSHOT.jar>
to org.apache.deltaspike/checkstyle-rules/1.5.4-SNAPSHOT/checkstyle-rules-1.5.4-SNAPSHOT.jar
[JENKINS] Archiving <https://builds.apache.org/job/DeltaSpike%20Weld%201.1.22/ws/deltaspike/parent/code/pom.xml>
to org.apache.deltaspike/parent-code/1.5.4-SNAPSHOT/parent-code-1.5.4-SNAPSHOT.pom
[JENKINS] Archiving <https://builds.apache.org/job/DeltaSpike%20Weld%201.1.22/ws/deltaspike/parent/code/target/parent-code-1.5.4-SNAPSHOT-tests.jar>
to org.apache.deltaspike/parent-code/1.5.4-SNAPSHOT/parent-code-1.5.4-SNAPSHOT-tests.jar
Compressed 79.64 KB of artifacts by 40.2% relative to #224
[JENKINS] Archiving <https://builds.apache.org/job/DeltaSpike%20Weld%201.1.22/ws/deltaspike/modules/jsf/impl/pom.xml>
to org.apache.deltaspike.modules/deltaspike-jsf-module-impl/1.5.4-SNAPSHOT/deltaspike-jsf-module-impl-1.5.4-SNAPSHOT.pom
[JENKINS] Archiving <https://builds.apache.org/job/DeltaSpike%20Weld%201.1.22/ws/deltaspike/modules/partial-bean/pom.xml>
to org.apache.deltaspike.modules/partial-bean-module-project/1.5.4-SNAPSHOT/partial-bean-module-project-1.5.4-SNAPSHOT.pom
[JENKINS] Archiving <https://builds.apache.org/job/DeltaSpike%20Weld%201.1.22/ws/deltaspike/examples/pom.xml>
to org.apache.deltaspike.examples/examples-project/1.5.4-SNAPSHOT/examples-project-1.5.4-SNAPSHOT.pom
[JENKINS] Archiving <https://builds.apache.org/job/DeltaSpike%20Weld%201.1.22/ws/deltaspike/modules/jsf/pom.xml>
to org.apache.deltaspike.modules/jsf-module-project/1.5.4-SNAPSHOT/jsf-module-project-1.5.4-SNAPSHOT.pom
[JENKINS] Archiving <https://builds.apache.org/job/DeltaSpike%20Weld%201.1.22/ws/deltaspike/cdictrl/tck/pom.xml>
to org.apache.deltaspike.test/deltaspike-cdictrl-tck/1.5.4-SNAPSHOT/deltaspike-cdictrl-tck-1.5.4-SNAPSHOT.pom
[JENKINS] Archiving <https://builds.apache.org/job/DeltaSpike%20Weld%201.1.22/ws/deltaspike/modules/jsf/api/pom.xml>
to org.apache.deltaspike.modules/deltaspike-jsf-module-api/1.5.4-SNAPSHOT/deltaspike-jsf-module-api-1.5.4-SNAPSHOT.pom
[JENKINS] Archiving <https://builds.apache.org/job/DeltaSpike%20Weld%201.1.22/ws/deltaspike/modules/security/pom.xml>
to org.apache.deltaspike.modules/security-module-project/1.5.4-SNAPSHOT/security-module-project-1.5.4-SNAPSHOT.pom
[JENKINS] Archiving <https://builds.apache.org/job/DeltaSpike%20Weld%201.1.22/ws/deltaspike/modules/bean-validation/pom.xml>
to org.apache.deltaspike.modules/bean-validation-module-project/1.5.4-SNAPSHOT/bean-validation-module-project-1.5.4-SNAPSHOT.pom
[JENKINS] Archiving <https://builds.apache.org/job/DeltaSpike%20Weld%201.1.22/ws/deltaspike/modules/partial-bean/impl/pom.xml>
to org.apache.deltaspike.modules/deltaspike-partial-bean-module-impl/1.5.4-SNAPSHOT/deltaspike-partial-bean-module-impl-1.5.4-SNAPSHOT.pom
[JENKINS] Archiving <https://builds.apache.org/job/DeltaSpike%20Weld%201.1.22/ws/deltaspike/modules/proxy/api/pom.xml>
to org.apache.deltaspike.modules/deltaspike-proxy-module-api/1.5.4-SNAPSHOT/deltaspike-proxy-module-api-1.5.4-SNAPSHOT.pom
[JENKINS] Archiving <https://builds.apache.org/job/DeltaSpike%20Weld%201.1.22/ws/deltaspike/cdictrl/impl-weld/pom.xml>
to org.apache.deltaspike.cdictrl/deltaspike-cdictrl-weld/1.5.4-SNAPSHOT/deltaspike-cdictrl-weld-1.5.4-SNAPSHOT.pom
[JENKINS] Archiving <https://builds.apache.org/job/DeltaSpike%20Weld%201.1.22/ws/deltaspike/modules/jpa/api/pom.xml>
to org.apache.deltaspike.modules/deltaspike-jpa-module-api/1.5.4-SNAPSHOT/deltaspike-jpa-module-api-1.5.4-SNAPSHOT.pom
[JENKINS] Archiving <https://builds.apache.org/job/DeltaSpike%20Weld%201.1.22/ws/deltaspike/modules/servlet/api/pom.xml>
to org.apache.deltaspike.modules/deltaspike-servlet-module-api/1.5.4-SNAPSHOT/deltaspike-servlet-module-api-1.5.4-SNAPSHOT.pom
[JENKINS] Archiving <https://builds.apache.org/job/DeltaSpike%20Weld%201.1.22/ws/deltaspike/modules/jpa/pom.xml>
to org.apache.deltaspike.modules/jpa-module-project/1.5.4-SNAPSHOT/jpa-module-project-1.5.4-SNAPSHOT.pom
[JENKINS] Archiving <https://builds.apache.org/job/DeltaSpike%20Weld%201.1.22/ws/deltaspike/cdictrl/pom.xml>
to org.apache.deltaspike.cdictrl/cdictrl-project/1.5.4-SNAPSHOT/cdictrl-project-1.5.4-SNAPSHOT.pom
[JENKINS] Archiving <https://builds.apache.org/job/DeltaSpike%20Weld%201.1.22/ws/deltaspike/modules/scheduler/api/pom.xml>
to org.apache.deltaspike.modules/deltaspike-scheduler-module-api/1.5.4-SNAPSHOT/deltaspike-scheduler-module-api-1.5.4-SNAPSHOT.pom
[JENKINS] Archiving <https://builds.apache.org/job/DeltaSpike%20Weld%201.1.22/ws/deltaspike/modules/test-control/impl/pom.xml>
to org.apache.deltaspike.modules/deltaspike-test-control-module-impl/1.5.4-SNAPSHOT/deltaspike-test-control-module-impl-1.5.4-SNAPSHOT.pom
[JENKINS] Archiving <https://builds.apache.org/job/DeltaSpike%20Weld%201.1.22/ws/deltaspike/modules/servlet/pom.xml>
to org.apache.deltaspike.modules/servlet-module-project/1.5.4-SNAPSHOT/servlet-module-project-1.5.4-SNAPSHOT.pom
[JENKINS] Archiving <https://builds.apache.org/job/DeltaSpike%20Weld%201.1.22/ws/deltaspike/modules/test-control/api/pom.xml>
to org.apache.deltaspike.modules/deltaspike-test-control-module-api/1.5.4-SNAPSHOT/deltaspike-test-control-module-api-1.5.4-SNAPSHOT.pom
[JENKINS] Archiving <https://builds.apache.org/job/DeltaSpike%20Weld%201.1.22/ws/deltaspike/modules/jsf/impl-ee6/pom.xml>
to org.apache.deltaspike.modules/deltaspike-jsf-module-impl-ee6/1.5.4-SNAPSHOT/deltaspike-jsf-module-impl-ee6-1.5.4-SNAPSHOT.pom
[JENKINS] Archiving <https://builds.apache.org/job/DeltaSpike%20Weld%201.1.22/ws/deltaspike/modules/proxy/pom.xml>
to org.apache.deltaspike.modules/proxy-module-project/1.5.4-SNAPSHOT/proxy-module-project-1.5.4-SNAPSHOT.pom
[JENKINS] Archiving <https://builds.apache.org/job/DeltaSpike%20Weld%201.1.22/ws/deltaspike/modules/partial-bean/api/pom.xml>
to org.apache.deltaspike.modules/deltaspike-partial-bean-module-api/1.5.4-SNAPSHOT/deltaspike-partial-bean-module-api-1.5.4-SNAPSHOT.pom
[JENKINS] Archiving <https://builds.apache.org/job/DeltaSpike%20Weld%201.1.22/ws/deltaspike/modules/scheduler/impl/pom.xml>
to org.apache.deltaspike.modules/deltaspike-scheduler-module-impl/1.5.4-SNAPSHOT/deltaspike-scheduler-module-impl-1.5.4-SNAPSHOT.pom
[JENKINS] Archiving <https://builds.apache.org/job/DeltaSpike%20Weld%201.1.22/ws/deltaspike/parent/pom.xml>
to org.apache.deltaspike/parent/1.5.4-SNAPSHOT/parent-1.5.4-SNAPSHOT.pom
[JENKINS] Archiving <https://builds.apache.org/job/DeltaSpike%20Weld%201.1.22/ws/deltaspike/core/pom.xml>
to org.apache.deltaspike.core/core-project/1.5.4-SNAPSHOT/core-project-1.5.4-SNAPSHOT.pom
[JENKINS] Archiving <https://builds.apache.org/job/DeltaSpike%20Weld%201.1.22/ws/deltaspike/core/target/core-project-1.5.4-SNAPSHOT-tests.jar>
to org.apache.deltaspike.core/core-project/1.5.4-SNAPSHOT/core-project-1.5.4-SNAPSHOT-tests.jar
[JENKINS] Archiving <https://builds.apache.org/job/DeltaSpike%20Weld%201.1.22/ws/deltaspike/modules/bean-validation/api/pom.xml>
to org.apache.deltaspike.modules/deltaspike-bean-validation-module-api/1.5.4-SNAPSHOT/deltaspike-bean-validation-module-api-1.5.4-SNAPSHOT.pom
[JENKINS] Archiving <https://builds.apache.org/job/DeltaSpike%20Weld%201.1.22/ws/deltaspike/core/api/pom.xml>
to org.apache.deltaspike.core/deltaspike-core-api/1.5.4-SNAPSHOT/deltaspike-core-api-1.5.4-SNAPSHOT.pom
[JENKINS] Archiving <https://builds.apache.org/job/DeltaSpike%20Weld%201.1.22/ws/deltaspike/core/api/target/deltaspike-core-api-1.5.4-SNAPSHOT.jar>
to org.apache.deltaspike.core/deltaspike-core-api/1.5.4-SNAPSHOT/deltaspike-core-api-1.5.4-SNAPSHOT.jar
[JENKINS] Archiving <https://builds.apache.org/job/DeltaSpike%20Weld%201.1.22/ws/deltaspike/core/api/target/deltaspike-core-api-1.5.4-SNAPSHOT-tests.jar>
to org.apache.deltaspike.core/deltaspike-core-api/1.5.4-SNAPSHOT/deltaspike-core-api-1.5.4-SNAPSHOT-tests.jar
[JENKINS] Archiving <https://builds.apache.org/job/DeltaSpike%20Weld%201.1.22/ws/deltaspike/core/api/target/deltaspike-core-api-1.5.4-SNAPSHOT-sources.jar>
to org.apache.deltaspike.core/deltaspike-core-api/1.5.4-SNAPSHOT/deltaspike-core-api-1.5.4-SNAPSHOT-sources.jar
[JENKINS] Archiving <https://builds.apache.org/job/DeltaSpike%20Weld%201.1.22/ws/deltaspike/modules/security/impl/pom.xml>
to org.apache.deltaspike.modules/deltaspike-security-module-impl/1.5.4-SNAPSHOT/deltaspike-security-module-impl-1.5.4-SNAPSHOT.pom
[JENKINS] Archiving <https://builds.apache.org/job/DeltaSpike%20Weld%201.1.22/ws/deltaspike/modules/scheduler/pom.xml>
to org.apache.deltaspike.modules/scheduler-module-project/1.5.4-SNAPSHOT/scheduler-module-project-1.5.4-SNAPSHOT.pom
[JENKINS] Archiving <https://builds.apache.org/job/DeltaSpike%20Weld%201.1.22/ws/deltaspike/modules/proxy/impl-asm5/pom.xml>
to org.apache.deltaspike.modules/deltaspike-proxy-module-impl-asm5/1.5.4-SNAPSHOT/deltaspike-proxy-module-impl-asm5-1.5.4-SNAPSHOT.pom
[JENKINS] Archiving <https://builds.apache.org/job/DeltaSpike%20Weld%201.1.22/ws/deltaspike/examples/jsf-playground/pom.xml>
to org.apache.deltaspike.examples/deltaspike-jsf-playground/1.5.4-SNAPSHOT/deltaspike-jsf-playground-1.5.4-SNAPSHOT.pom
[JENKINS] Archiving <https://builds.apache.org/job/DeltaSpike%20Weld%201.1.22/ws/deltaspike/modules/servlet/impl/pom.xml>
to org.apache.deltaspike.modules/deltaspike-servlet-module-impl/1.5.4-SNAPSHOT/deltaspike-servlet-module-impl-1.5.4-SNAPSHOT.pom
[JENKINS] Archiving <https://builds.apache.org/job/DeltaSpike%20Weld%201.1.22/ws/deltaspike/modules/bean-validation/impl/pom.xml>
to org.apache.deltaspike.modules/deltaspike-bean-validation-module-impl/1.5.4-SNAPSHOT/deltaspike-bean-validation-module-impl-1.5.4-SNAPSHOT.pom
[JENKINS] Archiving <https://builds.apache.org/job/DeltaSpike%20Weld%201.1.22/ws/deltaspike/modules/data/test-ee7/pom.xml>
to org.apache.deltaspike.modules/deltaspike-data-module-test-ee7/1.5.4-SNAPSHOT/deltaspike-data-module-test-ee7-1.5.4-SNAPSHOT.pom
[JENKINS] Archiving <https://builds.apache.org/job/DeltaSpike%20Weld%201.1.22/ws/deltaspike/modules/jpa/impl/pom.xml>
to org.apache.deltaspike.modules/deltaspike-jpa-module-impl/1.5.4-SNAPSHOT/deltaspike-jpa-module-impl-1.5.4-SNAPSHOT.pom
[JENKINS] Archiving <https://builds.apache.org/job/DeltaSpike%20Weld%201.1.22/ws/deltaspike/modules/data/pom.xml>
to org.apache.deltaspike.modules/data-module-project/1.5.4-SNAPSHOT/data-module-project-1.5.4-SNAPSHOT.pom
[JENKINS] Archiving <https://builds.apache.org/job/DeltaSpike%20Weld%201.1.22/ws/deltaspike/examples/security-requested-page-after-login-picketlink/pom.xml>
to org.apache.deltaspike.examples/deltaspike-security-requested-page-after-login-picketlink/1.5.4-SNAPSHOT/deltaspike-security-requested-page-after-login-picketlink-1.5.4-SNAPSHOT.pom
[JENKINS] Archiving <https://builds.apache.org/job/DeltaSpike%20Weld%201.1.22/ws/deltaspike/pom.xml>
to org.apache.deltaspike/deltaspike-project/1.5.4-SNAPSHOT/deltaspike-project-1.5.4-SNAPSHOT.pom
[JENKINS] Archiving <https://builds.apache.org/job/DeltaSpike%20Weld%201.1.22/ws/deltaspike/modules/security/api/pom.xml>
to org.apache.deltaspike.modules/deltaspike-security-module-api/1.5.4-SNAPSHOT/deltaspike-security-module-api-1.5.4-SNAPSHOT.pom
Sending e-mails to: commits@deltaspike.apache.org
channel stopped

Mime
View raw message