deltaspike-commits mailing list archives

Site index · List index
Message view « Date » · « Thread »
Top « Date » · « Thread »
From Apache Jenkins Server <jenk...@builds.apache.org>
Subject Build failed in Jenkins: DeltaSpike_Wildfly_10 #58
Date Sat, 13 Feb 2016 07:59:24 GMT
See <https://builds.apache.org/job/DeltaSpike_Wildfly_10/58/changes>

Changes:

[struberg] improve @PersistenceUnitName documentation

------------------------------------------
[...truncated 889 lines...]

main:
[INFO] Executed tasks
[INFO] [remote-resources:process {execution: default}]
[INFO] [dependency:unpack {execution: unpack-wf}]
[INFO] Configured Artifact: org.wildfly:wildfly-dist:10.0.0.Final:zip
[INFO] Unpacking /home/jenkins/jenkins-slave/maven-repositories/1/org/wildfly/wildfly-dist/10.0.0.Final/wildfly-dist-10.0.0.Final.zip
to /tmp/deltaspike-arquillian-containers with includes "" and excludes ""
[INFO] [site:attach-descriptor {execution: default-attach-descriptor}]
[INFO] [jar:test-jar {execution: default}]
[WARNING] JAR will be empty - no content was marked for inclusion!
[INFO] Building jar: <https://builds.apache.org/job/DeltaSpike_Wildfly_10/ws/deltaspike/modules/target/modules-project-1.5.4-SNAPSHOT-tests.jar>
[INFO] Preparing source:jar
[WARNING] Removing: jar from forked lifecycle, to prevent recursive invocation.
[INFO] [bundle:cleanVersions {execution: versions}]
[WARNING] DEPRECATED [tasks]: Use target instead
[INFO] [antrun:run {execution: javadoc.resources}]
[WARNING] Parameter tasks is deprecated, use target instead
[INFO] Executing tasks

main:
[INFO] Executed tasks
ERROR: Could not find local repository for 2.2.1
[INFO] [source:jar {execution: attach-sources}]
[INFO] [checkstyle:check {execution: verify-style}]
[INFO] Starting audit...
Audit done.

[INFO] [install:install {execution: default-install}]
[INFO] Installing <https://builds.apache.org/job/DeltaSpike_Wildfly_10/ws/deltaspike/modules/pom.xml>
to /home/jenkins/jenkins-slave/maven-repositories/1/org/apache/deltaspike/modules/modules-project/1.5.4-SNAPSHOT/modules-project-1.5.4-SNAPSHOT.pom
[INFO] Installing <https://builds.apache.org/job/DeltaSpike_Wildfly_10/ws/deltaspike/modules/target/modules-project-1.5.4-SNAPSHOT-tests.jar>
to /home/jenkins/jenkins-slave/maven-repositories/1/org/apache/deltaspike/modules/modules-project/1.5.4-SNAPSHOT/modules-project-1.5.4-SNAPSHOT-tests.jar
[INFO] ------------------------------------------------------------------------
[INFO] Building Apache DeltaSpike Proxy-Module
[INFO]    task-segment: [clean, install]
[INFO] ------------------------------------------------------------------------
[INFO] [clean:clean {execution: default-clean}]
[INFO] Deleting <https://builds.apache.org/job/DeltaSpike_Wildfly_10/ws/deltaspike/modules/proxy/target>
[INFO] [bundle:cleanVersions {execution: versions}]
[WARNING] DEPRECATED [tasks]: Use target instead
[INFO] [antrun:run {execution: javadoc.resources}]
[WARNING] Parameter tasks is deprecated, use target instead
[INFO] Executing tasks

main:
[INFO] Executed tasks
[INFO] [remote-resources:process {execution: default}]
[INFO] [dependency:unpack {execution: unpack-wf}]
[INFO] Configured Artifact: org.wildfly:wildfly-dist:10.0.0.Final:zip
[INFO] Unpacking /home/jenkins/jenkins-slave/maven-repositories/1/org/wildfly/wildfly-dist/10.0.0.Final/wildfly-dist-10.0.0.Final.zip
to /tmp/deltaspike-arquillian-containers with includes "" and excludes ""
[INFO] [site:attach-descriptor {execution: default-attach-descriptor}]
[INFO] [jar:test-jar {execution: default}]
[WARNING] JAR will be empty - no content was marked for inclusion!
[INFO] Building jar: <https://builds.apache.org/job/DeltaSpike_Wildfly_10/ws/deltaspike/modules/proxy/target/proxy-module-project-1.5.4-SNAPSHOT-tests.jar>
[INFO] Preparing source:jar
[WARNING] Removing: jar from forked lifecycle, to prevent recursive invocation.
[INFO] [bundle:cleanVersions {execution: versions}]
[WARNING] DEPRECATED [tasks]: Use target instead
[INFO] [antrun:run {execution: javadoc.resources}]
[WARNING] Parameter tasks is deprecated, use target instead
[INFO] Executing tasks

main:
[INFO] Executed tasks
ERROR: Could not find local repository for 2.2.1
[INFO] [source:jar {execution: attach-sources}]
[INFO] [checkstyle:check {execution: verify-style}]
[INFO] Starting audit...
Audit done.

[INFO] [install:install {execution: default-install}]
[INFO] Installing <https://builds.apache.org/job/DeltaSpike_Wildfly_10/ws/deltaspike/modules/proxy/pom.xml>
to /home/jenkins/jenkins-slave/maven-repositories/1/org/apache/deltaspike/modules/proxy-module-project/1.5.4-SNAPSHOT/proxy-module-project-1.5.4-SNAPSHOT.pom
[INFO] Installing <https://builds.apache.org/job/DeltaSpike_Wildfly_10/ws/deltaspike/modules/proxy/target/proxy-module-project-1.5.4-SNAPSHOT-tests.jar>
to /home/jenkins/jenkins-slave/maven-repositories/1/org/apache/deltaspike/modules/proxy-module-project/1.5.4-SNAPSHOT/proxy-module-project-1.5.4-SNAPSHOT-tests.jar
[INFO] ------------------------------------------------------------------------
[INFO] Building Apache DeltaSpike Proxy-Module API
[INFO]    task-segment: [clean, install]
[INFO] ------------------------------------------------------------------------
[INFO] [clean:clean {execution: default-clean}]
[INFO] Deleting <https://builds.apache.org/job/DeltaSpike_Wildfly_10/ws/deltaspike/modules/proxy/api/target>
[INFO] [bundle:cleanVersions {execution: versions}]
[WARNING] DEPRECATED [tasks]: Use target instead
[INFO] [antrun:run {execution: javadoc.resources}]
[WARNING] Parameter tasks is deprecated, use target instead
[INFO] Executing tasks

main:
[INFO] Executed tasks
[INFO] [remote-resources:process {execution: default}]
[INFO] [resources:resources {execution: default-resources}]
[INFO] Using 'UTF-8' encoding to copy filtered resources.
[INFO] Copying 2 resources
[INFO] Copying 3 resources
[INFO] [compiler:compile {execution: default-compile}]
[INFO] Compiling 4 source files to <https://builds.apache.org/job/DeltaSpike_Wildfly_10/ws/deltaspike/modules/proxy/api/target/classes>
[INFO] [resources:testResources {execution: default-testResources}]
[INFO] Using 'UTF-8' encoding to copy filtered resources.
[INFO] skip non existing resourceDirectory <https://builds.apache.org/job/DeltaSpike_Wildfly_10/ws/deltaspike/modules/proxy/api/src/test/resources>
[INFO] Copying 3 resources
[INFO] [compiler:testCompile {execution: default-testCompile}]
[INFO] No sources to compile
[INFO] [dependency:unpack {execution: unpack-wf}]
[INFO] Configured Artifact: org.wildfly:wildfly-dist:10.0.0.Final:zip
[INFO] Unpacking /home/jenkins/jenkins-slave/maven-repositories/1/org/wildfly/wildfly-dist/10.0.0.Final/wildfly-dist-10.0.0.Final.zip
to /tmp/deltaspike-arquillian-containers with includes "" and excludes ""
[WARNING] DEPRECATED [systemProperties]: Use systemPropertyVariables instead.
[INFO] [surefire:test {execution: default-test}]
[INFO] Surefire report directory: <https://builds.apache.org/job/DeltaSpike_Wildfly_10/ws/deltaspike/modules/proxy/api/target/surefire-reports>
[INFO] Using configured provider org.apache.maven.surefire.junitcore.JUnitCoreProvider

-------------------------------------------------------
 T E S T S
-------------------------------------------------------
Concurrency config is parallel='none', perCoreThreadCount=true, threadCount=2, useUnlimitedThreads=false

Results :

Tests run: 0, Failures: 0, Errors: 0, Skipped: 0

[JENKINS] Recording test results
[INFO] [bundle:bundle {execution: default-bundle}]
[INFO] [jar:test-jar {execution: default}]
[INFO] Building jar: <https://builds.apache.org/job/DeltaSpike_Wildfly_10/ws/deltaspike/modules/proxy/api/target/deltaspike-proxy-module-api-1.5.4-SNAPSHOT-tests.jar>
[INFO] Preparing source:jar
[WARNING] Removing: jar from forked lifecycle, to prevent recursive invocation.
[INFO] [bundle:cleanVersions {execution: versions}]
[WARNING] DEPRECATED [tasks]: Use target instead
[INFO] [antrun:run {execution: javadoc.resources}]
[WARNING] Parameter tasks is deprecated, use target instead
[INFO] Executing tasks

main:
[INFO] Executed tasks
ERROR: Could not find local repository for 2.2.1
[INFO] [source:jar {execution: attach-sources}]
[INFO] Building jar: <https://builds.apache.org/job/DeltaSpike_Wildfly_10/ws/deltaspike/modules/proxy/api/target/deltaspike-proxy-module-api-1.5.4-SNAPSHOT-sources.jar>
[INFO] [checkstyle:check {execution: verify-style}]
[INFO] Starting audit...
Audit done.

[INFO] [install:install {execution: default-install}]
[INFO] Installing <https://builds.apache.org/job/DeltaSpike_Wildfly_10/ws/deltaspike/modules/proxy/api/target/deltaspike-proxy-module-api-1.5.4-SNAPSHOT.jar>
to /home/jenkins/jenkins-slave/maven-repositories/1/org/apache/deltaspike/modules/deltaspike-proxy-module-api/1.5.4-SNAPSHOT/deltaspike-proxy-module-api-1.5.4-SNAPSHOT.jar
[INFO] Installing <https://builds.apache.org/job/DeltaSpike_Wildfly_10/ws/deltaspike/modules/proxy/api/target/deltaspike-proxy-module-api-1.5.4-SNAPSHOT-tests.jar>
to /home/jenkins/jenkins-slave/maven-repositories/1/org/apache/deltaspike/modules/deltaspike-proxy-module-api/1.5.4-SNAPSHOT/deltaspike-proxy-module-api-1.5.4-SNAPSHOT-tests.jar
[INFO] Installing <https://builds.apache.org/job/DeltaSpike_Wildfly_10/ws/deltaspike/modules/proxy/api/target/deltaspike-proxy-module-api-1.5.4-SNAPSHOT-sources.jar>
to /home/jenkins/jenkins-slave/maven-repositories/1/org/apache/deltaspike/modules/deltaspike-proxy-module-api/1.5.4-SNAPSHOT/deltaspike-proxy-module-api-1.5.4-SNAPSHOT-sources.jar
[INFO] [bundle:install {execution: default-install}]
[WARNING] Exception while updating local OBR: Unable to read repository xml: file:/home/jenkins/jenkins-slave/maven-repositories/1/repository.xml
org.apache.maven.plugin.MojoExecutionException: Unable to read repository xml: file:/home/jenkins/jenkins-slave/maven-repositories/1/repository.xml
	at org.apache.felix.obrplugin.ObrUpdate.parseRepositoryXml(ObrUpdate.java:324)
	at org.apache.felix.obrplugin.ObrInstall.execute(ObrInstall.java:141)
	at org.apache.maven.plugin.DefaultPluginManager.executeMojo(DefaultPluginManager.java:490)
	at hudson.maven.agent.PluginManagerInterceptor.executeMojo(PluginManagerInterceptor.java:182)
	at org.apache.maven.lifecycle.DefaultLifecycleExecutor.executeGoals(DefaultLifecycleExecutor.java:694)
	at org.apache.maven.lifecycle.DefaultLifecycleExecutor.executeGoalWithLifecycle(DefaultLifecycleExecutor.java:556)
	at org.apache.maven.lifecycle.DefaultLifecycleExecutor.executeGoal(DefaultLifecycleExecutor.java:535)
	at org.apache.maven.lifecycle.DefaultLifecycleExecutor.executeGoalAndHandleFailures(DefaultLifecycleExecutor.java:387)
	at org.apache.maven.lifecycle.DefaultLifecycleExecutor.executeTaskSegments(DefaultLifecycleExecutor.java:348)
	at org.apache.maven.lifecycle.DefaultLifecycleExecutor.execute(DefaultLifecycleExecutor.java:180)
	at org.apache.maven.lifecycle.LifecycleExecutorInterceptor.execute(LifecycleExecutorInterceptor.java:65)
	at org.apache.maven.DefaultMaven.doExecute(DefaultMaven.java:328)
	at org.apache.maven.DefaultMaven.execute(DefaultMaven.java:138)
	at org.apache.maven.cli.MavenCli.main(MavenCli.java:362)
	at sun.reflect.NativeMethodAccessorImpl.invoke0(Native Method)
	at sun.reflect.NativeMethodAccessorImpl.invoke(NativeMethodAccessorImpl.java:62)
	at sun.reflect.DelegatingMethodAccessorImpl.invoke(DelegatingMethodAccessorImpl.java:43)
	at java.lang.reflect.Method.invoke(Method.java:497)
	at org.codehaus.classworlds.Launcher.launchEnhanced(Launcher.java:315)
	at org.codehaus.classworlds.Launcher.launch(Launcher.java:255)
	at hudson.maven.agent.Main.launch(Main.java:205)
	at hudson.maven.MavenBuilder.call(MavenBuilder.java:154)
	at hudson.maven.Maven2Builder.call(Maven2Builder.java:79)
	at hudson.maven.Maven2Builder.call(Maven2Builder.java:55)
	at hudson.remoting.UserRequest.perform(UserRequest.java:121)
	at hudson.remoting.UserRequest.perform(UserRequest.java:49)
	at hudson.remoting.Request$2.run(Request.java:326)
	at hudson.remoting.InterceptingExecutorService$1.call(InterceptingExecutorService.java:68)
	at java.util.concurrent.FutureTask.run(FutureTask.java:266)
	at java.util.concurrent.ThreadPoolExecutor.runWorker(ThreadPoolExecutor.java:1142)
	at java.util.concurrent.ThreadPoolExecutor$Worker.run(ThreadPoolExecutor.java:617)
	at java.lang.Thread.run(Thread.java:745)
Caused by: org.xmlpull.v1.XmlPullParserException: unexpected type (position:END_DOCUMENT null@3:1
in java.io.InputStreamReader@6a68db9) 
	at org.kxml2.io.KXmlParser.exception(Unknown Source)
	at org.kxml2.io.KXmlParser.nextTag(Unknown Source)
	at org.apache.felix.bundlerepository.impl.PullParser.parseRepository(PullParser.java:43)
	at org.apache.felix.bundlerepository.impl.DataModelHelperImpl.repository(DataModelHelperImpl.java:147)
	at org.apache.felix.bundlerepository.impl.DataModelHelperImpl.repository(DataModelHelperImpl.java:118)
	at org.apache.felix.obrplugin.ObrUpdate.parseRepositoryXml(ObrUpdate.java:316)
	... 31 more
[INFO] ------------------------------------------------------------------------
[INFO] Building Apache DeltaSpike Proxy-Module Impl ASM5
[INFO]    task-segment: [clean, install]
[INFO] ------------------------------------------------------------------------
[INFO] ------------------------------------------------------------------------
[ERROR] BUILD ERROR
[INFO] ------------------------------------------------------------------------
[INFO] Error resolving version for 'org.apache.maven.plugins:maven-shade-plugin': Plugin requires
Maven version 3.0
[INFO] ------------------------------------------------------------------------
[INFO] For more information, run Maven with the -e switch
[INFO] ------------------------------------------------------------------------
[INFO] Total time: 3 minutes 37 seconds
[INFO] Finished at: Sat Feb 13 07:56:01 UTC 2016
[INFO] Final Memory: 116M/855M
[INFO] ------------------------------------------------------------------------
Waiting for Jenkins to finish collecting data
[JENKINS] Archiving <https://builds.apache.org/job/DeltaSpike_Wildfly_10/ws/deltaspike/test-utils/pom.xml>
to org.apache.deltaspike.test/test-utils/1.5.4-SNAPSHOT/test-utils-1.5.4-SNAPSHOT.pom
[JENKINS] Archiving <https://builds.apache.org/job/DeltaSpike_Wildfly_10/ws/deltaspike/test-utils/target/test-utils-1.5.4-SNAPSHOT.jar>
to org.apache.deltaspike.test/test-utils/1.5.4-SNAPSHOT/test-utils-1.5.4-SNAPSHOT.jar
[JENKINS] Archiving <https://builds.apache.org/job/DeltaSpike_Wildfly_10/ws/deltaspike/test-utils/target/test-utils-1.5.4-SNAPSHOT.jar>
to org.apache.deltaspike.test/test-utils/1.5.4-SNAPSHOT/test-utils-1.5.4-SNAPSHOT-tests.jar
[JENKINS] Archiving <https://builds.apache.org/job/DeltaSpike_Wildfly_10/ws/deltaspike/test-utils/target/test-utils-1.5.4-SNAPSHOT-sources.jar>
to org.apache.deltaspike.test/test-utils/1.5.4-SNAPSHOT/test-utils-1.5.4-SNAPSHOT-sources.jar
[JENKINS] Archiving <https://builds.apache.org/job/DeltaSpike_Wildfly_10/ws/deltaspike/core/impl/pom.xml>
to org.apache.deltaspike.core/deltaspike-core-impl/1.5.4-SNAPSHOT/deltaspike-core-impl-1.5.4-SNAPSHOT.pom
[JENKINS] Archiving <https://builds.apache.org/job/DeltaSpike_Wildfly_10/ws/deltaspike/core/impl/target/deltaspike-core-impl-1.5.4-SNAPSHOT.jar>
to org.apache.deltaspike.core/deltaspike-core-impl/1.5.4-SNAPSHOT/deltaspike-core-impl-1.5.4-SNAPSHOT.jar
[JENKINS] Archiving <https://builds.apache.org/job/DeltaSpike_Wildfly_10/ws/deltaspike/core/impl/target/deltaspike-core-impl-1.5.4-SNAPSHOT-tests.jar>
to org.apache.deltaspike.core/deltaspike-core-impl/1.5.4-SNAPSHOT/deltaspike-core-impl-1.5.4-SNAPSHOT-tests.jar
[JENKINS] Archiving <https://builds.apache.org/job/DeltaSpike_Wildfly_10/ws/deltaspike/core/impl/target/deltaspike-core-impl-1.5.4-SNAPSHOT-sources.jar>
to org.apache.deltaspike.core/deltaspike-core-impl/1.5.4-SNAPSHOT/deltaspike-core-impl-1.5.4-SNAPSHOT-sources.jar
[JENKINS] Archiving /home/jenkins/jenkins-slave/maven-repositories/1/org/apache/deltaspike/modules/modules-project/1.5.4-SNAPSHOT/modules-project-1.5.4-SNAPSHOT.pom
to org.apache.deltaspike.modules/modules-project/1.5.4-SNAPSHOT/modules-project-1.5.4-SNAPSHOT.pom
[JENKINS] Archiving <https://builds.apache.org/job/DeltaSpike_Wildfly_10/ws/deltaspike/modules/target/modules-project-1.5.4-SNAPSHOT-tests.jar>
to org.apache.deltaspike.modules/modules-project/1.5.4-SNAPSHOT/modules-project-1.5.4-SNAPSHOT-tests.jar
/x1/jenkins/jenkins-slave/maven-repositories/1/org/apache/deltaspike/modules/modules-project/1.5.4-SNAPSHOT/modules-project-1.5.4-SNAPSHOT.pom
is not inside /x1/jenkins/jenkins-slave/workspace/DeltaSpike_Wildfly_10/deltaspike/modules/;
will archive in a separate pass
[JENKINS] Archiving <https://builds.apache.org/job/DeltaSpike_Wildfly_10/ws/deltaspike/cdictrl/api/pom.xml>
to org.apache.deltaspike.cdictrl/deltaspike-cdictrl-api/1.5.4-SNAPSHOT/deltaspike-cdictrl-api-1.5.4-SNAPSHOT.pom
[JENKINS] Archiving <https://builds.apache.org/job/DeltaSpike_Wildfly_10/ws/deltaspike/cdictrl/api/target/deltaspike-cdictrl-api-1.5.4-SNAPSHOT.jar>
to org.apache.deltaspike.cdictrl/deltaspike-cdictrl-api/1.5.4-SNAPSHOT/deltaspike-cdictrl-api-1.5.4-SNAPSHOT.jar
[JENKINS] Archiving <https://builds.apache.org/job/DeltaSpike_Wildfly_10/ws/deltaspike/cdictrl/api/target/deltaspike-cdictrl-api-1.5.4-SNAPSHOT.jar>
to org.apache.deltaspike.cdictrl/deltaspike-cdictrl-api/1.5.4-SNAPSHOT/deltaspike-cdictrl-api-1.5.4-SNAPSHOT-tests.jar
[JENKINS] Archiving <https://builds.apache.org/job/DeltaSpike_Wildfly_10/ws/deltaspike/cdictrl/api/target/deltaspike-cdictrl-api-1.5.4-SNAPSHOT-sources.jar>
to org.apache.deltaspike.cdictrl/deltaspike-cdictrl-api/1.5.4-SNAPSHOT/deltaspike-cdictrl-api-1.5.4-SNAPSHOT-sources.jar
[JENKINS] Archiving <https://builds.apache.org/job/DeltaSpike_Wildfly_10/ws/deltaspike/checkstyle-rules/pom.xml>
to org.apache.deltaspike/checkstyle-rules/1.5.4-SNAPSHOT/checkstyle-rules-1.5.4-SNAPSHOT.pom
[JENKINS] Archiving <https://builds.apache.org/job/DeltaSpike_Wildfly_10/ws/deltaspike/checkstyle-rules/target/checkstyle-rules-1.5.4-SNAPSHOT.jar>
to org.apache.deltaspike/checkstyle-rules/1.5.4-SNAPSHOT/checkstyle-rules-1.5.4-SNAPSHOT.jar
[JENKINS] Archiving /home/jenkins/jenkins-slave/maven-repositories/1/org/apache/deltaspike/parent-code/1.5.4-SNAPSHOT/parent-code-1.5.4-SNAPSHOT.pom
to org.apache.deltaspike/parent-code/1.5.4-SNAPSHOT/parent-code-1.5.4-SNAPSHOT.pom
[JENKINS] Archiving <https://builds.apache.org/job/DeltaSpike_Wildfly_10/ws/deltaspike/parent/code/target/parent-code-1.5.4-SNAPSHOT-tests.jar>
to org.apache.deltaspike/parent-code/1.5.4-SNAPSHOT/parent-code-1.5.4-SNAPSHOT-tests.jar
/x1/jenkins/jenkins-slave/maven-repositories/1/org/apache/deltaspike/parent-code/1.5.4-SNAPSHOT/parent-code-1.5.4-SNAPSHOT.pom
is not inside /x1/jenkins/jenkins-slave/workspace/DeltaSpike_Wildfly_10/deltaspike/parent/code/;
will archive in a separate pass
Compressed 72.66 KB of artifacts by 44.0% relative to #57
[JENKINS] Archiving <https://builds.apache.org/job/DeltaSpike_Wildfly_10/ws/deltaspike/modules/proxy/api/pom.xml>
to org.apache.deltaspike.modules/deltaspike-proxy-module-api/1.5.4-SNAPSHOT/deltaspike-proxy-module-api-1.5.4-SNAPSHOT.pom
[JENKINS] Archiving <https://builds.apache.org/job/DeltaSpike_Wildfly_10/ws/deltaspike/modules/proxy/api/target/deltaspike-proxy-module-api-1.5.4-SNAPSHOT.jar>
to org.apache.deltaspike.modules/deltaspike-proxy-module-api/1.5.4-SNAPSHOT/deltaspike-proxy-module-api-1.5.4-SNAPSHOT.jar
[JENKINS] Archiving <https://builds.apache.org/job/DeltaSpike_Wildfly_10/ws/deltaspike/modules/proxy/api/target/deltaspike-proxy-module-api-1.5.4-SNAPSHOT-tests.jar>
to org.apache.deltaspike.modules/deltaspike-proxy-module-api/1.5.4-SNAPSHOT/deltaspike-proxy-module-api-1.5.4-SNAPSHOT-tests.jar
[JENKINS] Archiving <https://builds.apache.org/job/DeltaSpike_Wildfly_10/ws/deltaspike/modules/proxy/api/target/deltaspike-proxy-module-api-1.5.4-SNAPSHOT-sources.jar>
to org.apache.deltaspike.modules/deltaspike-proxy-module-api/1.5.4-SNAPSHOT/deltaspike-proxy-module-api-1.5.4-SNAPSHOT-sources.jar
[JENKINS] Archiving <https://builds.apache.org/job/DeltaSpike_Wildfly_10/ws/deltaspike/cdictrl/impl-weld/pom.xml>
to org.apache.deltaspike.cdictrl/deltaspike-cdictrl-weld/1.5.4-SNAPSHOT/deltaspike-cdictrl-weld-1.5.4-SNAPSHOT.pom
[JENKINS] Archiving <https://builds.apache.org/job/DeltaSpike_Wildfly_10/ws/deltaspike/cdictrl/impl-weld/target/deltaspike-cdictrl-weld-1.5.4-SNAPSHOT.jar>
to org.apache.deltaspike.cdictrl/deltaspike-cdictrl-weld/1.5.4-SNAPSHOT/deltaspike-cdictrl-weld-1.5.4-SNAPSHOT.jar
[JENKINS] Archiving <https://builds.apache.org/job/DeltaSpike_Wildfly_10/ws/deltaspike/cdictrl/impl-weld/target/deltaspike-cdictrl-weld-1.5.4-SNAPSHOT.jar>
to org.apache.deltaspike.cdictrl/deltaspike-cdictrl-weld/1.5.4-SNAPSHOT/deltaspike-cdictrl-weld-1.5.4-SNAPSHOT-tests.jar
[JENKINS] Archiving <https://builds.apache.org/job/DeltaSpike_Wildfly_10/ws/deltaspike/cdictrl/impl-weld/target/deltaspike-cdictrl-weld-1.5.4-SNAPSHOT-sources.jar>
to org.apache.deltaspike.cdictrl/deltaspike-cdictrl-weld/1.5.4-SNAPSHOT/deltaspike-cdictrl-weld-1.5.4-SNAPSHOT-sources.jar
[JENKINS] Archiving /home/jenkins/jenkins-slave/maven-repositories/1/org/apache/deltaspike/cdictrl/cdictrl-project/1.5.4-SNAPSHOT/cdictrl-project-1.5.4-SNAPSHOT.pom
to org.apache.deltaspike.cdictrl/cdictrl-project/1.5.4-SNAPSHOT/cdictrl-project-1.5.4-SNAPSHOT.pom
/x1/jenkins/jenkins-slave/maven-repositories/1/org/apache/deltaspike/cdictrl/cdictrl-project/1.5.4-SNAPSHOT/cdictrl-project-1.5.4-SNAPSHOT.pom
is not inside /x1/jenkins/jenkins-slave/workspace/DeltaSpike_Wildfly_10/deltaspike/cdictrl/;
will archive in a separate pass
[JENKINS] Archiving /home/jenkins/jenkins-slave/maven-repositories/1/org/apache/deltaspike/modules/proxy-module-project/1.5.4-SNAPSHOT/proxy-module-project-1.5.4-SNAPSHOT.pom
to org.apache.deltaspike.modules/proxy-module-project/1.5.4-SNAPSHOT/proxy-module-project-1.5.4-SNAPSHOT.pom
[JENKINS] Archiving <https://builds.apache.org/job/DeltaSpike_Wildfly_10/ws/deltaspike/modules/proxy/target/proxy-module-project-1.5.4-SNAPSHOT-tests.jar>
to org.apache.deltaspike.modules/proxy-module-project/1.5.4-SNAPSHOT/proxy-module-project-1.5.4-SNAPSHOT-tests.jar
/x1/jenkins/jenkins-slave/maven-repositories/1/org/apache/deltaspike/modules/proxy-module-project/1.5.4-SNAPSHOT/proxy-module-project-1.5.4-SNAPSHOT.pom
is not inside /x1/jenkins/jenkins-slave/workspace/DeltaSpike_Wildfly_10/deltaspike/modules/proxy/;
will archive in a separate pass
[JENKINS] Archiving /home/jenkins/jenkins-slave/maven-repositories/1/org/apache/deltaspike/parent/1.5.4-SNAPSHOT/parent-1.5.4-SNAPSHOT.pom
to org.apache.deltaspike/parent/1.5.4-SNAPSHOT/parent-1.5.4-SNAPSHOT.pom
/x1/jenkins/jenkins-slave/maven-repositories/1/org/apache/deltaspike/parent/1.5.4-SNAPSHOT/parent-1.5.4-SNAPSHOT.pom
is not inside /x1/jenkins/jenkins-slave/workspace/DeltaSpike_Wildfly_10/deltaspike/parent/;
will archive in a separate pass
Compressed 39.92 KB of artifacts by 80.2% relative to #57
[JENKINS] Archiving /home/jenkins/jenkins-slave/maven-repositories/1/org/apache/deltaspike/core/core-project/1.5.4-SNAPSHOT/core-project-1.5.4-SNAPSHOT.pom
to org.apache.deltaspike.core/core-project/1.5.4-SNAPSHOT/core-project-1.5.4-SNAPSHOT.pom
[JENKINS] Archiving <https://builds.apache.org/job/DeltaSpike_Wildfly_10/ws/deltaspike/core/target/core-project-1.5.4-SNAPSHOT-tests.jar>
to org.apache.deltaspike.core/core-project/1.5.4-SNAPSHOT/core-project-1.5.4-SNAPSHOT-tests.jar
/x1/jenkins/jenkins-slave/maven-repositories/1/org/apache/deltaspike/core/core-project/1.5.4-SNAPSHOT/core-project-1.5.4-SNAPSHOT.pom
is not inside /x1/jenkins/jenkins-slave/workspace/DeltaSpike_Wildfly_10/deltaspike/core/;
will archive in a separate pass
[JENKINS] Archiving <https://builds.apache.org/job/DeltaSpike_Wildfly_10/ws/deltaspike/core/api/pom.xml>
to org.apache.deltaspike.core/deltaspike-core-api/1.5.4-SNAPSHOT/deltaspike-core-api-1.5.4-SNAPSHOT.pom
[JENKINS] Archiving <https://builds.apache.org/job/DeltaSpike_Wildfly_10/ws/deltaspike/core/api/target/deltaspike-core-api-1.5.4-SNAPSHOT.jar>
to org.apache.deltaspike.core/deltaspike-core-api/1.5.4-SNAPSHOT/deltaspike-core-api-1.5.4-SNAPSHOT.jar
[JENKINS] Archiving <https://builds.apache.org/job/DeltaSpike_Wildfly_10/ws/deltaspike/core/api/target/deltaspike-core-api-1.5.4-SNAPSHOT-tests.jar>
to org.apache.deltaspike.core/deltaspike-core-api/1.5.4-SNAPSHOT/deltaspike-core-api-1.5.4-SNAPSHOT-tests.jar
[JENKINS] Archiving <https://builds.apache.org/job/DeltaSpike_Wildfly_10/ws/deltaspike/core/api/target/deltaspike-core-api-1.5.4-SNAPSHOT-sources.jar>
to org.apache.deltaspike.core/deltaspike-core-api/1.5.4-SNAPSHOT/deltaspike-core-api-1.5.4-SNAPSHOT-sources.jar
[JENKINS] Archiving /home/jenkins/jenkins-slave/maven-repositories/1/org/apache/deltaspike/deltaspike/1.5.4-SNAPSHOT/deltaspike-1.5.4-SNAPSHOT.pom
to org.apache.deltaspike/deltaspike/1.5.4-SNAPSHOT/deltaspike-1.5.4-SNAPSHOT.pom
/x1/jenkins/jenkins-slave/maven-repositories/1/org/apache/deltaspike/deltaspike/1.5.4-SNAPSHOT/deltaspike-1.5.4-SNAPSHOT.pom
is not inside /x1/jenkins/jenkins-slave/workspace/DeltaSpike_Wildfly_10/; will archive in
a separate pass
[JENKINS] Archiving /home/jenkins/jenkins-slave/maven-repositories/1/org/apache/deltaspike/deltaspike-project/1.5.4-SNAPSHOT/deltaspike-project-1.5.4-SNAPSHOT.pom
to org.apache.deltaspike/deltaspike-project/1.5.4-SNAPSHOT/deltaspike-project-1.5.4-SNAPSHOT.pom
/x1/jenkins/jenkins-slave/maven-repositories/1/org/apache/deltaspike/deltaspike-project/1.5.4-SNAPSHOT/deltaspike-project-1.5.4-SNAPSHOT.pom
is not inside /x1/jenkins/jenkins-slave/workspace/DeltaSpike_Wildfly_10/deltaspike/; will
archive in a separate pass
Sending e-mails to: commits@deltaspike.apache.org
channel stopped

Mime
View raw message