deltaspike-commits mailing list archives

Site index · List index
Message view « Date » · « Thread »
Top « Date » · « Thread »
From Apache Jenkins Server <jenk...@builds.apache.org>
Subject Build failed in Jenkins: DeltaSpike Deploy #1316
Date Thu, 28 Jan 2016 13:49:07 GMT
See <https://builds.apache.org/job/DeltaSpike%20Deploy/1316/>

------------------------------------------
[...truncated 1652 lines...]
[INFO] --- maven-bundle-plugin:2.3.7:bundle (default-bundle) @ deltaspike-core-impl ---
[WARNING] Bundle org.apache.deltaspike.core:deltaspike-core-impl:bundle:1.5.3-SNAPSHOT : Did
not find matching referal for !org.apache.deltaspike.core.impl.*
[INFO] 
[INFO] --- maven-site-plugin:3.3:attach-descriptor (attach-descriptor) @ deltaspike-core-impl
---
[INFO] 
[INFO] --- maven-jar-plugin:2.4:test-jar (default) @ deltaspike-core-impl ---
[INFO] Building jar: <https://builds.apache.org/job/DeltaSpike%20Deploy/ws/deltaspike/core/impl/target/deltaspike-core-impl-1.5.3-SNAPSHOT-tests.jar>
[INFO] 
[INFO] --- apache-rat-plugin:0.8:check (default) @ deltaspike-core-impl ---
[INFO] Exclude: .idea/**/*
[INFO] Exclude: readme/**/*
[INFO] Exclude: **/*.log
[INFO] 
[INFO] --- maven-bundle-plugin:2.3.7:cleanVersions (versions) @ deltaspike-core-impl ---
[INFO] 
[INFO] --- maven-antrun-plugin:1.7:run (javadoc.resources) @ deltaspike-core-impl ---
[WARNING] Parameter tasks is deprecated, use target instead
[INFO] Executing tasks

main:
[INFO] Executed tasks
[WARNING] Failed to getClass for org.apache.maven.plugin.source.SourceJarMojo
[INFO] 
[INFO] --- maven-source-plugin:2.2.1:jar (attach-sources) @ deltaspike-core-impl ---
[INFO] Building jar: <https://builds.apache.org/job/DeltaSpike%20Deploy/ws/deltaspike/core/impl/target/deltaspike-core-impl-1.5.3-SNAPSHOT-sources.jar>
[INFO] 
[INFO] --- maven-checkstyle-plugin:2.9.1:check (verify-style) @ deltaspike-core-impl ---
[INFO] Starting audit...
Audit done.

[INFO] 
[INFO] --- maven-install-plugin:2.5.1:install (default-install) @ deltaspike-core-impl ---
[INFO] Installing <https://builds.apache.org/job/DeltaSpike%20Deploy/ws/deltaspike/core/impl/target/deltaspike-core-impl-1.5.3-SNAPSHOT.jar>
to /home/jenkins/jenkins-slave/maven-repositories/0/org/apache/deltaspike/core/deltaspike-core-impl/1.5.3-SNAPSHOT/deltaspike-core-impl-1.5.3-SNAPSHOT.jar
[INFO] Installing <https://builds.apache.org/job/DeltaSpike%20Deploy/ws/deltaspike/core/impl/pom.xml>
to /home/jenkins/jenkins-slave/maven-repositories/0/org/apache/deltaspike/core/deltaspike-core-impl/1.5.3-SNAPSHOT/deltaspike-core-impl-1.5.3-SNAPSHOT.pom
[INFO] Installing <https://builds.apache.org/job/DeltaSpike%20Deploy/ws/deltaspike/core/impl/target/deltaspike-core-impl-1.5.3-SNAPSHOT-tests.jar>
to /home/jenkins/jenkins-slave/maven-repositories/0/org/apache/deltaspike/core/deltaspike-core-impl/1.5.3-SNAPSHOT/deltaspike-core-impl-1.5.3-SNAPSHOT-tests.jar
[INFO] Installing <https://builds.apache.org/job/DeltaSpike%20Deploy/ws/deltaspike/core/impl/target/deltaspike-core-impl-1.5.3-SNAPSHOT-sources.jar>
to /home/jenkins/jenkins-slave/maven-repositories/0/org/apache/deltaspike/core/deltaspike-core-impl/1.5.3-SNAPSHOT/deltaspike-core-impl-1.5.3-SNAPSHOT-sources.jar
[INFO] 
[INFO] --- maven-bundle-plugin:2.3.7:install (default-install) @ deltaspike-core-impl ---
[INFO] Installing org/apache/deltaspike/core/deltaspike-core-impl/1.5.3-SNAPSHOT/deltaspike-core-impl-1.5.3-SNAPSHOT.jar
[INFO] Writing OBR metadata
[INFO] 
[INFO] --- maven-deploy-plugin:2.8.1:deploy (default-deploy) @ deltaspike-core-impl ---
Downloading: https://repository.apache.org/content/repositories/snapshots/org/apache/deltaspike/core/deltaspike-core-impl/1.5.3-SNAPSHOT/maven-metadata.xml
Downloaded: https://repository.apache.org/content/repositories/snapshots/org/apache/deltaspike/core/deltaspike-core-impl/1.5.3-SNAPSHOT/maven-metadata.xml
(2 KB at 12.5 KB/sec)
Uploading: https://repository.apache.org/content/repositories/snapshots/org/apache/deltaspike/core/deltaspike-core-impl/1.5.3-SNAPSHOT/deltaspike-core-impl-1.5.3-20160128.134849-45.jar
Uploaded: https://repository.apache.org/content/repositories/snapshots/org/apache/deltaspike/core/deltaspike-core-impl/1.5.3-SNAPSHOT/deltaspike-core-impl-1.5.3-20160128.134849-45.jar
(124 KB at 519.9 KB/sec)
Uploading: https://repository.apache.org/content/repositories/snapshots/org/apache/deltaspike/core/deltaspike-core-impl/1.5.3-SNAPSHOT/deltaspike-core-impl-1.5.3-20160128.134849-45.pom
Uploaded: https://repository.apache.org/content/repositories/snapshots/org/apache/deltaspike/core/deltaspike-core-impl/1.5.3-SNAPSHOT/deltaspike-core-impl-1.5.3-20160128.134849-45.pom
(3 KB at 18.9 KB/sec)
Downloading: https://repository.apache.org/content/repositories/snapshots/org/apache/deltaspike/core/deltaspike-core-impl/maven-metadata.xml
Downloaded: https://repository.apache.org/content/repositories/snapshots/org/apache/deltaspike/core/deltaspike-core-impl/maven-metadata.xml
(740 B at 7.6 KB/sec)
Uploading: https://repository.apache.org/content/repositories/snapshots/org/apache/deltaspike/core/deltaspike-core-impl/1.5.3-SNAPSHOT/maven-metadata.xml
Uploaded: https://repository.apache.org/content/repositories/snapshots/org/apache/deltaspike/core/deltaspike-core-impl/1.5.3-SNAPSHOT/maven-metadata.xml
(2 KB at 7.2 KB/sec)
Uploading: https://repository.apache.org/content/repositories/snapshots/org/apache/deltaspike/core/deltaspike-core-impl/maven-metadata.xml
Uploaded: https://repository.apache.org/content/repositories/snapshots/org/apache/deltaspike/core/deltaspike-core-impl/maven-metadata.xml
(740 B at 4.2 KB/sec)
Uploading: https://repository.apache.org/content/repositories/snapshots/org/apache/deltaspike/core/deltaspike-core-impl/1.5.3-SNAPSHOT/deltaspike-core-impl-1.5.3-20160128.134849-45-tests.jar
Uploaded: https://repository.apache.org/content/repositories/snapshots/org/apache/deltaspike/core/deltaspike-core-impl/1.5.3-SNAPSHOT/deltaspike-core-impl-1.5.3-20160128.134849-45-tests.jar
(224 KB at 928.0 KB/sec)
Uploading: https://repository.apache.org/content/repositories/snapshots/org/apache/deltaspike/core/deltaspike-core-impl/1.5.3-SNAPSHOT/maven-metadata.xml
Uploaded: https://repository.apache.org/content/repositories/snapshots/org/apache/deltaspike/core/deltaspike-core-impl/1.5.3-SNAPSHOT/maven-metadata.xml
(2 KB at 6.3 KB/sec)
Uploading: https://repository.apache.org/content/repositories/snapshots/org/apache/deltaspike/core/deltaspike-core-impl/1.5.3-SNAPSHOT/deltaspike-core-impl-1.5.3-20160128.134849-45-sources.jar
Uploaded: https://repository.apache.org/content/repositories/snapshots/org/apache/deltaspike/core/deltaspike-core-impl/1.5.3-SNAPSHOT/deltaspike-core-impl-1.5.3-20160128.134849-45-sources.jar
(105 KB at 426.8 KB/sec)
Uploading: https://repository.apache.org/content/repositories/snapshots/org/apache/deltaspike/core/deltaspike-core-impl/1.5.3-SNAPSHOT/maven-metadata.xml
Uploaded: https://repository.apache.org/content/repositories/snapshots/org/apache/deltaspike/core/deltaspike-core-impl/1.5.3-SNAPSHOT/maven-metadata.xml
(2 KB at 7.7 KB/sec)
[INFO] 
[INFO] --- maven-bundle-plugin:2.3.7:deploy (default-deploy) @ deltaspike-core-impl ---
[INFO] Remote OBR update disabled (enable with -DremoteOBR)
[INFO] 
[INFO] --- apache-rat-plugin:0.8:check (default) @ deltaspike-core-impl ---
[INFO] Exclude: .idea/**/*
[INFO] Exclude: readme/**/*
[INFO] Exclude: **/*.log
[INFO] 
[INFO] --- maven-bundle-plugin:2.3.7:cleanVersions (versions) @ deltaspike-core-impl ---
[INFO] 
[INFO] --- maven-antrun-plugin:1.7:run (javadoc.resources) @ deltaspike-core-impl ---
[WARNING] Parameter tasks is deprecated, use target instead
[INFO] Executing tasks

main:
[INFO] Executed tasks
[WARNING] Failed to getClass for org.apache.maven.plugin.source.SourceJarMojo
[INFO] 
[INFO] --- maven-source-plugin:2.2.1:jar (default-cli) @ deltaspike-core-impl ---
[INFO]                                                                         
[INFO] ------------------------------------------------------------------------
[INFO] Building Apache DeltaSpike ContainerControl parent 1.5.3-SNAPSHOT
[INFO] ------------------------------------------------------------------------
[INFO] 
[INFO] --- maven-clean-plugin:2.5:clean (default-clean) @ cdictrl-project ---
[INFO] Deleting <https://builds.apache.org/job/DeltaSpike%20Deploy/ws/deltaspike/cdictrl/target>
[INFO] 
[INFO] --- apache-rat-plugin:0.8:check (default) @ cdictrl-project ---
[INFO] Exclude: .idea/**/*
[INFO] Exclude: readme/**/*
[INFO] Exclude: **/*.log
[INFO] ------------------------------------------------------------------------
[INFO] Reactor Summary:
[INFO] 
[INFO] Apache DeltaSpike ................................. SUCCESS [6.922s]
[INFO] Apache DeltaSpike Sources ......................... SUCCESS [6.815s]
[INFO] Apache DeltaSpike CheckStyle-rules ................ SUCCESS [3.602s]
[INFO] Apache DeltaSpike Parent .......................... SUCCESS [8.889s]
[INFO] Apache DeltaSpike Test-Utils ...................... SUCCESS [9.579s]
[INFO] Apache DeltaSpike Code Parent ..................... SUCCESS [5.474s]
[INFO] Apache DeltaSpike Core ............................ SUCCESS [4.215s]
[INFO] Apache DeltaSpike Core-API ........................ SUCCESS [31.029s]
[INFO] Apache DeltaSpike Core-Implementation ............. SUCCESS [42.965s]
[INFO] Apache DeltaSpike ContainerControl parent ......... FAILURE [0.514s]
[INFO] Apache DeltaSpike CDI ContainerControl API ........ SKIPPED
[INFO] Apache DeltaSpike CDI ContainerControl TCK ........ SKIPPED
[INFO] Apache DeltaSpike CDI OWB-ContainerControl ........ SKIPPED
[INFO] Apache DeltaSpike CDI Servlet-ContainerControl .... SKIPPED
[INFO] Apache DeltaSpike Modules ......................... SKIPPED
[INFO] Apache DeltaSpike Proxy-Module .................... SKIPPED
[INFO] Apache DeltaSpike Proxy-Module API ................ SKIPPED
[INFO] Apache DeltaSpike Proxy-Module Impl ASM5 .......... SKIPPED
[INFO] Apache DeltaSpike Security-Module ................. SKIPPED
[INFO] Apache DeltaSpike Security-Module API ............. SKIPPED
[INFO] Apache DeltaSpike Security-Module Impl ............ SKIPPED
[INFO] Apache DeltaSpike JPA-Module ...................... SKIPPED
[INFO] Apache DeltaSpike JPA-Module API .................. SKIPPED
[INFO] Apache DeltaSpike JPA-Module Impl ................. SKIPPED
[INFO] Apache DeltaSpike Servlet-Module .................. SKIPPED
[INFO] Apache DeltaSpike Servlet-Module API .............. SKIPPED
[INFO] Apache DeltaSpike Servlet-Module Impl ............. SKIPPED
[INFO] Apache DeltaSpike JSF-Module ...................... SKIPPED
[INFO] Apache DeltaSpike JSF-Module API .................. SKIPPED
[INFO] Apache DeltaSpike JSF-Module Impl ................. SKIPPED
[INFO] Apache DeltaSpike JSF-Module Impl (EE6 only) ...... SKIPPED
[INFO] Apache DeltaSpike Partial-Bean-Module ............. SKIPPED
[INFO] Apache DeltaSpike Partial-Bean-Module API ......... SKIPPED
[INFO] Apache DeltaSpike Partial-Bean-Module Impl ........ SKIPPED
[INFO] Apache DeltaSpike BeanValidation-Module ........... SKIPPED
[INFO] Apache DeltaSpike BeanValidation-Module API ....... SKIPPED
[INFO] Apache DeltaSpike BeanValidation-Module Impl ...... SKIPPED
[INFO] Apache DeltaSpike Data-Module ..................... SKIPPED
[INFO] Apache DeltaSpike Data-Module API ................. SKIPPED
[INFO] Apache DeltaSpike Data-Module Impl ................ SKIPPED
[INFO] Apache DeltaSpike Data-Module Tests on Java EE 7 .. SKIPPED
[INFO] Apache DeltaSpike Scheduler-Module ................ SKIPPED
[INFO] Apache DeltaSpike Scheduler-Module API ............ SKIPPED
[INFO] Apache DeltaSpike Scheduler-Module Impl ........... SKIPPED
[INFO] Apache DeltaSpike Test-Control-Module ............. SKIPPED
[INFO] Apache DeltaSpike Test-Control-Module API ......... SKIPPED
[INFO] Apache DeltaSpike Test-Control-Module Impl ........ SKIPPED
[INFO] Apache DeltaSpike Examples ........................ SKIPPED
[INFO] Apache DeltaSpike Java-SE Examples ................ SKIPPED
[INFO] Apache DeltaSpike JSF Examples .................... SKIPPED
[INFO] Apache DeltaSpike JSF Playground .................. SKIPPED
[INFO] Apache DeltaSpike Security Example CDI ............ SKIPPED
[INFO] Apache DeltaSpike Security Example PicketLink ..... SKIPPED
[INFO] Apache DeltaSpike Java-SE Scheduler Examples ...... SKIPPED
[INFO] Apache DeltaSpike Distribution .................... SKIPPED
[INFO] Apache DeltaSpike Distribution Bill of Materials .. SKIPPED
[INFO] Apache DeltaSpike Full Distribution ............... SKIPPED
[INFO] Apache DeltaSpike Documentation ................... SKIPPED
[INFO] Apache DeltaSpike Site ............................ SKIPPED
[INFO] ------------------------------------------------------------------------
[INFO] BUILD FAILURE
[INFO] ------------------------------------------------------------------------
[INFO] Total time: 2:10.432s
[INFO] Finished at: Thu Jan 28 13:48:53 UTC 2016
[INFO] Final Memory: 62M/831M
[INFO] ------------------------------------------------------------------------
Waiting for Jenkins to finish collecting data
[ERROR] Failed to execute goal org.apache.rat:apache-rat-plugin:0.8:check (default) on project
cdictrl-project: Too many unapproved licenses: 21 -> [Help 1]
[ERROR] 
[ERROR] To see the full stack trace of the errors, re-run Maven with the -e switch.
[ERROR] Re-run Maven using the -X switch to enable full debug logging.
[ERROR] 
[ERROR] For more information about the errors and possible solutions, please read the following
articles:
[ERROR] [Help 1] http://cwiki.apache.org/confluence/display/MAVEN/MojoFailureException
[ERROR] 
[ERROR] After correcting the problems, you can resume the build with the command
[ERROR]   mvn <goals> -rf :cdictrl-project
[JENKINS] Archiving <https://builds.apache.org/job/DeltaSpike%20Deploy/ws/deltaspike/examples/jse-examples/pom.xml>
to org.apache.deltaspike.examples/deltaspike-jse-example/1.5.3-SNAPSHOT/deltaspike-jse-example-1.5.3-SNAPSHOT.pom
[JENKINS] Archiving <https://builds.apache.org/job/DeltaSpike%20Deploy/ws/deltaspike/examples/security-requested-page-after-login-cdi/pom.xml>
to org.apache.deltaspike.examples/deltaspike-security-requested-page-after-login-cdi/1.5.3-SNAPSHOT/deltaspike-security-requested-page-after-login-cdi-1.5.3-SNAPSHOT.pom
[JENKINS] Archiving <https://builds.apache.org/job/DeltaSpike%20Deploy/ws/deltaspike/test-utils/pom.xml>
to org.apache.deltaspike.test/test-utils/1.5.3-SNAPSHOT/test-utils-1.5.3-SNAPSHOT.pom
[JENKINS] Archiving <https://builds.apache.org/job/DeltaSpike%20Deploy/ws/deltaspike/test-utils/target/test-utils-1.5.3-SNAPSHOT.jar>
to org.apache.deltaspike.test/test-utils/1.5.3-20160128.134724-46/test-utils-1.5.3-20160128.134724-46.jar
[JENKINS] Archiving <https://builds.apache.org/job/DeltaSpike%20Deploy/ws/deltaspike/test-utils/target/test-utils-1.5.3-SNAPSHOT-sources.jar>
to org.apache.deltaspike.test/test-utils/1.5.3-20160128.134724-46/test-utils-1.5.3-20160128.134724-46-sources.jar
[JENKINS] Archiving <https://builds.apache.org/job/DeltaSpike%20Deploy/ws/documentation/pom.xml>
to org.apache.deltaspike/deltaspike-documentation/1.5.3-SNAPSHOT/deltaspike-documentation-1.5.3-SNAPSHOT.pom
[JENKINS] Archiving <https://builds.apache.org/job/DeltaSpike%20Deploy/ws/deltaspike/modules/data/impl/pom.xml>
to org.apache.deltaspike.modules/deltaspike-data-module-impl/1.5.3-SNAPSHOT/deltaspike-data-module-impl-1.5.3-SNAPSHOT.pom
[JENKINS] Archiving <https://builds.apache.org/job/DeltaSpike%20Deploy/ws/deltaspike/modules/data/api/pom.xml>
to org.apache.deltaspike.modules/deltaspike-data-module-api/1.5.3-SNAPSHOT/deltaspike-data-module-api-1.5.3-SNAPSHOT.pom
[JENKINS] Archiving <https://builds.apache.org/job/DeltaSpike%20Deploy/ws/deltaspike/core/impl/pom.xml>
to org.apache.deltaspike.core/deltaspike-core-impl/1.5.3-SNAPSHOT/deltaspike-core-impl-1.5.3-SNAPSHOT.pom
[JENKINS] Archiving <https://builds.apache.org/job/DeltaSpike%20Deploy/ws/deltaspike/core/impl/target/deltaspike-core-impl-1.5.3-SNAPSHOT.jar>
to org.apache.deltaspike.core/deltaspike-core-impl/1.5.3-20160128.134849-45/deltaspike-core-impl-1.5.3-20160128.134849-45.jar
[JENKINS] Archiving <https://builds.apache.org/job/DeltaSpike%20Deploy/ws/deltaspike/core/impl/target/deltaspike-core-impl-1.5.3-SNAPSHOT-tests.jar>
to org.apache.deltaspike.core/deltaspike-core-impl/1.5.3-20160128.134849-45/deltaspike-core-impl-1.5.3-20160128.134849-45-tests.jar
[JENKINS] Archiving <https://builds.apache.org/job/DeltaSpike%20Deploy/ws/deltaspike/core/impl/target/deltaspike-core-impl-1.5.3-SNAPSHOT-sources.jar>
to org.apache.deltaspike.core/deltaspike-core-impl/1.5.3-20160128.134849-45/deltaspike-core-impl-1.5.3-20160128.134849-45-sources.jar
[JENKINS] Archiving <https://builds.apache.org/job/DeltaSpike%20Deploy/ws/deltaspike/modules/pom.xml>
to org.apache.deltaspike.modules/modules-project/1.5.3-SNAPSHOT/modules-project-1.5.3-SNAPSHOT.pom
[JENKINS] Archiving <https://builds.apache.org/job/DeltaSpike%20Deploy/ws/deltaspike/modules/test-control/pom.xml>
to org.apache.deltaspike.modules/test-control-module-project/1.5.3-SNAPSHOT/test-control-module-project-1.5.3-SNAPSHOT.pom
[JENKINS] Archiving <https://builds.apache.org/job/DeltaSpike%20Deploy/ws/deltaspike/examples/jsf-examples/pom.xml>
to org.apache.deltaspike.examples/deltaspike-jsf-example/1.5.3-SNAPSHOT/deltaspike-jsf-example-1.5.3-SNAPSHOT.pom
[JENKINS] Archiving <https://builds.apache.org/job/DeltaSpike%20Deploy/ws/deltaspike/cdictrl/servlet/pom.xml>
to org.apache.deltaspike.cdictrl/deltaspike-cdictrl-servlet/1.5.3-SNAPSHOT/deltaspike-cdictrl-servlet-1.5.3-SNAPSHOT.pom
[JENKINS] Archiving <https://builds.apache.org/job/DeltaSpike%20Deploy/ws/deltaspike/cdictrl/api/pom.xml>
to org.apache.deltaspike.cdictrl/deltaspike-cdictrl-api/1.5.3-SNAPSHOT/deltaspike-cdictrl-api-1.5.3-SNAPSHOT.pom
[JENKINS] Archiving <https://builds.apache.org/job/DeltaSpike%20Deploy/ws/deltaspike/examples/scheduler-playground/pom.xml>
to org.apache.deltaspike.examples/deltaspike-scheduler-example/1.5.3-SNAPSHOT/deltaspike-scheduler-example-1.5.3-SNAPSHOT.pom
[JENKINS] Archiving <https://builds.apache.org/job/DeltaSpike%20Deploy/ws/deltaspike/checkstyle-rules/pom.xml>
to org.apache.deltaspike/checkstyle-rules/1.5.3-SNAPSHOT/checkstyle-rules-1.5.3-SNAPSHOT.pom
[JENKINS] Archiving <https://builds.apache.org/job/DeltaSpike%20Deploy/ws/deltaspike/checkstyle-rules/target/checkstyle-rules-1.5.3-SNAPSHOT.jar>
to org.apache.deltaspike/checkstyle-rules/1.5.3-20160128.134705-46/checkstyle-rules-1.5.3-20160128.134705-46.jar
[JENKINS] Archiving <https://builds.apache.org/job/DeltaSpike%20Deploy/ws/deltaspike/checkstyle-rules/target/checkstyle-rules-1.5.3-SNAPSHOT-sources.jar>
to org.apache.deltaspike/checkstyle-rules/1.5.3-20160128.134705-46/checkstyle-rules-1.5.3-20160128.134705-46-sources.jar
[JENKINS] Archiving <https://builds.apache.org/job/DeltaSpike%20Deploy/ws/deltaspike/parent/code/pom.xml>
to org.apache.deltaspike/parent-code/1.5.3-SNAPSHOT/parent-code-1.5.3-SNAPSHOT.pom
[JENKINS] Archiving <https://builds.apache.org/job/DeltaSpike%20Deploy/ws/deltaspike/parent/code/target/parent-code-1.5.3-SNAPSHOT-tests.jar>
to org.apache.deltaspike/parent-code/1.5.3-20160128.134730-46/parent-code-1.5.3-20160128.134730-46-tests.jar
Compressed 79.17 KB of artifacts by 40.4% relative to #1315
[JENKINS] Archiving <https://builds.apache.org/job/DeltaSpike%20Deploy/ws/deltaspike/modules/jsf/impl/pom.xml>
to org.apache.deltaspike.modules/deltaspike-jsf-module-impl/1.5.3-SNAPSHOT/deltaspike-jsf-module-impl-1.5.3-SNAPSHOT.pom
[JENKINS] Archiving <https://builds.apache.org/job/DeltaSpike%20Deploy/ws/deltaspike/modules/partial-bean/pom.xml>
to org.apache.deltaspike.modules/partial-bean-module-project/1.5.3-SNAPSHOT/partial-bean-module-project-1.5.3-SNAPSHOT.pom
[JENKINS] Archiving <https://builds.apache.org/job/DeltaSpike%20Deploy/ws/deltaspike/examples/pom.xml>
to org.apache.deltaspike.examples/examples-project/1.5.3-SNAPSHOT/examples-project-1.5.3-SNAPSHOT.pom
[JENKINS] Archiving <https://builds.apache.org/job/DeltaSpike%20Deploy/ws/deltaspike/modules/jsf/pom.xml>
to org.apache.deltaspike.modules/jsf-module-project/1.5.3-SNAPSHOT/jsf-module-project-1.5.3-SNAPSHOT.pom
[JENKINS] Archiving <https://builds.apache.org/job/DeltaSpike%20Deploy/ws/deltaspike/cdictrl/tck/pom.xml>
to org.apache.deltaspike.test/deltaspike-cdictrl-tck/1.5.3-SNAPSHOT/deltaspike-cdictrl-tck-1.5.3-SNAPSHOT.pom
[JENKINS] Archiving <https://builds.apache.org/job/DeltaSpike%20Deploy/ws/deltaspike/modules/jsf/api/pom.xml>
to org.apache.deltaspike.modules/deltaspike-jsf-module-api/1.5.3-SNAPSHOT/deltaspike-jsf-module-api-1.5.3-SNAPSHOT.pom
[JENKINS] Archiving <https://builds.apache.org/job/DeltaSpike%20Deploy/ws/deltaspike/modules/security/pom.xml>
to org.apache.deltaspike.modules/security-module-project/1.5.3-SNAPSHOT/security-module-project-1.5.3-SNAPSHOT.pom
[JENKINS] Archiving <https://builds.apache.org/job/DeltaSpike%20Deploy/ws/deltaspike/modules/bean-validation/pom.xml>
to org.apache.deltaspike.modules/bean-validation-module-project/1.5.3-SNAPSHOT/bean-validation-module-project-1.5.3-SNAPSHOT.pom
[JENKINS] Archiving <https://builds.apache.org/job/DeltaSpike%20Deploy/ws/deltaspike/modules/partial-bean/impl/pom.xml>
to org.apache.deltaspike.modules/deltaspike-partial-bean-module-impl/1.5.3-SNAPSHOT/deltaspike-partial-bean-module-impl-1.5.3-SNAPSHOT.pom
[JENKINS] Archiving <https://builds.apache.org/job/DeltaSpike%20Deploy/ws/deltaspike/modules/proxy/api/pom.xml>
to org.apache.deltaspike.modules/deltaspike-proxy-module-api/1.5.3-SNAPSHOT/deltaspike-proxy-module-api-1.5.3-SNAPSHOT.pom
[JENKINS] Archiving <https://builds.apache.org/job/DeltaSpike%20Deploy/ws/deltaspike/modules/jpa/api/pom.xml>
to org.apache.deltaspike.modules/deltaspike-jpa-module-api/1.5.3-SNAPSHOT/deltaspike-jpa-module-api-1.5.3-SNAPSHOT.pom
[JENKINS] Archiving <https://builds.apache.org/job/DeltaSpike%20Deploy/ws/deltaspike/dist/full/pom.xml>
to org.apache.deltaspike.distribution/distribution-full/1.5.3-SNAPSHOT/distribution-full-1.5.3-SNAPSHOT.pom
[JENKINS] Archiving <https://builds.apache.org/job/DeltaSpike%20Deploy/ws/deltaspike/modules/servlet/api/pom.xml>
to org.apache.deltaspike.modules/deltaspike-servlet-module-api/1.5.3-SNAPSHOT/deltaspike-servlet-module-api-1.5.3-SNAPSHOT.pom
[JENKINS] Archiving <https://builds.apache.org/job/DeltaSpike%20Deploy/ws/deltaspike/modules/jpa/pom.xml>
to org.apache.deltaspike.modules/jpa-module-project/1.5.3-SNAPSHOT/jpa-module-project-1.5.3-SNAPSHOT.pom
[JENKINS] Archiving <https://builds.apache.org/job/DeltaSpike%20Deploy/ws/deltaspike/cdictrl/pom.xml>
to org.apache.deltaspike.cdictrl/cdictrl-project/1.5.3-SNAPSHOT/cdictrl-project-1.5.3-SNAPSHOT.pom
[JENKINS] Archiving <https://builds.apache.org/job/DeltaSpike%20Deploy/ws/deltaspike/modules/scheduler/api/pom.xml>
to org.apache.deltaspike.modules/deltaspike-scheduler-module-api/1.5.3-SNAPSHOT/deltaspike-scheduler-module-api-1.5.3-SNAPSHOT.pom
[JENKINS] Archiving <https://builds.apache.org/job/DeltaSpike%20Deploy/ws/deltaspike/modules/test-control/impl/pom.xml>
to org.apache.deltaspike.modules/deltaspike-test-control-module-impl/1.5.3-SNAPSHOT/deltaspike-test-control-module-impl-1.5.3-SNAPSHOT.pom
[JENKINS] Archiving <https://builds.apache.org/job/DeltaSpike%20Deploy/ws/deltaspike/dist/bom/pom.xml>
to org.apache.deltaspike.distribution/distributions-bom/1.5.3-SNAPSHOT/distributions-bom-1.5.3-SNAPSHOT.pom
[JENKINS] Archiving <https://builds.apache.org/job/DeltaSpike%20Deploy/ws/deltaspike/modules/servlet/pom.xml>
to org.apache.deltaspike.modules/servlet-module-project/1.5.3-SNAPSHOT/servlet-module-project-1.5.3-SNAPSHOT.pom
[JENKINS] Archiving <https://builds.apache.org/job/DeltaSpike%20Deploy/ws/deltaspike/modules/test-control/api/pom.xml>
to org.apache.deltaspike.modules/deltaspike-test-control-module-api/1.5.3-SNAPSHOT/deltaspike-test-control-module-api-1.5.3-SNAPSHOT.pom
[JENKINS] Archiving <https://builds.apache.org/job/DeltaSpike%20Deploy/ws/deltaspike/modules/jsf/impl-ee6/pom.xml>
to org.apache.deltaspike.modules/deltaspike-jsf-module-impl-ee6/1.5.3-SNAPSHOT/deltaspike-jsf-module-impl-ee6-1.5.3-SNAPSHOT.pom
[JENKINS] Archiving <https://builds.apache.org/job/DeltaSpike%20Deploy/ws/deltaspike/modules/proxy/pom.xml>
to org.apache.deltaspike.modules/proxy-module-project/1.5.3-SNAPSHOT/proxy-module-project-1.5.3-SNAPSHOT.pom
[JENKINS] Archiving <https://builds.apache.org/job/DeltaSpike%20Deploy/ws/deltaspike/dist/pom.xml>
to org.apache.deltaspike.distribution/distributions-project/1.5.3-SNAPSHOT/distributions-project-1.5.3-SNAPSHOT.pom
[JENKINS] Archiving <https://builds.apache.org/job/DeltaSpike%20Deploy/ws/deltaspike/modules/partial-bean/api/pom.xml>
to org.apache.deltaspike.modules/deltaspike-partial-bean-module-api/1.5.3-SNAPSHOT/deltaspike-partial-bean-module-api-1.5.3-SNAPSHOT.pom
[JENKINS] Archiving <https://builds.apache.org/job/DeltaSpike%20Deploy/ws/deltaspike/modules/scheduler/impl/pom.xml>
to org.apache.deltaspike.modules/deltaspike-scheduler-module-impl/1.5.3-SNAPSHOT/deltaspike-scheduler-module-impl-1.5.3-SNAPSHOT.pom
[JENKINS] Archiving <https://builds.apache.org/job/DeltaSpike%20Deploy/ws/deltaspike/parent/pom.xml>
to org.apache.deltaspike/parent/1.5.3-SNAPSHOT/parent-1.5.3-SNAPSHOT.pom
Compressed 39.92 KB of artifacts by 80.2% relative to #1315
[JENKINS] Archiving <https://builds.apache.org/job/DeltaSpike%20Deploy/ws/deltaspike/core/pom.xml>
to org.apache.deltaspike.core/core-project/1.5.3-SNAPSHOT/core-project-1.5.3-SNAPSHOT.pom
[JENKINS] Archiving <https://builds.apache.org/job/DeltaSpike%20Deploy/ws/deltaspike/core/target/core-project-1.5.3-SNAPSHOT-tests.jar>
to org.apache.deltaspike.core/core-project/1.5.3-20160128.134735-46/core-project-1.5.3-20160128.134735-46-tests.jar
[JENKINS] Archiving <https://builds.apache.org/job/DeltaSpike%20Deploy/ws/deltaspike/modules/bean-validation/api/pom.xml>
to org.apache.deltaspike.modules/deltaspike-bean-validation-module-api/1.5.3-SNAPSHOT/deltaspike-bean-validation-module-api-1.5.3-SNAPSHOT.pom
[JENKINS] Archiving <https://builds.apache.org/job/DeltaSpike%20Deploy/ws/deltaspike/core/api/pom.xml>
to org.apache.deltaspike.core/deltaspike-core-api/1.5.3-SNAPSHOT/deltaspike-core-api-1.5.3-SNAPSHOT.pom
[JENKINS] Archiving <https://builds.apache.org/job/DeltaSpike%20Deploy/ws/deltaspike/core/api/target/deltaspike-core-api-1.5.3-SNAPSHOT.jar>
to org.apache.deltaspike.core/deltaspike-core-api/1.5.3-20160128.134805-46/deltaspike-core-api-1.5.3-20160128.134805-46.jar
[JENKINS] Archiving <https://builds.apache.org/job/DeltaSpike%20Deploy/ws/deltaspike/core/api/target/deltaspike-core-api-1.5.3-SNAPSHOT-tests.jar>
to org.apache.deltaspike.core/deltaspike-core-api/1.5.3-20160128.134805-46/deltaspike-core-api-1.5.3-20160128.134805-46-tests.jar
[JENKINS] Archiving <https://builds.apache.org/job/DeltaSpike%20Deploy/ws/deltaspike/core/api/target/deltaspike-core-api-1.5.3-SNAPSHOT-sources.jar>
to org.apache.deltaspike.core/deltaspike-core-api/1.5.3-20160128.134805-46/deltaspike-core-api-1.5.3-20160128.134805-46-sources.jar
[JENKINS] Archiving <https://builds.apache.org/job/DeltaSpike%20Deploy/ws/deltaspike/modules/security/impl/pom.xml>
to org.apache.deltaspike.modules/deltaspike-security-module-impl/1.5.3-SNAPSHOT/deltaspike-security-module-impl-1.5.3-SNAPSHOT.pom
[JENKINS] Archiving <https://builds.apache.org/job/DeltaSpike%20Deploy/ws/deltaspike/modules/scheduler/pom.xml>
to org.apache.deltaspike.modules/scheduler-module-project/1.5.3-SNAPSHOT/scheduler-module-project-1.5.3-SNAPSHOT.pom
[JENKINS] Archiving <https://builds.apache.org/job/DeltaSpike%20Deploy/ws/site/pom.xml>
to org.apache.deltaspike/deltaspike-site/1.5.3-SNAPSHOT/deltaspike-site-1.5.3-SNAPSHOT.pom
[JENKINS] Archiving <https://builds.apache.org/job/DeltaSpike%20Deploy/ws/deltaspike/modules/proxy/impl-asm5/pom.xml>
to org.apache.deltaspike.modules/deltaspike-proxy-module-impl-asm5/1.5.3-SNAPSHOT/deltaspike-proxy-module-impl-asm5-1.5.3-SNAPSHOT.pom
[JENKINS] Archiving <https://builds.apache.org/job/DeltaSpike%20Deploy/ws/deltaspike/examples/jsf-playground/pom.xml>
to org.apache.deltaspike.examples/deltaspike-jsf-playground/1.5.3-SNAPSHOT/deltaspike-jsf-playground-1.5.3-SNAPSHOT.pom
[JENKINS] Archiving <https://builds.apache.org/job/DeltaSpike%20Deploy/ws/deltaspike/modules/servlet/impl/pom.xml>
to org.apache.deltaspike.modules/deltaspike-servlet-module-impl/1.5.3-SNAPSHOT/deltaspike-servlet-module-impl-1.5.3-SNAPSHOT.pom
[JENKINS] Archiving <https://builds.apache.org/job/DeltaSpike%20Deploy/ws/deltaspike/modules/bean-validation/impl/pom.xml>
to org.apache.deltaspike.modules/deltaspike-bean-validation-module-impl/1.5.3-SNAPSHOT/deltaspike-bean-validation-module-impl-1.5.3-SNAPSHOT.pom
[JENKINS] Archiving <https://builds.apache.org/job/DeltaSpike%20Deploy/ws/deltaspike/modules/data/test-ee7/pom.xml>
to org.apache.deltaspike.modules/deltaspike-data-module-test-ee7/1.5.3-SNAPSHOT/deltaspike-data-module-test-ee7-1.5.3-SNAPSHOT.pom
[JENKINS] Archiving <https://builds.apache.org/job/DeltaSpike%20Deploy/ws/deltaspike/cdictrl/impl-owb/pom.xml>
to org.apache.deltaspike.cdictrl/deltaspike-cdictrl-owb/1.5.3-SNAPSHOT/deltaspike-cdictrl-owb-1.5.3-SNAPSHOT.pom
[JENKINS] Archiving <https://builds.apache.org/job/DeltaSpike%20Deploy/ws/pom.xml> to
org.apache.deltaspike/deltaspike/1.5.3-SNAPSHOT/deltaspike-1.5.3-SNAPSHOT.pom
[JENKINS] Archiving <https://builds.apache.org/job/DeltaSpike%20Deploy/ws/deltaspike/modules/jpa/impl/pom.xml>
to org.apache.deltaspike.modules/deltaspike-jpa-module-impl/1.5.3-SNAPSHOT/deltaspike-jpa-module-impl-1.5.3-SNAPSHOT.pom
[JENKINS] Archiving <https://builds.apache.org/job/DeltaSpike%20Deploy/ws/deltaspike/modules/data/pom.xml>
to org.apache.deltaspike.modules/data-module-project/1.5.3-SNAPSHOT/data-module-project-1.5.3-SNAPSHOT.pom
[JENKINS] Archiving <https://builds.apache.org/job/DeltaSpike%20Deploy/ws/deltaspike/examples/security-requested-page-after-login-picketlink/pom.xml>
to org.apache.deltaspike.examples/deltaspike-security-requested-page-after-login-picketlink/1.5.3-SNAPSHOT/deltaspike-security-requested-page-after-login-picketlink-1.5.3-SNAPSHOT.pom
[JENKINS] Archiving <https://builds.apache.org/job/DeltaSpike%20Deploy/ws/deltaspike/pom.xml>
to org.apache.deltaspike/deltaspike-project/1.5.3-SNAPSHOT/deltaspike-project-1.5.3-SNAPSHOT.pom
[JENKINS] Archiving <https://builds.apache.org/job/DeltaSpike%20Deploy/ws/deltaspike/modules/security/api/pom.xml>
to org.apache.deltaspike.modules/deltaspike-security-module-api/1.5.3-SNAPSHOT/deltaspike-security-module-api-1.5.3-SNAPSHOT.pom
Sending e-mails to: commits@deltaspike.apache.org
channel stopped

Mime
View raw message