deltaspike-commits mailing list archives

Site index · List index
Message view « Date » · « Thread »
Top « Date » · « Thread »
From Apache Jenkins Server <jenk...@builds.apache.org>
Subject Build failed in Jenkins: DeltaSpike RAT-Check #2531
Date Sun, 20 Dec 2015 14:01:05 GMT
See <https://builds.apache.org/job/DeltaSpike%20RAT-Check/2531/changes>

Changes:

[hwellmann] DELTASPIKE-1007 transactional tests for abstract repositories

------------------------------------------
[...truncated 5783 lines...]
[INFO] --- maven-checkstyle-plugin:2.9.1:check (verify-style) @ deltaspike-data-module-impl
---
[INFO] Starting audit...
Audit done.

[INFO] 
[INFO] --- maven-install-plugin:2.5.1:install (default-install) @ deltaspike-data-module-impl
---
[INFO] Installing <https://builds.apache.org/job/DeltaSpike%20RAT-Check/ws/deltaspike/modules/data/impl/target/deltaspike-data-module-impl-1.5.3-SNAPSHOT.jar>
to /home/jenkins/jenkins-slave/maven-repositories/0/org/apache/deltaspike/modules/deltaspike-data-module-impl/1.5.3-SNAPSHOT/deltaspike-data-module-impl-1.5.3-SNAPSHOT.jar
[INFO] Installing <https://builds.apache.org/job/DeltaSpike%20RAT-Check/ws/deltaspike/modules/data/impl/pom.xml>
to /home/jenkins/jenkins-slave/maven-repositories/0/org/apache/deltaspike/modules/deltaspike-data-module-impl/1.5.3-SNAPSHOT/deltaspike-data-module-impl-1.5.3-SNAPSHOT.pom
[INFO] Installing <https://builds.apache.org/job/DeltaSpike%20RAT-Check/ws/deltaspike/modules/data/impl/target/deltaspike-data-module-impl-1.5.3-SNAPSHOT-tests.jar>
to /home/jenkins/jenkins-slave/maven-repositories/0/org/apache/deltaspike/modules/deltaspike-data-module-impl/1.5.3-SNAPSHOT/deltaspike-data-module-impl-1.5.3-SNAPSHOT-tests.jar
[INFO] Installing <https://builds.apache.org/job/DeltaSpike%20RAT-Check/ws/deltaspike/modules/data/impl/target/deltaspike-data-module-impl-1.5.3-SNAPSHOT-sources.jar>
to /home/jenkins/jenkins-slave/maven-repositories/0/org/apache/deltaspike/modules/deltaspike-data-module-impl/1.5.3-SNAPSHOT/deltaspike-data-module-impl-1.5.3-SNAPSHOT-sources.jar
[INFO] 
[INFO] --- maven-bundle-plugin:2.3.7:install (default-install) @ deltaspike-data-module-impl
---
[INFO] Installing org/apache/deltaspike/modules/deltaspike-data-module-impl/1.5.3-SNAPSHOT/deltaspike-data-module-impl-1.5.3-SNAPSHOT.jar
[INFO] Writing OBR metadata
[INFO]                                                                         
[INFO] ------------------------------------------------------------------------
[INFO] Building Apache DeltaSpike Data-Module Tests on Java EE 7 1.5.3-SNAPSHOT
[INFO] ------------------------------------------------------------------------
[INFO] 
[INFO] --- maven-clean-plugin:2.5:clean (default-clean) @ deltaspike-data-module-test-ee7
---
[INFO] 
[INFO] --- apache-rat-plugin:0.8:check (default) @ deltaspike-data-module-test-ee7 ---
[INFO] Exclude: .idea/**/*
[INFO] Exclude: readme/**/*
[INFO] Exclude: **/*.log
[INFO] ------------------------------------------------------------------------
[INFO] Reactor Summary:
[INFO] 
[INFO] Apache DeltaSpike ................................. SUCCESS [5.584s]
[INFO] Apache DeltaSpike Sources ......................... SUCCESS [4.122s]
[INFO] Apache DeltaSpike CheckStyle-rules ................ SUCCESS [3.257s]
[INFO] Apache DeltaSpike Parent .......................... SUCCESS [6.732s]
[INFO] Apache DeltaSpike Test-Utils ...................... SUCCESS [9.267s]
[INFO] Apache DeltaSpike Code Parent ..................... SUCCESS [6.999s]
[INFO] Apache DeltaSpike Core ............................ SUCCESS [2.408s]
[INFO] Apache DeltaSpike Core-API ........................ SUCCESS [20.659s]
[INFO] Apache DeltaSpike Core-Implementation ............. SUCCESS [33.693s]
[INFO] Apache DeltaSpike ContainerControl parent ......... SUCCESS [6.446s]
[INFO] Apache DeltaSpike CDI ContainerControl API ........ SUCCESS [8.297s]
[INFO] Apache DeltaSpike CDI ContainerControl TCK ........ SUCCESS [8.160s]
[INFO] Apache DeltaSpike CDI OWB-ContainerControl ........ SUCCESS [5.430s]
[INFO] Apache DeltaSpike CDI Weld-ContainerControl ....... SUCCESS [7.349s]
[INFO] Apache DeltaSpike CDI OpenEJB-ContainerControl .... SUCCESS [12.517s]
[INFO] Apache DeltaSpike CDI Servlet-ContainerControl .... SUCCESS [8.524s]
[INFO] Apache DeltaSpike Modules ......................... SUCCESS [6.721s]
[INFO] Apache DeltaSpike Proxy-Module .................... SUCCESS [3.654s]
[INFO] Apache DeltaSpike Proxy-Module API ................ SUCCESS [7.410s]
[INFO] Apache DeltaSpike Proxy-Module Impl ASM5 .......... SUCCESS [16.297s]
[INFO] Apache DeltaSpike Security-Module ................. SUCCESS [2.433s]
[INFO] Apache DeltaSpike Security-Module API ............. SUCCESS [7.106s]
[INFO] Apache DeltaSpike Security-Module Impl ............ SUCCESS [13.686s]
[INFO] Apache DeltaSpike JPA-Module ...................... SUCCESS [3.885s]
[INFO] Apache DeltaSpike JPA-Module API .................. SUCCESS [10.791s]
[INFO] Apache DeltaSpike JPA-Module Impl ................. SUCCESS [19.164s]
[INFO] Apache DeltaSpike Servlet-Module .................. SUCCESS [2.523s]
[INFO] Apache DeltaSpike Servlet-Module API .............. SUCCESS [4.350s]
[INFO] Apache DeltaSpike Servlet-Module Impl ............. SUCCESS [4.637s]
[INFO] Apache DeltaSpike JSF-Module ...................... SUCCESS [2.213s]
[INFO] Apache DeltaSpike JSF-Module API .................. SUCCESS [6.093s]
[INFO] Apache DeltaSpike JSF-Module Impl ................. SUCCESS [16.257s]
[INFO] Apache DeltaSpike JSF-Module Impl (EE6 only) ...... SUCCESS [4.677s]
[INFO] Apache DeltaSpike Partial-Bean-Module ............. SUCCESS [1.417s]
[INFO] Apache DeltaSpike Partial-Bean-Module API ......... SUCCESS [6.804s]
[INFO] Apache DeltaSpike Partial-Bean-Module Impl ........ SUCCESS [15.111s]
[INFO] Apache DeltaSpike BeanValidation-Module ........... SUCCESS [2.797s]
[INFO] Apache DeltaSpike BeanValidation-Module API ....... SUCCESS [3.618s]
[INFO] Apache DeltaSpike BeanValidation-Module Impl ...... SUCCESS [10.502s]
[INFO] Apache DeltaSpike Data-Module ..................... SUCCESS [2.783s]
[INFO] Apache DeltaSpike Data-Module API ................. SUCCESS [12.279s]
[INFO] Apache DeltaSpike Data-Module Impl ................ SUCCESS [17.434s]
[INFO] Apache DeltaSpike Data-Module Tests on Java EE 7 .. FAILURE [2.295s]
[INFO] Apache DeltaSpike Scheduler-Module ................ SKIPPED
[INFO] Apache DeltaSpike Scheduler-Module API ............ SKIPPED
[INFO] Apache DeltaSpike Scheduler-Module Impl ........... SKIPPED
[INFO] Apache DeltaSpike Test-Control-Module ............. SKIPPED
[INFO] Apache DeltaSpike Test-Control-Module API ......... SKIPPED
[INFO] Apache DeltaSpike Test-Control-Module Impl ........ SKIPPED
[INFO] Apache DeltaSpike Examples ........................ SKIPPED
[INFO] Apache DeltaSpike Java-SE Examples ................ SKIPPED
[INFO] Apache DeltaSpike JSF Examples .................... SKIPPED
[INFO] Apache DeltaSpike JSF Playground .................. SKIPPED
[INFO] Apache DeltaSpike Security Example CDI ............ SKIPPED
[INFO] Apache DeltaSpike Security Example PicketLink ..... SKIPPED
[INFO] Apache DeltaSpike Java-SE Scheduler Examples ...... SKIPPED
[INFO] Apache DeltaSpike Documentation ................... SKIPPED
[INFO] Apache DeltaSpike Site ............................ SKIPPED
[INFO] ------------------------------------------------------------------------
[INFO] BUILD FAILURE
[INFO] ------------------------------------------------------------------------
[INFO] Total time: 7:56.498s
[INFO] Finished at: Sun Dec 20 13:54:21 UTC 2015
[INFO] Final Memory: 109M/899M
[INFO] ------------------------------------------------------------------------
Waiting for Jenkins to finish collecting data
[ERROR] Failed to execute goal org.apache.rat:apache-rat-plugin:0.8:check (default) on project
deltaspike-data-module-test-ee7: Too many unapproved licenses: 6 -> [Help 1]
[ERROR] 
[ERROR] To see the full stack trace of the errors, re-run Maven with the -e switch.
[ERROR] Re-run Maven using the -X switch to enable full debug logging.
[ERROR] 
[ERROR] For more information about the errors and possible solutions, please read the following
articles:
[ERROR] [Help 1] http://cwiki.apache.org/confluence/display/MAVEN/MojoFailureException
[ERROR] 
[ERROR] After correcting the problems, you can resume the build with the command
[ERROR]   mvn <goals> -rf :deltaspike-data-module-test-ee7
[JENKINS] Archiving <https://builds.apache.org/job/DeltaSpike%20RAT-Check/ws/deltaspike/examples/jse-examples/pom.xml>
to org.apache.deltaspike.examples/deltaspike-jse-example/1.5.3-SNAPSHOT/deltaspike-jse-example-1.5.3-SNAPSHOT.pom
[JENKINS] Archiving <https://builds.apache.org/job/DeltaSpike%20RAT-Check/ws/deltaspike/examples/security-requested-page-after-login-cdi/pom.xml>
to org.apache.deltaspike.examples/deltaspike-security-requested-page-after-login-cdi/1.5.3-SNAPSHOT/deltaspike-security-requested-page-after-login-cdi-1.5.3-SNAPSHOT.pom
[JENKINS] Archiving <https://builds.apache.org/job/DeltaSpike%20RAT-Check/ws/deltaspike/test-utils/pom.xml>
to org.apache.deltaspike.test/test-utils/1.5.3-SNAPSHOT/test-utils-1.5.3-SNAPSHOT.pom
[JENKINS] Archiving <https://builds.apache.org/job/DeltaSpike%20RAT-Check/ws/deltaspike/test-utils/target/test-utils-1.5.3-SNAPSHOT.jar>
to org.apache.deltaspike.test/test-utils/1.5.3-SNAPSHOT/test-utils-1.5.3-SNAPSHOT.jar
[JENKINS] Archiving <https://builds.apache.org/job/DeltaSpike%20RAT-Check/ws/deltaspike/test-utils/target/test-utils-1.5.3-SNAPSHOT-sources.jar>
to org.apache.deltaspike.test/test-utils/1.5.3-SNAPSHOT/test-utils-1.5.3-SNAPSHOT-sources.jar
[JENKINS] Archiving <https://builds.apache.org/job/DeltaSpike%20RAT-Check/ws/documentation/pom.xml>
to org.apache.deltaspike/deltaspike-documentation/1.5.3-SNAPSHOT/deltaspike-documentation-1.5.3-SNAPSHOT.pom
[JENKINS] Archiving <https://builds.apache.org/job/DeltaSpike%20RAT-Check/ws/deltaspike/modules/data/impl/pom.xml>
to org.apache.deltaspike.modules/deltaspike-data-module-impl/1.5.3-SNAPSHOT/deltaspike-data-module-impl-1.5.3-SNAPSHOT.pom
[JENKINS] Archiving <https://builds.apache.org/job/DeltaSpike%20RAT-Check/ws/deltaspike/modules/data/impl/target/deltaspike-data-module-impl-1.5.3-SNAPSHOT.jar>
to org.apache.deltaspike.modules/deltaspike-data-module-impl/1.5.3-SNAPSHOT/deltaspike-data-module-impl-1.5.3-SNAPSHOT.jar
[JENKINS] Archiving <https://builds.apache.org/job/DeltaSpike%20RAT-Check/ws/deltaspike/modules/data/impl/target/deltaspike-data-module-impl-1.5.3-SNAPSHOT-tests.jar>
to org.apache.deltaspike.modules/deltaspike-data-module-impl/1.5.3-SNAPSHOT/deltaspike-data-module-impl-1.5.3-SNAPSHOT-tests.jar
[JENKINS] Archiving <https://builds.apache.org/job/DeltaSpike%20RAT-Check/ws/deltaspike/modules/data/impl/target/deltaspike-data-module-impl-1.5.3-SNAPSHOT-sources.jar>
to org.apache.deltaspike.modules/deltaspike-data-module-impl/1.5.3-SNAPSHOT/deltaspike-data-module-impl-1.5.3-SNAPSHOT-sources.jar
[JENKINS] Archiving <https://builds.apache.org/job/DeltaSpike%20RAT-Check/ws/deltaspike/modules/data/api/pom.xml>
to org.apache.deltaspike.modules/deltaspike-data-module-api/1.5.3-SNAPSHOT/deltaspike-data-module-api-1.5.3-SNAPSHOT.pom
[JENKINS] Archiving <https://builds.apache.org/job/DeltaSpike%20RAT-Check/ws/deltaspike/modules/data/api/target/deltaspike-data-module-api-1.5.3-SNAPSHOT.jar>
to org.apache.deltaspike.modules/deltaspike-data-module-api/1.5.3-SNAPSHOT/deltaspike-data-module-api-1.5.3-SNAPSHOT.jar
[JENKINS] Archiving <https://builds.apache.org/job/DeltaSpike%20RAT-Check/ws/deltaspike/modules/data/api/target/deltaspike-data-module-api-1.5.3-SNAPSHOT-tests.jar>
to org.apache.deltaspike.modules/deltaspike-data-module-api/1.5.3-SNAPSHOT/deltaspike-data-module-api-1.5.3-SNAPSHOT-tests.jar
[JENKINS] Archiving <https://builds.apache.org/job/DeltaSpike%20RAT-Check/ws/deltaspike/modules/data/api/target/deltaspike-data-module-api-1.5.3-SNAPSHOT-sources.jar>
to org.apache.deltaspike.modules/deltaspike-data-module-api/1.5.3-SNAPSHOT/deltaspike-data-module-api-1.5.3-SNAPSHOT-sources.jar
[JENKINS] Archiving <https://builds.apache.org/job/DeltaSpike%20RAT-Check/ws/deltaspike/core/impl/pom.xml>
to org.apache.deltaspike.core/deltaspike-core-impl/1.5.3-SNAPSHOT/deltaspike-core-impl-1.5.3-SNAPSHOT.pom
[JENKINS] Archiving <https://builds.apache.org/job/DeltaSpike%20RAT-Check/ws/deltaspike/core/impl/target/deltaspike-core-impl-1.5.3-SNAPSHOT.jar>
to org.apache.deltaspike.core/deltaspike-core-impl/1.5.3-SNAPSHOT/deltaspike-core-impl-1.5.3-SNAPSHOT.jar
[JENKINS] Archiving <https://builds.apache.org/job/DeltaSpike%20RAT-Check/ws/deltaspike/core/impl/target/deltaspike-core-impl-1.5.3-SNAPSHOT-tests.jar>
to org.apache.deltaspike.core/deltaspike-core-impl/1.5.3-SNAPSHOT/deltaspike-core-impl-1.5.3-SNAPSHOT-tests.jar
[JENKINS] Archiving <https://builds.apache.org/job/DeltaSpike%20RAT-Check/ws/deltaspike/core/impl/target/deltaspike-core-impl-1.5.3-SNAPSHOT-sources.jar>
to org.apache.deltaspike.core/deltaspike-core-impl/1.5.3-SNAPSHOT/deltaspike-core-impl-1.5.3-SNAPSHOT-sources.jar
[JENKINS] Archiving <https://builds.apache.org/job/DeltaSpike%20RAT-Check/ws/deltaspike/modules/pom.xml>
to org.apache.deltaspike.modules/modules-project/1.5.3-SNAPSHOT/modules-project-1.5.3-SNAPSHOT.pom
[JENKINS] Archiving <https://builds.apache.org/job/DeltaSpike%20RAT-Check/ws/deltaspike/modules/target/modules-project-1.5.3-SNAPSHOT-tests.jar>
to org.apache.deltaspike.modules/modules-project/1.5.3-SNAPSHOT/modules-project-1.5.3-SNAPSHOT-tests.jar
[JENKINS] Archiving <https://builds.apache.org/job/DeltaSpike%20RAT-Check/ws/deltaspike/modules/test-control/pom.xml>
to org.apache.deltaspike.modules/test-control-module-project/1.5.3-SNAPSHOT/test-control-module-project-1.5.3-SNAPSHOT.pom
[JENKINS] Archiving <https://builds.apache.org/job/DeltaSpike%20RAT-Check/ws/deltaspike/examples/jsf-examples/pom.xml>
to org.apache.deltaspike.examples/deltaspike-jsf-example/1.5.3-SNAPSHOT/deltaspike-jsf-example-1.5.3-SNAPSHOT.pom
[JENKINS] Archiving <https://builds.apache.org/job/DeltaSpike%20RAT-Check/ws/deltaspike/cdictrl/servlet/pom.xml>
to org.apache.deltaspike.cdictrl/deltaspike-cdictrl-servlet/1.5.3-SNAPSHOT/deltaspike-cdictrl-servlet-1.5.3-SNAPSHOT.pom
[JENKINS] Archiving <https://builds.apache.org/job/DeltaSpike%20RAT-Check/ws/deltaspike/cdictrl/servlet/target/deltaspike-cdictrl-servlet-1.5.3-SNAPSHOT.jar>
to org.apache.deltaspike.cdictrl/deltaspike-cdictrl-servlet/1.5.3-SNAPSHOT/deltaspike-cdictrl-servlet-1.5.3-SNAPSHOT.jar
[JENKINS] Archiving <https://builds.apache.org/job/DeltaSpike%20RAT-Check/ws/deltaspike/cdictrl/servlet/target/deltaspike-cdictrl-servlet-1.5.3-SNAPSHOT-sources.jar>
to org.apache.deltaspike.cdictrl/deltaspike-cdictrl-servlet/1.5.3-SNAPSHOT/deltaspike-cdictrl-servlet-1.5.3-SNAPSHOT-sources.jar
[JENKINS] Archiving <https://builds.apache.org/job/DeltaSpike%20RAT-Check/ws/deltaspike/cdictrl/api/pom.xml>
to org.apache.deltaspike.cdictrl/deltaspike-cdictrl-api/1.5.3-SNAPSHOT/deltaspike-cdictrl-api-1.5.3-SNAPSHOT.pom
[JENKINS] Archiving <https://builds.apache.org/job/DeltaSpike%20RAT-Check/ws/deltaspike/cdictrl/api/target/deltaspike-cdictrl-api-1.5.3-SNAPSHOT.jar>
to org.apache.deltaspike.cdictrl/deltaspike-cdictrl-api/1.5.3-SNAPSHOT/deltaspike-cdictrl-api-1.5.3-SNAPSHOT.jar
[JENKINS] Archiving <https://builds.apache.org/job/DeltaSpike%20RAT-Check/ws/deltaspike/cdictrl/api/target/deltaspike-cdictrl-api-1.5.3-SNAPSHOT-sources.jar>
to org.apache.deltaspike.cdictrl/deltaspike-cdictrl-api/1.5.3-SNAPSHOT/deltaspike-cdictrl-api-1.5.3-SNAPSHOT-sources.jar
[JENKINS] Archiving <https://builds.apache.org/job/DeltaSpike%20RAT-Check/ws/deltaspike/examples/scheduler-playground/pom.xml>
to org.apache.deltaspike.examples/deltaspike-scheduler-example/1.5.3-SNAPSHOT/deltaspike-scheduler-example-1.5.3-SNAPSHOT.pom
[JENKINS] Archiving <https://builds.apache.org/job/DeltaSpike%20RAT-Check/ws/deltaspike/checkstyle-rules/pom.xml>
to org.apache.deltaspike/checkstyle-rules/1.5.3-SNAPSHOT/checkstyle-rules-1.5.3-SNAPSHOT.pom
[JENKINS] Archiving <https://builds.apache.org/job/DeltaSpike%20RAT-Check/ws/deltaspike/checkstyle-rules/target/checkstyle-rules-1.5.3-SNAPSHOT.jar>
to org.apache.deltaspike/checkstyle-rules/1.5.3-SNAPSHOT/checkstyle-rules-1.5.3-SNAPSHOT.jar
[JENKINS] Archiving <https://builds.apache.org/job/DeltaSpike%20RAT-Check/ws/deltaspike/parent/code/pom.xml>
to org.apache.deltaspike/parent-code/1.5.3-SNAPSHOT/parent-code-1.5.3-SNAPSHOT.pom
[JENKINS] Archiving <https://builds.apache.org/job/DeltaSpike%20RAT-Check/ws/deltaspike/parent/code/target/parent-code-1.5.3-SNAPSHOT-tests.jar>
to org.apache.deltaspike/parent-code/1.5.3-SNAPSHOT/parent-code-1.5.3-SNAPSHOT-tests.jar
Compressed 79.15 KB of artifacts by 40.4% relative to #2530
[JENKINS] Archiving <https://builds.apache.org/job/DeltaSpike%20RAT-Check/ws/deltaspike/modules/jsf/impl/pom.xml>
to org.apache.deltaspike.modules/deltaspike-jsf-module-impl/1.5.3-SNAPSHOT/deltaspike-jsf-module-impl-1.5.3-SNAPSHOT.pom
[JENKINS] Archiving <https://builds.apache.org/job/DeltaSpike%20RAT-Check/ws/deltaspike/modules/jsf/impl/target/deltaspike-jsf-module-impl-1.5.3-SNAPSHOT.jar>
to org.apache.deltaspike.modules/deltaspike-jsf-module-impl/1.5.3-SNAPSHOT/deltaspike-jsf-module-impl-1.5.3-SNAPSHOT.jar
[JENKINS] Archiving <https://builds.apache.org/job/DeltaSpike%20RAT-Check/ws/deltaspike/modules/jsf/impl/target/deltaspike-jsf-module-impl-1.5.3-SNAPSHOT-tests.jar>
to org.apache.deltaspike.modules/deltaspike-jsf-module-impl/1.5.3-SNAPSHOT/deltaspike-jsf-module-impl-1.5.3-SNAPSHOT-tests.jar
[JENKINS] Archiving <https://builds.apache.org/job/DeltaSpike%20RAT-Check/ws/deltaspike/modules/jsf/impl/target/deltaspike-jsf-module-impl-1.5.3-SNAPSHOT-sources.jar>
to org.apache.deltaspike.modules/deltaspike-jsf-module-impl/1.5.3-SNAPSHOT/deltaspike-jsf-module-impl-1.5.3-SNAPSHOT-sources.jar
[JENKINS] Archiving <https://builds.apache.org/job/DeltaSpike%20RAT-Check/ws/deltaspike/modules/partial-bean/pom.xml>
to org.apache.deltaspike.modules/partial-bean-module-project/1.5.3-SNAPSHOT/partial-bean-module-project-1.5.3-SNAPSHOT.pom
[JENKINS] Archiving <https://builds.apache.org/job/DeltaSpike%20RAT-Check/ws/deltaspike/modules/partial-bean/target/partial-bean-module-project-1.5.3-SNAPSHOT-tests.jar>
to org.apache.deltaspike.modules/partial-bean-module-project/1.5.3-SNAPSHOT/partial-bean-module-project-1.5.3-SNAPSHOT-tests.jar
[JENKINS] Archiving <https://builds.apache.org/job/DeltaSpike%20RAT-Check/ws/deltaspike/examples/pom.xml>
to org.apache.deltaspike.examples/examples-project/1.5.3-SNAPSHOT/examples-project-1.5.3-SNAPSHOT.pom
[JENKINS] Archiving <https://builds.apache.org/job/DeltaSpike%20RAT-Check/ws/deltaspike/cdictrl/impl-openejb/pom.xml>
to org.apache.deltaspike.cdictrl/deltaspike-cdictrl-openejb/1.5.3-SNAPSHOT/deltaspike-cdictrl-openejb-1.5.3-SNAPSHOT.pom
[JENKINS] Archiving <https://builds.apache.org/job/DeltaSpike%20RAT-Check/ws/deltaspike/cdictrl/impl-openejb/target/deltaspike-cdictrl-openejb-1.5.3-SNAPSHOT.jar>
to org.apache.deltaspike.cdictrl/deltaspike-cdictrl-openejb/1.5.3-SNAPSHOT/deltaspike-cdictrl-openejb-1.5.3-SNAPSHOT.jar
[JENKINS] Archiving <https://builds.apache.org/job/DeltaSpike%20RAT-Check/ws/deltaspike/cdictrl/impl-openejb/target/deltaspike-cdictrl-openejb-1.5.3-SNAPSHOT-sources.jar>
to org.apache.deltaspike.cdictrl/deltaspike-cdictrl-openejb/1.5.3-SNAPSHOT/deltaspike-cdictrl-openejb-1.5.3-SNAPSHOT-sources.jar
[JENKINS] Archiving <https://builds.apache.org/job/DeltaSpike%20RAT-Check/ws/deltaspike/modules/jsf/pom.xml>
to org.apache.deltaspike.modules/jsf-module-project/1.5.3-SNAPSHOT/jsf-module-project-1.5.3-SNAPSHOT.pom
[JENKINS] Archiving <https://builds.apache.org/job/DeltaSpike%20RAT-Check/ws/deltaspike/modules/jsf/target/jsf-module-project-1.5.3-SNAPSHOT-tests.jar>
to org.apache.deltaspike.modules/jsf-module-project/1.5.3-SNAPSHOT/jsf-module-project-1.5.3-SNAPSHOT-tests.jar
[JENKINS] Archiving <https://builds.apache.org/job/DeltaSpike%20RAT-Check/ws/deltaspike/cdictrl/tck/pom.xml>
to org.apache.deltaspike.test/deltaspike-cdictrl-tck/1.5.3-SNAPSHOT/deltaspike-cdictrl-tck-1.5.3-SNAPSHOT.pom
[JENKINS] Archiving <https://builds.apache.org/job/DeltaSpike%20RAT-Check/ws/deltaspike/cdictrl/tck/target/deltaspike-cdictrl-tck-1.5.3-SNAPSHOT.jar>
to org.apache.deltaspike.test/deltaspike-cdictrl-tck/1.5.3-SNAPSHOT/deltaspike-cdictrl-tck-1.5.3-SNAPSHOT.jar
[JENKINS] Archiving <https://builds.apache.org/job/DeltaSpike%20RAT-Check/ws/deltaspike/cdictrl/tck/target/deltaspike-cdictrl-tck-1.5.3-SNAPSHOT-sources.jar>
to org.apache.deltaspike.test/deltaspike-cdictrl-tck/1.5.3-SNAPSHOT/deltaspike-cdictrl-tck-1.5.3-SNAPSHOT-sources.jar
[JENKINS] Archiving <https://builds.apache.org/job/DeltaSpike%20RAT-Check/ws/deltaspike/modules/jsf/api/pom.xml>
to org.apache.deltaspike.modules/deltaspike-jsf-module-api/1.5.3-SNAPSHOT/deltaspike-jsf-module-api-1.5.3-SNAPSHOT.pom
[JENKINS] Archiving <https://builds.apache.org/job/DeltaSpike%20RAT-Check/ws/deltaspike/modules/jsf/api/target/deltaspike-jsf-module-api-1.5.3-SNAPSHOT.jar>
to org.apache.deltaspike.modules/deltaspike-jsf-module-api/1.5.3-SNAPSHOT/deltaspike-jsf-module-api-1.5.3-SNAPSHOT.jar
[JENKINS] Archiving <https://builds.apache.org/job/DeltaSpike%20RAT-Check/ws/deltaspike/modules/jsf/api/target/deltaspike-jsf-module-api-1.5.3-SNAPSHOT-tests.jar>
to org.apache.deltaspike.modules/deltaspike-jsf-module-api/1.5.3-SNAPSHOT/deltaspike-jsf-module-api-1.5.3-SNAPSHOT-tests.jar
[JENKINS] Archiving <https://builds.apache.org/job/DeltaSpike%20RAT-Check/ws/deltaspike/modules/jsf/api/target/deltaspike-jsf-module-api-1.5.3-SNAPSHOT-sources.jar>
to org.apache.deltaspike.modules/deltaspike-jsf-module-api/1.5.3-SNAPSHOT/deltaspike-jsf-module-api-1.5.3-SNAPSHOT-sources.jar
[JENKINS] Archiving <https://builds.apache.org/job/DeltaSpike%20RAT-Check/ws/deltaspike/modules/security/pom.xml>
to org.apache.deltaspike.modules/security-module-project/1.5.3-SNAPSHOT/security-module-project-1.5.3-SNAPSHOT.pom
[JENKINS] Archiving <https://builds.apache.org/job/DeltaSpike%20RAT-Check/ws/deltaspike/modules/security/target/security-module-project-1.5.3-SNAPSHOT-tests.jar>
to org.apache.deltaspike.modules/security-module-project/1.5.3-SNAPSHOT/security-module-project-1.5.3-SNAPSHOT-tests.jar
[JENKINS] Archiving <https://builds.apache.org/job/DeltaSpike%20RAT-Check/ws/deltaspike/modules/bean-validation/pom.xml>
to org.apache.deltaspike.modules/bean-validation-module-project/1.5.3-SNAPSHOT/bean-validation-module-project-1.5.3-SNAPSHOT.pom
[JENKINS] Archiving <https://builds.apache.org/job/DeltaSpike%20RAT-Check/ws/deltaspike/modules/bean-validation/target/bean-validation-module-project-1.5.3-SNAPSHOT-tests.jar>
to org.apache.deltaspike.modules/bean-validation-module-project/1.5.3-SNAPSHOT/bean-validation-module-project-1.5.3-SNAPSHOT-tests.jar
[JENKINS] Archiving <https://builds.apache.org/job/DeltaSpike%20RAT-Check/ws/deltaspike/modules/partial-bean/impl/pom.xml>
to org.apache.deltaspike.modules/deltaspike-partial-bean-module-impl/1.5.3-SNAPSHOT/deltaspike-partial-bean-module-impl-1.5.3-SNAPSHOT.pom
[JENKINS] Archiving <https://builds.apache.org/job/DeltaSpike%20RAT-Check/ws/deltaspike/modules/partial-bean/impl/target/deltaspike-partial-bean-module-impl-1.5.3-SNAPSHOT.jar>
to org.apache.deltaspike.modules/deltaspike-partial-bean-module-impl/1.5.3-SNAPSHOT/deltaspike-partial-bean-module-impl-1.5.3-SNAPSHOT.jar
[JENKINS] Archiving <https://builds.apache.org/job/DeltaSpike%20RAT-Check/ws/deltaspike/modules/partial-bean/impl/target/deltaspike-partial-bean-module-impl-1.5.3-SNAPSHOT-tests.jar>
to org.apache.deltaspike.modules/deltaspike-partial-bean-module-impl/1.5.3-SNAPSHOT/deltaspike-partial-bean-module-impl-1.5.3-SNAPSHOT-tests.jar
[JENKINS] Archiving <https://builds.apache.org/job/DeltaSpike%20RAT-Check/ws/deltaspike/modules/partial-bean/impl/target/deltaspike-partial-bean-module-impl-1.5.3-SNAPSHOT-sources.jar>
to org.apache.deltaspike.modules/deltaspike-partial-bean-module-impl/1.5.3-SNAPSHOT/deltaspike-partial-bean-module-impl-1.5.3-SNAPSHOT-sources.jar
[JENKINS] Archiving <https://builds.apache.org/job/DeltaSpike%20RAT-Check/ws/deltaspike/modules/proxy/api/pom.xml>
to org.apache.deltaspike.modules/deltaspike-proxy-module-api/1.5.3-SNAPSHOT/deltaspike-proxy-module-api-1.5.3-SNAPSHOT.pom
[JENKINS] Archiving <https://builds.apache.org/job/DeltaSpike%20RAT-Check/ws/deltaspike/modules/proxy/api/target/deltaspike-proxy-module-api-1.5.3-SNAPSHOT.jar>
to org.apache.deltaspike.modules/deltaspike-proxy-module-api/1.5.3-SNAPSHOT/deltaspike-proxy-module-api-1.5.3-SNAPSHOT.jar
[JENKINS] Archiving <https://builds.apache.org/job/DeltaSpike%20RAT-Check/ws/deltaspike/modules/proxy/api/target/deltaspike-proxy-module-api-1.5.3-SNAPSHOT-tests.jar>
to org.apache.deltaspike.modules/deltaspike-proxy-module-api/1.5.3-SNAPSHOT/deltaspike-proxy-module-api-1.5.3-SNAPSHOT-tests.jar
[JENKINS] Archiving <https://builds.apache.org/job/DeltaSpike%20RAT-Check/ws/deltaspike/modules/proxy/api/target/deltaspike-proxy-module-api-1.5.3-SNAPSHOT-sources.jar>
to org.apache.deltaspike.modules/deltaspike-proxy-module-api/1.5.3-SNAPSHOT/deltaspike-proxy-module-api-1.5.3-SNAPSHOT-sources.jar
[JENKINS] Archiving <https://builds.apache.org/job/DeltaSpike%20RAT-Check/ws/deltaspike/cdictrl/impl-weld/pom.xml>
to org.apache.deltaspike.cdictrl/deltaspike-cdictrl-weld/1.5.3-SNAPSHOT/deltaspike-cdictrl-weld-1.5.3-SNAPSHOT.pom
[JENKINS] Archiving <https://builds.apache.org/job/DeltaSpike%20RAT-Check/ws/deltaspike/cdictrl/impl-weld/target/deltaspike-cdictrl-weld-1.5.3-SNAPSHOT.jar>
to org.apache.deltaspike.cdictrl/deltaspike-cdictrl-weld/1.5.3-SNAPSHOT/deltaspike-cdictrl-weld-1.5.3-SNAPSHOT.jar
[JENKINS] Archiving <https://builds.apache.org/job/DeltaSpike%20RAT-Check/ws/deltaspike/cdictrl/impl-weld/target/deltaspike-cdictrl-weld-1.5.3-SNAPSHOT-sources.jar>
to org.apache.deltaspike.cdictrl/deltaspike-cdictrl-weld/1.5.3-SNAPSHOT/deltaspike-cdictrl-weld-1.5.3-SNAPSHOT-sources.jar
[JENKINS] Archiving <https://builds.apache.org/job/DeltaSpike%20RAT-Check/ws/deltaspike/modules/jpa/api/pom.xml>
to org.apache.deltaspike.modules/deltaspike-jpa-module-api/1.5.3-SNAPSHOT/deltaspike-jpa-module-api-1.5.3-SNAPSHOT.pom
[JENKINS] Archiving <https://builds.apache.org/job/DeltaSpike%20RAT-Check/ws/deltaspike/modules/jpa/api/target/deltaspike-jpa-module-api-1.5.3-SNAPSHOT.jar>
to org.apache.deltaspike.modules/deltaspike-jpa-module-api/1.5.3-SNAPSHOT/deltaspike-jpa-module-api-1.5.3-SNAPSHOT.jar
[JENKINS] Archiving <https://builds.apache.org/job/DeltaSpike%20RAT-Check/ws/deltaspike/modules/jpa/api/target/deltaspike-jpa-module-api-1.5.3-SNAPSHOT-tests.jar>
to org.apache.deltaspike.modules/deltaspike-jpa-module-api/1.5.3-SNAPSHOT/deltaspike-jpa-module-api-1.5.3-SNAPSHOT-tests.jar
[JENKINS] Archiving <https://builds.apache.org/job/DeltaSpike%20RAT-Check/ws/deltaspike/modules/jpa/api/target/deltaspike-jpa-module-api-1.5.3-SNAPSHOT-sources.jar>
to org.apache.deltaspike.modules/deltaspike-jpa-module-api/1.5.3-SNAPSHOT/deltaspike-jpa-module-api-1.5.3-SNAPSHOT-sources.jar
[JENKINS] Archiving <https://builds.apache.org/job/DeltaSpike%20RAT-Check/ws/deltaspike/modules/servlet/api/pom.xml>
to org.apache.deltaspike.modules/deltaspike-servlet-module-api/1.5.3-SNAPSHOT/deltaspike-servlet-module-api-1.5.3-SNAPSHOT.pom
[JENKINS] Archiving <https://builds.apache.org/job/DeltaSpike%20RAT-Check/ws/deltaspike/modules/servlet/api/target/deltaspike-servlet-module-api-1.5.3-SNAPSHOT.jar>
to org.apache.deltaspike.modules/deltaspike-servlet-module-api/1.5.3-SNAPSHOT/deltaspike-servlet-module-api-1.5.3-SNAPSHOT.jar
[JENKINS] Archiving <https://builds.apache.org/job/DeltaSpike%20RAT-Check/ws/deltaspike/modules/servlet/api/target/deltaspike-servlet-module-api-1.5.3-SNAPSHOT-tests.jar>
to org.apache.deltaspike.modules/deltaspike-servlet-module-api/1.5.3-SNAPSHOT/deltaspike-servlet-module-api-1.5.3-SNAPSHOT-tests.jar
[JENKINS] Archiving <https://builds.apache.org/job/DeltaSpike%20RAT-Check/ws/deltaspike/modules/servlet/api/target/deltaspike-servlet-module-api-1.5.3-SNAPSHOT-sources.jar>
to org.apache.deltaspike.modules/deltaspike-servlet-module-api/1.5.3-SNAPSHOT/deltaspike-servlet-module-api-1.5.3-SNAPSHOT-sources.jar
[JENKINS] Archiving <https://builds.apache.org/job/DeltaSpike%20RAT-Check/ws/deltaspike/modules/jpa/pom.xml>
to org.apache.deltaspike.modules/jpa-module-project/1.5.3-SNAPSHOT/jpa-module-project-1.5.3-SNAPSHOT.pom
[JENKINS] Archiving <https://builds.apache.org/job/DeltaSpike%20RAT-Check/ws/deltaspike/modules/jpa/target/jpa-module-project-1.5.3-SNAPSHOT-tests.jar>
to org.apache.deltaspike.modules/jpa-module-project/1.5.3-SNAPSHOT/jpa-module-project-1.5.3-SNAPSHOT-tests.jar
[JENKINS] Archiving <https://builds.apache.org/job/DeltaSpike%20RAT-Check/ws/deltaspike/cdictrl/pom.xml>
to org.apache.deltaspike.cdictrl/cdictrl-project/1.5.3-SNAPSHOT/cdictrl-project-1.5.3-SNAPSHOT.pom
[JENKINS] Archiving <https://builds.apache.org/job/DeltaSpike%20RAT-Check/ws/deltaspike/modules/scheduler/api/pom.xml>
to org.apache.deltaspike.modules/deltaspike-scheduler-module-api/1.5.3-SNAPSHOT/deltaspike-scheduler-module-api-1.5.3-SNAPSHOT.pom
[JENKINS] Archiving <https://builds.apache.org/job/DeltaSpike%20RAT-Check/ws/deltaspike/modules/test-control/impl/pom.xml>
to org.apache.deltaspike.modules/deltaspike-test-control-module-impl/1.5.3-SNAPSHOT/deltaspike-test-control-module-impl-1.5.3-SNAPSHOT.pom
[JENKINS] Archiving <https://builds.apache.org/job/DeltaSpike%20RAT-Check/ws/deltaspike/modules/servlet/pom.xml>
to org.apache.deltaspike.modules/servlet-module-project/1.5.3-SNAPSHOT/servlet-module-project-1.5.3-SNAPSHOT.pom
[JENKINS] Archiving <https://builds.apache.org/job/DeltaSpike%20RAT-Check/ws/deltaspike/modules/servlet/target/servlet-module-project-1.5.3-SNAPSHOT-tests.jar>
to org.apache.deltaspike.modules/servlet-module-project/1.5.3-SNAPSHOT/servlet-module-project-1.5.3-SNAPSHOT-tests.jar
[JENKINS] Archiving <https://builds.apache.org/job/DeltaSpike%20RAT-Check/ws/deltaspike/modules/test-control/api/pom.xml>
to org.apache.deltaspike.modules/deltaspike-test-control-module-api/1.5.3-SNAPSHOT/deltaspike-test-control-module-api-1.5.3-SNAPSHOT.pom
[JENKINS] Archiving <https://builds.apache.org/job/DeltaSpike%20RAT-Check/ws/deltaspike/modules/jsf/impl-ee6/pom.xml>
to org.apache.deltaspike.modules/deltaspike-jsf-module-impl-ee6/1.5.3-SNAPSHOT/deltaspike-jsf-module-impl-ee6-1.5.3-SNAPSHOT.pom
[JENKINS] Archiving <https://builds.apache.org/job/DeltaSpike%20RAT-Check/ws/deltaspike/modules/jsf/impl-ee6/target/deltaspike-jsf-module-impl-ee6-1.5.3-SNAPSHOT.jar>
to org.apache.deltaspike.modules/deltaspike-jsf-module-impl-ee6/1.5.3-SNAPSHOT/deltaspike-jsf-module-impl-ee6-1.5.3-SNAPSHOT.jar
[JENKINS] Archiving <https://builds.apache.org/job/DeltaSpike%20RAT-Check/ws/deltaspike/modules/jsf/impl-ee6/target/deltaspike-jsf-module-impl-ee6-1.5.3-SNAPSHOT-tests.jar>
to org.apache.deltaspike.modules/deltaspike-jsf-module-impl-ee6/1.5.3-SNAPSHOT/deltaspike-jsf-module-impl-ee6-1.5.3-SNAPSHOT-tests.jar
[JENKINS] Archiving <https://builds.apache.org/job/DeltaSpike%20RAT-Check/ws/deltaspike/modules/jsf/impl-ee6/target/deltaspike-jsf-module-impl-ee6-1.5.3-SNAPSHOT-sources.jar>
to org.apache.deltaspike.modules/deltaspike-jsf-module-impl-ee6/1.5.3-SNAPSHOT/deltaspike-jsf-module-impl-ee6-1.5.3-SNAPSHOT-sources.jar
[JENKINS] Archiving <https://builds.apache.org/job/DeltaSpike%20RAT-Check/ws/deltaspike/modules/proxy/pom.xml>
to org.apache.deltaspike.modules/proxy-module-project/1.5.3-SNAPSHOT/proxy-module-project-1.5.3-SNAPSHOT.pom
[JENKINS] Archiving <https://builds.apache.org/job/DeltaSpike%20RAT-Check/ws/deltaspike/modules/proxy/target/proxy-module-project-1.5.3-SNAPSHOT-tests.jar>
to org.apache.deltaspike.modules/proxy-module-project/1.5.3-SNAPSHOT/proxy-module-project-1.5.3-SNAPSHOT-tests.jar
[JENKINS] Archiving <https://builds.apache.org/job/DeltaSpike%20RAT-Check/ws/deltaspike/modules/partial-bean/api/pom.xml>
to org.apache.deltaspike.modules/deltaspike-partial-bean-module-api/1.5.3-SNAPSHOT/deltaspike-partial-bean-module-api-1.5.3-SNAPSHOT.pom
[JENKINS] Archiving <https://builds.apache.org/job/DeltaSpike%20RAT-Check/ws/deltaspike/modules/partial-bean/api/target/deltaspike-partial-bean-module-api-1.5.3-SNAPSHOT.jar>
to org.apache.deltaspike.modules/deltaspike-partial-bean-module-api/1.5.3-SNAPSHOT/deltaspike-partial-bean-module-api-1.5.3-SNAPSHOT.jar
[JENKINS] Archiving <https://builds.apache.org/job/DeltaSpike%20RAT-Check/ws/deltaspike/modules/partial-bean/api/target/deltaspike-partial-bean-module-api-1.5.3-SNAPSHOT-tests.jar>
to org.apache.deltaspike.modules/deltaspike-partial-bean-module-api/1.5.3-SNAPSHOT/deltaspike-partial-bean-module-api-1.5.3-SNAPSHOT-tests.jar
[JENKINS] Archiving <https://builds.apache.org/job/DeltaSpike%20RAT-Check/ws/deltaspike/modules/partial-bean/api/target/deltaspike-partial-bean-module-api-1.5.3-SNAPSHOT-sources.jar>
to org.apache.deltaspike.modules/deltaspike-partial-bean-module-api/1.5.3-SNAPSHOT/deltaspike-partial-bean-module-api-1.5.3-SNAPSHOT-sources.jar
[JENKINS] Archiving <https://builds.apache.org/job/DeltaSpike%20RAT-Check/ws/deltaspike/modules/scheduler/impl/pom.xml>
to org.apache.deltaspike.modules/deltaspike-scheduler-module-impl/1.5.3-SNAPSHOT/deltaspike-scheduler-module-impl-1.5.3-SNAPSHOT.pom
[JENKINS] Archiving <https://builds.apache.org/job/DeltaSpike%20RAT-Check/ws/deltaspike/parent/pom.xml>
to org.apache.deltaspike/parent/1.5.3-SNAPSHOT/parent-1.5.3-SNAPSHOT.pom
Compressed 39.91 KB of artifacts by 80.2% relative to #2530
[JENKINS] Archiving <https://builds.apache.org/job/DeltaSpike%20RAT-Check/ws/deltaspike/core/pom.xml>
to org.apache.deltaspike.core/core-project/1.5.3-SNAPSHOT/core-project-1.5.3-SNAPSHOT.pom
[JENKINS] Archiving <https://builds.apache.org/job/DeltaSpike%20RAT-Check/ws/deltaspike/core/target/core-project-1.5.3-SNAPSHOT-tests.jar>
to org.apache.deltaspike.core/core-project/1.5.3-SNAPSHOT/core-project-1.5.3-SNAPSHOT-tests.jar
[JENKINS] Archiving <https://builds.apache.org/job/DeltaSpike%20RAT-Check/ws/deltaspike/modules/bean-validation/api/pom.xml>
to org.apache.deltaspike.modules/deltaspike-bean-validation-module-api/1.5.3-SNAPSHOT/deltaspike-bean-validation-module-api-1.5.3-SNAPSHOT.pom
[JENKINS] Archiving <https://builds.apache.org/job/DeltaSpike%20RAT-Check/ws/deltaspike/modules/bean-validation/api/target/deltaspike-bean-validation-module-api-1.5.3-SNAPSHOT.jar>
to org.apache.deltaspike.modules/deltaspike-bean-validation-module-api/1.5.3-SNAPSHOT/deltaspike-bean-validation-module-api-1.5.3-SNAPSHOT.jar
[JENKINS] Archiving <https://builds.apache.org/job/DeltaSpike%20RAT-Check/ws/deltaspike/modules/bean-validation/api/target/deltaspike-bean-validation-module-api-1.5.3-SNAPSHOT-tests.jar>
to org.apache.deltaspike.modules/deltaspike-bean-validation-module-api/1.5.3-SNAPSHOT/deltaspike-bean-validation-module-api-1.5.3-SNAPSHOT-tests.jar
[JENKINS] Archiving <https://builds.apache.org/job/DeltaSpike%20RAT-Check/ws/deltaspike/modules/bean-validation/api/target/deltaspike-bean-validation-module-api-1.5.3-SNAPSHOT-sources.jar>
to org.apache.deltaspike.modules/deltaspike-bean-validation-module-api/1.5.3-SNAPSHOT/deltaspike-bean-validation-module-api-1.5.3-SNAPSHOT-sources.jar
[JENKINS] Archiving <https://builds.apache.org/job/DeltaSpike%20RAT-Check/ws/deltaspike/core/api/pom.xml>
to org.apache.deltaspike.core/deltaspike-core-api/1.5.3-SNAPSHOT/deltaspike-core-api-1.5.3-SNAPSHOT.pom
[JENKINS] Archiving <https://builds.apache.org/job/DeltaSpike%20RAT-Check/ws/deltaspike/core/api/target/deltaspike-core-api-1.5.3-SNAPSHOT.jar>
to org.apache.deltaspike.core/deltaspike-core-api/1.5.3-SNAPSHOT/deltaspike-core-api-1.5.3-SNAPSHOT.jar
[JENKINS] Archiving <https://builds.apache.org/job/DeltaSpike%20RAT-Check/ws/deltaspike/core/api/target/deltaspike-core-api-1.5.3-SNAPSHOT-tests.jar>
to org.apache.deltaspike.core/deltaspike-core-api/1.5.3-SNAPSHOT/deltaspike-core-api-1.5.3-SNAPSHOT-tests.jar
[JENKINS] Archiving <https://builds.apache.org/job/DeltaSpike%20RAT-Check/ws/deltaspike/core/api/target/deltaspike-core-api-1.5.3-SNAPSHOT-sources.jar>
to org.apache.deltaspike.core/deltaspike-core-api/1.5.3-SNAPSHOT/deltaspike-core-api-1.5.3-SNAPSHOT-sources.jar
[JENKINS] Archiving <https://builds.apache.org/job/DeltaSpike%20RAT-Check/ws/deltaspike/modules/security/impl/pom.xml>
to org.apache.deltaspike.modules/deltaspike-security-module-impl/1.5.3-SNAPSHOT/deltaspike-security-module-impl-1.5.3-SNAPSHOT.pom
[JENKINS] Archiving <https://builds.apache.org/job/DeltaSpike%20RAT-Check/ws/deltaspike/modules/security/impl/target/deltaspike-security-module-impl-1.5.3-SNAPSHOT.jar>
to org.apache.deltaspike.modules/deltaspike-security-module-impl/1.5.3-SNAPSHOT/deltaspike-security-module-impl-1.5.3-SNAPSHOT.jar
[JENKINS] Archiving <https://builds.apache.org/job/DeltaSpike%20RAT-Check/ws/deltaspike/modules/security/impl/target/deltaspike-security-module-impl-1.5.3-SNAPSHOT-tests.jar>
to org.apache.deltaspike.modules/deltaspike-security-module-impl/1.5.3-SNAPSHOT/deltaspike-security-module-impl-1.5.3-SNAPSHOT-tests.jar
[JENKINS] Archiving <https://builds.apache.org/job/DeltaSpike%20RAT-Check/ws/deltaspike/modules/security/impl/target/deltaspike-security-module-impl-1.5.3-SNAPSHOT-sources.jar>
to org.apache.deltaspike.modules/deltaspike-security-module-impl/1.5.3-SNAPSHOT/deltaspike-security-module-impl-1.5.3-SNAPSHOT-sources.jar
[JENKINS] Archiving <https://builds.apache.org/job/DeltaSpike%20RAT-Check/ws/deltaspike/modules/scheduler/pom.xml>
to org.apache.deltaspike.modules/scheduler-module-project/1.5.3-SNAPSHOT/scheduler-module-project-1.5.3-SNAPSHOT.pom
[JENKINS] Archiving <https://builds.apache.org/job/DeltaSpike%20RAT-Check/ws/site/pom.xml>
to org.apache.deltaspike/deltaspike-site/1.5.3-SNAPSHOT/deltaspike-site-1.5.3-SNAPSHOT.pom
[JENKINS] Archiving <https://builds.apache.org/job/DeltaSpike%20RAT-Check/ws/deltaspike/modules/proxy/impl-asm5/pom.xml>
to org.apache.deltaspike.modules/deltaspike-proxy-module-impl-asm5/1.5.3-SNAPSHOT/deltaspike-proxy-module-impl-asm5-1.5.3-SNAPSHOT.pom
[JENKINS] Archiving <https://builds.apache.org/job/DeltaSpike%20RAT-Check/ws/deltaspike/modules/proxy/impl-asm5/target/deltaspike-proxy-module-impl-asm5-1.5.3-SNAPSHOT.jar>
to org.apache.deltaspike.modules/deltaspike-proxy-module-impl-asm5/1.5.3-SNAPSHOT/deltaspike-proxy-module-impl-asm5-1.5.3-SNAPSHOT.jar
[JENKINS] Archiving <https://builds.apache.org/job/DeltaSpike%20RAT-Check/ws/deltaspike/modules/proxy/impl-asm5/target/deltaspike-proxy-module-impl-asm5-1.5.3-SNAPSHOT-tests.jar>
to org.apache.deltaspike.modules/deltaspike-proxy-module-impl-asm5/1.5.3-SNAPSHOT/deltaspike-proxy-module-impl-asm5-1.5.3-SNAPSHOT-tests.jar
[JENKINS] Archiving <https://builds.apache.org/job/DeltaSpike%20RAT-Check/ws/deltaspike/modules/proxy/impl-asm5/target/deltaspike-proxy-module-impl-asm5-1.5.3-SNAPSHOT-sources.jar>
to org.apache.deltaspike.modules/deltaspike-proxy-module-impl-asm5/1.5.3-SNAPSHOT/deltaspike-proxy-module-impl-asm5-1.5.3-SNAPSHOT-sources.jar
[JENKINS] Archiving <https://builds.apache.org/job/DeltaSpike%20RAT-Check/ws/deltaspike/examples/jsf-playground/pom.xml>
to org.apache.deltaspike.examples/deltaspike-jsf-playground/1.5.3-SNAPSHOT/deltaspike-jsf-playground-1.5.3-SNAPSHOT.pom
[JENKINS] Archiving <https://builds.apache.org/job/DeltaSpike%20RAT-Check/ws/deltaspike/modules/servlet/impl/pom.xml>
to org.apache.deltaspike.modules/deltaspike-servlet-module-impl/1.5.3-SNAPSHOT/deltaspike-servlet-module-impl-1.5.3-SNAPSHOT.pom
[JENKINS] Archiving <https://builds.apache.org/job/DeltaSpike%20RAT-Check/ws/deltaspike/modules/servlet/impl/target/deltaspike-servlet-module-impl-1.5.3-SNAPSHOT.jar>
to org.apache.deltaspike.modules/deltaspike-servlet-module-impl/1.5.3-SNAPSHOT/deltaspike-servlet-module-impl-1.5.3-SNAPSHOT.jar
[JENKINS] Archiving <https://builds.apache.org/job/DeltaSpike%20RAT-Check/ws/deltaspike/modules/servlet/impl/target/deltaspike-servlet-module-impl-1.5.3-SNAPSHOT-tests.jar>
to org.apache.deltaspike.modules/deltaspike-servlet-module-impl/1.5.3-SNAPSHOT/deltaspike-servlet-module-impl-1.5.3-SNAPSHOT-tests.jar
[JENKINS] Archiving <https://builds.apache.org/job/DeltaSpike%20RAT-Check/ws/deltaspike/modules/servlet/impl/target/deltaspike-servlet-module-impl-1.5.3-SNAPSHOT-sources.jar>
to org.apache.deltaspike.modules/deltaspike-servlet-module-impl/1.5.3-SNAPSHOT/deltaspike-servlet-module-impl-1.5.3-SNAPSHOT-sources.jar
[JENKINS] Archiving <https://builds.apache.org/job/DeltaSpike%20RAT-Check/ws/deltaspike/modules/bean-validation/impl/pom.xml>
to org.apache.deltaspike.modules/deltaspike-bean-validation-module-impl/1.5.3-SNAPSHOT/deltaspike-bean-validation-module-impl-1.5.3-SNAPSHOT.pom
[JENKINS] Archiving <https://builds.apache.org/job/DeltaSpike%20RAT-Check/ws/deltaspike/modules/bean-validation/impl/target/deltaspike-bean-validation-module-impl-1.5.3-SNAPSHOT.jar>
to org.apache.deltaspike.modules/deltaspike-bean-validation-module-impl/1.5.3-SNAPSHOT/deltaspike-bean-validation-module-impl-1.5.3-SNAPSHOT.jar
[JENKINS] Archiving <https://builds.apache.org/job/DeltaSpike%20RAT-Check/ws/deltaspike/modules/bean-validation/impl/target/deltaspike-bean-validation-module-impl-1.5.3-SNAPSHOT-tests.jar>
to org.apache.deltaspike.modules/deltaspike-bean-validation-module-impl/1.5.3-SNAPSHOT/deltaspike-bean-validation-module-impl-1.5.3-SNAPSHOT-tests.jar
[JENKINS] Archiving <https://builds.apache.org/job/DeltaSpike%20RAT-Check/ws/deltaspike/modules/bean-validation/impl/target/deltaspike-bean-validation-module-impl-1.5.3-SNAPSHOT-sources.jar>
to org.apache.deltaspike.modules/deltaspike-bean-validation-module-impl/1.5.3-SNAPSHOT/deltaspike-bean-validation-module-impl-1.5.3-SNAPSHOT-sources.jar
[JENKINS] Archiving <https://builds.apache.org/job/DeltaSpike%20RAT-Check/ws/deltaspike/modules/data/test-ee7/pom.xml>
to org.apache.deltaspike.modules/deltaspike-data-module-test-ee7/1.5.3-SNAPSHOT/deltaspike-data-module-test-ee7-1.5.3-SNAPSHOT.pom
[JENKINS] Archiving <https://builds.apache.org/job/DeltaSpike%20RAT-Check/ws/deltaspike/cdictrl/impl-owb/pom.xml>
to org.apache.deltaspike.cdictrl/deltaspike-cdictrl-owb/1.5.3-SNAPSHOT/deltaspike-cdictrl-owb-1.5.3-SNAPSHOT.pom
[JENKINS] Archiving <https://builds.apache.org/job/DeltaSpike%20RAT-Check/ws/deltaspike/cdictrl/impl-owb/target/deltaspike-cdictrl-owb-1.5.3-SNAPSHOT.jar>
to org.apache.deltaspike.cdictrl/deltaspike-cdictrl-owb/1.5.3-SNAPSHOT/deltaspike-cdictrl-owb-1.5.3-SNAPSHOT.jar
[JENKINS] Archiving <https://builds.apache.org/job/DeltaSpike%20RAT-Check/ws/deltaspike/cdictrl/impl-owb/target/deltaspike-cdictrl-owb-1.5.3-SNAPSHOT-sources.jar>
to org.apache.deltaspike.cdictrl/deltaspike-cdictrl-owb/1.5.3-SNAPSHOT/deltaspike-cdictrl-owb-1.5.3-SNAPSHOT-sources.jar
[JENKINS] Archiving <https://builds.apache.org/job/DeltaSpike%20RAT-Check/ws/pom.xml>
to org.apache.deltaspike/deltaspike/1.5.3-SNAPSHOT/deltaspike-1.5.3-SNAPSHOT.pom
[JENKINS] Archiving <https://builds.apache.org/job/DeltaSpike%20RAT-Check/ws/deltaspike/modules/jpa/impl/pom.xml>
to org.apache.deltaspike.modules/deltaspike-jpa-module-impl/1.5.3-SNAPSHOT/deltaspike-jpa-module-impl-1.5.3-SNAPSHOT.pom
[JENKINS] Archiving <https://builds.apache.org/job/DeltaSpike%20RAT-Check/ws/deltaspike/modules/jpa/impl/target/deltaspike-jpa-module-impl-1.5.3-SNAPSHOT.jar>
to org.apache.deltaspike.modules/deltaspike-jpa-module-impl/1.5.3-SNAPSHOT/deltaspike-jpa-module-impl-1.5.3-SNAPSHOT.jar
[JENKINS] Archiving <https://builds.apache.org/job/DeltaSpike%20RAT-Check/ws/deltaspike/modules/jpa/impl/target/deltaspike-jpa-module-impl-1.5.3-SNAPSHOT-tests.jar>
to org.apache.deltaspike.modules/deltaspike-jpa-module-impl/1.5.3-SNAPSHOT/deltaspike-jpa-module-impl-1.5.3-SNAPSHOT-tests.jar
[JENKINS] Archiving <https://builds.apache.org/job/DeltaSpike%20RAT-Check/ws/deltaspike/modules/jpa/impl/target/deltaspike-jpa-module-impl-1.5.3-SNAPSHOT-sources.jar>
to org.apache.deltaspike.modules/deltaspike-jpa-module-impl/1.5.3-SNAPSHOT/deltaspike-jpa-module-impl-1.5.3-SNAPSHOT-sources.jar
[JENKINS] Archiving <https://builds.apache.org/job/DeltaSpike%20RAT-Check/ws/deltaspike/modules/data/pom.xml>
to org.apache.deltaspike.modules/data-module-project/1.5.3-SNAPSHOT/data-module-project-1.5.3-SNAPSHOT.pom
[JENKINS] Archiving <https://builds.apache.org/job/DeltaSpike%20RAT-Check/ws/deltaspike/modules/data/target/data-module-project-1.5.3-SNAPSHOT-tests.jar>
to org.apache.deltaspike.modules/data-module-project/1.5.3-SNAPSHOT/data-module-project-1.5.3-SNAPSHOT-tests.jar
[JENKINS] Archiving <https://builds.apache.org/job/DeltaSpike%20RAT-Check/ws/deltaspike/examples/security-requested-page-after-login-picketlink/pom.xml>
to org.apache.deltaspike.examples/deltaspike-security-requested-page-after-login-picketlink/1.5.3-SNAPSHOT/deltaspike-security-requested-page-after-login-picketlink-1.5.3-SNAPSHOT.pom
[JENKINS] Archiving <https://builds.apache.org/job/DeltaSpike%20RAT-Check/ws/deltaspike/pom.xml>
to org.apache.deltaspike/deltaspike-project/1.5.3-SNAPSHOT/deltaspike-project-1.5.3-SNAPSHOT.pom
[JENKINS] Archiving <https://builds.apache.org/job/DeltaSpike%20RAT-Check/ws/deltaspike/modules/security/api/pom.xml>
to org.apache.deltaspike.modules/deltaspike-security-module-api/1.5.3-SNAPSHOT/deltaspike-security-module-api-1.5.3-SNAPSHOT.pom
[JENKINS] Archiving <https://builds.apache.org/job/DeltaSpike%20RAT-Check/ws/deltaspike/modules/security/api/target/deltaspike-security-module-api-1.5.3-SNAPSHOT.jar>
to org.apache.deltaspike.modules/deltaspike-security-module-api/1.5.3-SNAPSHOT/deltaspike-security-module-api-1.5.3-SNAPSHOT.jar
[JENKINS] Archiving <https://builds.apache.org/job/DeltaSpike%20RAT-Check/ws/deltaspike/modules/security/api/target/deltaspike-security-module-api-1.5.3-SNAPSHOT-tests.jar>
to org.apache.deltaspike.modules/deltaspike-security-module-api/1.5.3-SNAPSHOT/deltaspike-security-module-api-1.5.3-SNAPSHOT-tests.jar
[JENKINS] Archiving <https://builds.apache.org/job/DeltaSpike%20RAT-Check/ws/deltaspike/modules/security/api/target/deltaspike-security-module-api-1.5.3-SNAPSHOT-sources.jar>
to org.apache.deltaspike.modules/deltaspike-security-module-api/1.5.3-SNAPSHOT/deltaspike-security-module-api-1.5.3-SNAPSHOT-sources.jar
Sending e-mails to: commits@deltaspike.apache.org
channel stopped

Mime
View raw message